##TITLE= Chromium(III) spectra
##JCAMP-DX= 4.24
##DATA TYPE= LINK
##BLOCKS= 11
##TITLE= Potassium Chrome Alum
##JCAMP-DX= 5.01
##DATA TYPE= UV/VIS SPECTRUM
##DATA CLASS= XYDATA
##ORIGIN= Chemistry Department, UWI, JAMAICA
##OWNER= Prof Robert J. Lancashire
##DATE= 02/07/10
##TIME= 09:26:13.00
##BLOCK_ID= 1
##RESOLUTION= 1.000000
##SPECTROMETER/DATA SYSTEM= PERKIN-ELMER LAMBDA 19 UV/VIS/NIR UV
##$MODELS=
<Models>
<ModelData id="alum" type="MOL">
"Cr(D2O)6"
RLRasMol  02069708023D
http://wwwchem.uwimona.edu.jm/
 19 18  0        0              1 V2000
    0.0000    0.0000    0.0000 Cr  0  0  0  0  0  0  0  0  0  0  0  0
    1.2680    0.4000   -1.5960 O   0  0  0  0  0  0  0  0  0  0  0  0
    0.0920   -2.3240   -0.5440 O   0  0  0  0  0  0  0  0  0  0  0  0
   -1.6400    0.2200   -1.2120 O   0  0  0  0  0  0  0  0  0  0  0  0
    0.8480    0.6560   -2.4400 H   0  0  0  0  0  0  0  0  0  0  0  0
    2.0600    0.9560   -1.4600 H   0  0  0  0  0  0  0  0  0  0  0  0
   -0.2000   -2.9560    0.1240 H   0  0  0  0  0  0  0  0  0  0  0  0
    0.9800   -2.6080   -0.8080 H   0  0  0  0  0  0  0  0  0  0  0  0
   -2.1840   -0.5800   -1.2880 H   0  0  0  0  0  0  0  0  0  0  0  0
   -2.2560    0.9680   -1.0400 H   0  0  0  0  0  0  0  0  0  0  0  0
   -1.2680   -0.4000    1.5960 O   0  0  0  0  0  0  0  0  0  0  0  0
   -0.0920    2.3240    0.5440 O   0  0  0  0  0  0  0  0  0  0  0  0
    1.6400   -0.2200    1.2120 O   0  0  0  0  0  0  0  0  0  0  0  0
   -0.8480   -0.6560    2.4400 H   0  0  0  0  0  0  0  0  0  0  0  0
   -2.0600   -0.9560    1.4600 H   0  0  0  0  0  0  0  0  0  0  0  0
    0.2000    2.9560   -0.1240 H   0  0  0  0  0  0  0  0  0  0  0  0
   -0.9800    2.6080    0.8080 H   0  0  0  0  0  0  0  0  0  0  0  0
    2.1840    0.5800    1.2880 H   0  0  0  0  0  0  0  0  0  0  0  0
    2.2560   -0.9680    1.0400 H   0  0  0  0  0  0  0  0  0  0  0  0
 19 13  1  0
 18 13  1  0
 17 12  1  0
 16 12  1  0
 15 11  1  0
 14 11  1  0
 13  1  1  0
 12  1  1  0
 11  1  1  0
 10  4  1  0
  9  4  1  0
  8  3  1  0
  7  3  1  0
  6  2  1  0
  5  2  1  0
  4  1  1  0
  3  1  1  0
  2  1  1  0
M  END
</ModelData>
</Models>
##$PEAKS=
<Peaks type="UV-Vis" xUnitsExpected="nm"  >
<PeakData id="1" title="Spin Forbidden Band ~672nm" peakShape="singlet" model="alum" xMax="680" xMin="650"    />
<PeakData id="2" title="Spin Allowed - delta ~574nm" peakShape="singlet" model="alum" xMax="600" xMin="540"    />
<PeakData id="3" title="Spin Allowed ~ 406nm" peakShape="singlet" model="alum" xMax="440" xMin="380"    />
</Peaks>
##XUNITS= NANOMETERS
##YUNITS= ABSORBANCE
##XFACTOR= 3.8E-4
##YFACTOR= 5.08327007E-7
##FIRSTX= 320
##FIRSTY= 0.2430681
##LASTX= 700
##NPOINTS= 381
##XYDATA= (X++(Y..Y))
$$ plain form
842105 478173 470843 463949 457507 451514 445912 440681 435832 431317 427152 423318 419801 416580 413647 410992 408621
884211 406551 404797 403402 402342 401625 401261 401255 401619 402339 403433 404917 406786 409044 411751 414975 418809 423336 428616
931579 434687 441533 449105 457393 466405 476117 486504 497554 509288 521707 534798 548572 563088 578372
968421 594377 611010 628155 645734 663632 681772 700177 718894 737968 757377 777022 796786 816565
1002632 836161 855479 874484 893158 911530 929583 947256 964525 981309 997486 1013007 1027803 1041814
1036842 1055032 1067390 1078827 1089338 1098899 1107480 1115089 1121697 1127273 1131831 1135342 1137809 1139237 1139682 1139168
1076316 1137754 1135456 1132299 1128313 1123501 1117838 1111318 1103947 1095712 1086631 1076732 1066052 1054636 1042536 1029782
1115789 1016436 1002520 988055 973084 957626 941734 925450 908824 891863 874612 857086 839338 821406
$$ packed form
842105D78173p330o894o442n993n602n231m849m515m165l834l517l221k933k655D08621
884211D06551j754j395j060p17l64oL64P20J094J484J869K258K707L224L834M527D28616
931579D34687O846P572Q288R012R712J0387J1050J1734J2419J3091J3774J4516E78372
968421E94377J6633J7145J7579J7898J8140J8405J8717J9074J9409J9645J9764H16565
1002632H36161J9318J9005J8674J8372J8053J7673J7269J6784J6177J5521J4796A041814
1036842A055032J2358J1437J0511R561Q581P609O608N576M558L511K467J428M45A139168
1076316A137754k298l157l986m812n663o520p371q235r081r899j0680j1416j2100A029782
1115789A016436j3916j4465j4971j5458j5892j6284j6626j6961j7251j7526j7748H21406
$$ plain form
1150000 803347 785256 767231 749366 731738 714460 697596 681203 665261 649769 634690 619993 605630
1184211 591582 577864 564440 551291 538378 525654 513069 500613 488282 476133 464272 452787 441798
1218421 431382 421599 412508 404132 396436 389387 382966 377127 371836 367037 362721 358893 355555 352665 350202 348162
1260526 346539 345331 344518 344086 344032 344338 344963 345878 347096 348624 350465 352598 355016 357717 360687 363921 367429 371218
1307895 375302 379661 384296 389189 394327 399699 405320 411202 417320 423682 430272 437087 444114 451330 458754 466395
1350000 474238 482288 490554 499041 507748 516664 525782 535100 544588 554208 563946 573788 583750 593834 604042 614360
1392105 624765 635251 645777 656326 666874 677438 687994 698527 709006 719417 729769 740032 750200
1426316 760282 770266 780138 789881 799479 808922 818198 827269 836108 844706 853034 861095 868888 876406 883656 890618
$$ packed form
1150000H03347j8091j8025j7865j7628j7278j6864j6393j5942j5492j5079j4697F05630
1184211E91582j3718j3424j3149j2913j2724j2585j2456j2331j2149j1861j1485D41798
1218421D31382r783r091q376p696p049o421n839n291m799m316l828l338k890k463C48162
1260526C46539j208q13m32n4L06O25R15J218J528J841K133K418K701K970L234L508C71218
1307895C75302M359M635M893N138N372N621N882O118O362O590O815P027P216P424D66395
1350000D74238Q050Q266Q487Q707Q916R118R318R488R620R738R842R962J0084J0208F14360
1392105F24765J0486J0526J0549J0548J0564J0556J0533J0479J0411J0352J0263G50200
1426316G60282R984R872R743R598R443R276R071Q839Q598Q328Q061P793P518P250H90618
$$ plain form
1468421 897257 903548 909480 915031 920180 924919 929264 933236 936814 939974 942718 945051 946979 948478 949574 950300
1510526 950648 950599 950129 949259 947994 946355 944347 942002 939328 936315 932957 929240 925178 920775 916046 910994 905647
1555263 899994 894035 887753 881147 874201 866922 859315 851383 843162 834652 825878 816844 807571 798059 788306 778294
1597368 768043 757570 746874 735997 724990 713928 702859 691844 680924 670110 659391 648730 638091
1631579 627451 616839 606261 595803 585474 575293 565280 555483 545893 536523 527428 518623 510066 501630
1668421 493153 484482 475493 466084 456260 446095 435737 425331 415048 405025 395360 386129 377340 368934 360823
1707895 352938 345229 337663 330280 323129 316257 309700 303445 297433 291616 285936 280323 274857 269663 265005 261184
1750000 258387 256579 255495 254637 253378 251207 247874 243475 238301 232724 227086 221641 216479 211543 206772 202165
$$ packed form
1468421H97257O291N932N551N149M739M345L972L578L160K744K333J928J499J096I50300
1510526I50648m9m70q70j265j639k008k345k674l013l358l717m062m403m729n052I05647
1555263H99994n959o282o606o946p279p607p932q221q510q774r034r273r512r753G78294
1597368G68043j0473j0696j0877j1007j1062j1069j1015j0920j0814j0719j0661F38091
1631579F27451j0612j0578j0458j0329j0181j0013r797r590r370r095q805q557E01630
1668421D93153q671q989r409r824j0165j0358j0406j0283j0023r665r231q789q406C60823
1707895C52938p709p566p383p151o872o557o255o012n817n680n613n466n194m658B61184
1750000B58387j808j084q58j259k171l333m399n174n577n638n445n162m936m771B02165
$$ plain form
1792105 197719 193397 189195 185123 181202 177457 173892 170528 167382 164424 161589 158858 156203 153618 151113 148678
1834211 146323 144043 141838
$$ packed form
1792105A97719m322m202m072l921l745l565l364l146k958k835k731k655k585k505A48678
1834211A46323k280A41838
1842105A39682  $$checkpoint
##END=
##TITLE= [Cr(H2O)4Cl2]Cl
##JCAMP-DX= 4.24
##DATA TYPE= UV/VIS SPECTRUM
##DATA CLASS= XYDATA
##ORIGIN= Chemistry Department, UWI, JAMAICA
##OWNER= Prof Robert J. Lancashire
##DATE= 02/07/10
##TIME= 09:40:24.00
##BLOCK_ID= 2
##RESOLUTION= 1.000000
##SPECTROMETER/DATA SYSTEM= PERKIN-ELMER LAMBDA 19 UV/VIS/NIR UV
##$MODELS=
<Models>
<ModelData id="cl2aq" type="MOL">
[CrCl2(H2O)4]+
  ACD/Labs1009020949  

 15 14  0  0  0  0  0  0  0  0  2 V2000
   10.6907   -9.5000    0.0000 Cr  0  0  0  0  0  0  0  0  0  0  0  0
   11.9587   -9.1000   -1.5960 O   0  3  0  0  0  0  0  0  0  0  0  0
   10.7827  -11.8240   -0.5440 Cl  0  0  0  0  0  0  0  0  0  0  0  0
    9.0507   -9.2800   -1.2120 O   0  3  0  0  0  0  0  0  0  0  0  0
   11.5387   -8.8440   -2.4400 H   0  0  0  0  0  0  0  0  0  0  0  0
   12.7507   -8.5440   -1.4600 H   0  0  0  0  0  0  0  0  0  0  0  0
    8.5067  -10.0800   -1.2880 H   0  0  0  0  0  0  0  0  0  0  0  0
    8.4347   -8.5320   -1.0400 H   0  0  0  0  0  0  0  0  0  0  0  0
    9.4227   -9.9000    1.5960 O   0  3  0  0  0  0  0  0  0  0  0  0
   10.5987   -7.1760    0.5440 Cl  0  0  0  0  0  0  0  0  0  0  0  0
   12.3307   -9.7200    1.2120 O   0  3  0  0  0  0  0  0  0  0  0  0
    9.8427  -10.1560    2.4400 H   0  0  0  0  0  0  0  0  0  0  0  0
    8.6307  -10.4560    1.4600 H   0  0  0  0  0  0  0  0  0  0  0  0
   12.8747   -8.9200    1.2880 H   0  0  0  0  0  0  0  0  0  0  0  0
   12.9467  -10.4680    1.0400 H   0  0  0  0  0  0  0  0  0  0  0  0
 15 11  1  0  0  0  0
 14 11  1  0  0  0  0
 13  9  1  0  0  0  0
 12  9  1  0  0  0  0
 11  1  1  0  0  0  0
 10  1  1  0  0  0  0
  9  1  1  0  0  0  0
  8  4  1  0  0  0  0
  7  4  1  0  0  0  0
  6  2  1  0  0  0  0
  5  2  1  0  0  0  0
  4  1  1  0  0  0  0
  3  1  1  0  0  0  0
  2  1  1  0  0  0  0
M  CHG  4   2   1   4   1   9   1  11   1
M  END
</ModelData>
</Models>
##$PEAKS=
<Peaks type="UV-Vis" xUnitsExpected="nm"  >
<PeakData id="1" title="Spin Forbidden Band ~693nm" peakShape="singlet" model="cl2aq" xMax="700" xMin="680"    />
<PeakData id="2" title="Spin Allowed - delta ~635nm" peakShape="singlet" model="cl2aq" xMax="665" xMin="605"    />
<PeakData id="3" title="Spin Allowed ~ 445nm" peakShape="singlet" model="cl2aq" xMax="475" xMin="415"    />
</Peaks>
##XUNITS= NANOMETERS
##YUNITS= ABSORBANCE
##XFACTOR= 3.8E-4
##YFACTOR= 9.13411975E-7
##FIRSTX= 320
##FIRSTY= 0.041677
##LASTX= 700
##NPOINTS= 381
##XYDATA= (X++(Y..Y))
$$ plain form
842105 45628 39673 34445 29877 25902 22449 19447 16882 14722 12943 11505 10377 9514 8883 8428 8102 7899
886842 7825 7879 8054 8334 8711 9178 9702 10300 10987 11773 12661 13664 14782 16015 17366 18823 20422 22154 23997
936842 25966 28076 30338 32751 35317 38035 40942 44029 47293 50755 54430 58343 62483 66851 71431 76247
978947 81296 86574 92116 97972 104179 110743 117660 124917 132518 140419 148611 157122 165977 175202 184812 194806
1021053 205192 215960 227077 238552 250385 262572 275117 288023 301287 314897 328851 343122 357715
1055263 372607 387777 403232 418953 434929 451121 467522 484100 500839 517684 534597 551556 568519
1089474 585461 602346 619172 635905 652503 668895 685022 700851 716357 731513 746315 760763 774835
1123684 788489 801669 814326 826422 837915 848756 858921 868390 877162 885212 892544 899140 904977 910025
$$ packed form
842105D5628n955n228m568l975l453l002k565k160j779j438j128q63o31m55l26G899
886842G825N4J75K80L77M67N24N98O87P86Q88J003J118J233J351J457J599J732B3997
936842B5966K110K262K413K566K718K907L087L264L462L675L913M140M368M580G6247
978947H1296N278N542N856O207O564O917P257P601P901Q192Q511Q855R225R610A94806
1021053B05192J0768J1117J1475J1833J2187J2545J2906J3264J3610J3954J4271C57715
1055263C72607J5170J5455J5721J5976J6192J6401J6578J6739J6845J6913J6959E68519
1089474E85461J6885J6826J6733J6598J6392J6127J5829J5506J5156J4802J4448G74835
1123684G88489J3180J2657J2096J1493J0841J0165R469Q772Q050P332O596N837I10025
$$ plain form
1160526 914238 917601 920114 921782 922600 922598 921774 920130 917662 914353 910207 905242 899500 893030 885916 878226 870059
1205263 861496 852590 843393 833956 824338 814556 804626 794530 784217 773579 762474 750792 738450 725451
1242105 711811 697622 683003 668067 652865 637447 621833 606024 590033 573827 557411 540821 524087
1276316 507245 490381 473579 456915 440461 424283 408438 392973 377916 363291 349127 335431 322208
1310526 309462 297213 285459 274206 263455 253220 243501 234289 225574 217340 209571 202265 195412 189016 183073
1350000 177568 172495 167821 163533 159616 156062 152865 150021 147518 145346 143493 141940 140696 139744 139080 138691
1392105 138570 138705 139094 139737 140628 141772 143162 144799 146676 148787 151131 153701 156489 159498 162725 166177 169850
1436842 173750 177882 182258 186870 191716 196801 202124 207684 213490 219547 225855 232408 239196 246215 253464 260926
$$ packed form
1160526I14238L363K513J668Q18kq24j644k468l309m146m965n742o470p114p690H70059
1205263H61496q906r197r437r618r782r930j0096j0313j0638j1105j1682j2342G25451
1242105G11811j4189j4619j4936j5202j5418j5614j5809j5991j6206j6416j6590E24087
1276316E07245j6864j6802j6664j6454j6178j5845j5465j5057j4625j4164j3696C22208
1310526C09462j2249j1754j1253j0751j0235r719r212q715q234p769p306o853o396A83073
1350000A77568n073m674m288l917l554l197k844k503k172j853j553j244r52o64A38691
1392105A38570J35L89O43Q91J144J390J637J877K111K344K570K788L009L227L452A69850
1436842A73750M132M376M612M846N085N323N560N806O057O308O553O788P019P249B60926
$$ plain form
1478947 268603 276528 284701 293121 301784 310686 319835 329214 338801 348584 358583 368778 379163 389734 400503
1518421 411492 422690 434085 445660 457422 469345 481413 493617 505962 518467 531102 543855 556709
1552632 569643 582627 595647 608682 621736 634811 647886 660968 674046 687116 700166 713174 726117
1586842 738982 751755 764430 776998 789461 801819 814051 826110 837955 849560 860906 871988 882811
1621053 893366 903643 913624 923267 932530 941390 949811 957776 965250 972200 978596 984433 989664 994250 998190 1001477
1663158 1004097 1006025 1007262 1007825 1007742 1007031 1005760 1004041 1002001 999743 997380 995011 992699 990474 988336 986264 984208
1707895 982106 979824 977241 974230 970683 966521 961694 956173 949954 943035 935371 926907 917612 907456 896441 884613
1750000 872064 858939 845405 831613 817695 803765 789921 776276 762979 750249 738324 727438 717755
$$ packed form
1478947B68603P925Q173Q420Q663Q902R149R379R587R783R999J0195J0385J0571D00503
1518421D11492J1198J1395J1575J1762J1923J2068J2204J2345J2505J2635J2753E56709
1552632E69643J2984J3020J3035J3054J3075J3075J3082J3078J3070J3050J3008G26117
1586842G38982J2773J2675J2568J2463J2358J2232J2059J1845J1605J1346J1082H82811
1621053H93366J0277R981R643R263Q860Q421P965P474O950O396N837N231M586L940A001477
1663158A004097J928J237N63q3p11j271j719k040k258k363k369k312k225k138k072I84208
1707895I82106k282k583l011l547m162m827n521o219o919p664q464r295j0156j1015H84613
1750000H72064j3125j3534j3792j3918j3930j3844j3645j3297j2730j1925j0886G17755
$$ plain form
1784211 709312 702005 695585 689687 683902 677960 671737 665318 658940 652873 647256 641993 636738 630984 624300 616388
1826316 607194 596846 585566 573567 560999 547944
$$ packed form
1784211G09312p307o420n898n785n942o223o419o378o067n617n263n255n754o684F16388
1826316F07194j0348j1280j1999j2568E47944
1842105E34447  $$checkpoint
##END=
##TITLE= cis-[Cr(en)2Cl2]Cl
##JCAMP-DX= 5.0
##DATA TYPE= UV/VIS SPECTRUM
##DATA CLASS= XYDATA
##ORIGIN= Chemistry Department, UWI, JAMAICA
##OWNER= Prof Robert J. Lancashire
##DATE= 02/07/04
##TIME= 10:00:16.00
##BLOCK_ID= 3
##RESOLUTION= 1.000000
##SPECTROMETER/DATA SYSTEM= PERKIN-ELMER LAMBDA 19 UV/VIS/NIR UV
##$MODELS=
<Models>
<ModelData id="cisen" type="MOL">
cis-CrCl2(en)2 - CEAMCR
RLViewerPro         3D                             0

 27 28  0  0  0  0  0  0  0  0999 V2000
    1.3931    2.0626    3.2033 Cl  0  0  0  0  0  0  0  0  0  1
    1.8891    0.7331    0.1946 Cl  0  0  0  0  0  0  0  0  0  2
    4.7965   -0.6690    2.2868 C   0  0  0  0  0  0  0  0  0  6
   -0.1481   -1.5721    3.4981 C   0  0  0  0  0  0  0  0  0  7
    4.1564   -1.5667    1.2213 C   0  0  0  0  0  0  0  0  0  8
    0.5534   -1.0046    4.7327 C   0  0  0  0  0  0  0  0  0  9
    4.1644    1.2151    1.7084 H   0  0  0  0  0  0  0  0  0 10
    4.9004   -1.2076    3.2267 H   0  0  0  0  0  0  0  0  0 11
    4.1664    0.9704    3.3724 H   0  0  0  0  0  0  0  0  0 12
    5.8024   -0.3858    1.9320 H   0  0  0  0  0  0  0  0  0 13
   -0.6189    0.1774    2.5037 H   0  0  0  0  0  0  0  0  0 14
    0.3119   -2.5350    3.2222 H   0  0  0  0  0  0  0  0  0 15
   -0.2129   -1.0922    1.4782 H   0  0  0  0  0  0  0  0  0 16
   -1.2051   -1.7334    3.6961 H   0  0  0  0  0  0  0  0  0 17
    2.6711   -2.5157    2.3691 H   0  0  0  0  0  0  0  0  0 18
    4.1965   -1.0826    0.2814 H   0  0  0  0  0  0  0  0  0 19
    2.1843   -2.0765    0.8209 H   0  0  0  0  0  0  0  0  0 20
    4.6763   -2.5179    1.2190 H   0  0  0  0  0  0  0  0  0 21
    2.5312   -1.6276    4.3723 H   0  0  0  0  0  0  0  0  0 22
    0.0713   -0.0834    5.0664 H   0  0  0  0  0  0  0  0  0 23
    2.4218   -0.0609    4.9729 H   0  0  0  0  0  0  0  0  0 24
    0.5146   -1.7324    5.5691 H   0  0  0  0  0  0  0  0  0 25
    3.9704    0.5386    2.4503 N   0  0  0  0  0  0  0  0  0 26
    0.0312   -0.6391    2.3780 N   0  0  0  0  0  0  0  0  0 27
    2.7146   -1.7655    1.6328 N   0  0  0  0  0  0  0  0  0 28
    1.9912   -0.7545    4.3034 N   0  0  0  0  0  0  0  0  0 29
    1.9990    0.0000    2.3813 Cr  0  0  0  0  0  0  0  0  0 30
  1 27  1  0  0  0
  2 27  1  0  0  0
  3  5  1  0  0  0
  3  8  1  0  0  0
  3 10  1  0  0  0
  3 23  1  0  0  0
  4  6  1  0  0  0
  4 12  1  0  0  0
  4 14  1  0  0  0
  4 24  1  0  0  0
  5 16  1  0  0  0
  5 18  1  0  0  0
  5 25  1  0  0  0
  6 20  1  0  0  0
  6 22  1  0  0  0
  6 26  1  0  0  0
  7 23  1  0  0  0
  9 23  1  0  0  0
 11 24  1  0  0  0
 13 24  1  0  0  0
 15 25  1  0  0  0
 17 25  1  0  0  0
 19 26  1  0  0  0
 21 26  1  0  0  0
 23 27  1  0  0  0
 24 27  1  0  0  0
 25 27  1  0  0  0
 26 27  1  0  0  0
M  END
</ModelData>
</Models>
##$PEAKS=
<Peaks type="UV-Vis" xUnitsExpected="nm"  >
<PeakData id="1" title="Spin Allowed - delta ~520nm" peakShape="singlet" model="cisen"  xMax="560" xMin="480"    />
<PeakData id="2" title="Spin Allowed ~ 392nm" peakShape="singlet" model="cisen" xMax="430" xMin="370"    />
</Peaks>
##XUNITS= NANOMETERS
##YUNITS= ABSORBANCE
##XFACTOR= 6.5E-4
##YFACTOR= 6.83264136E-7
##FIRSTX= 350
##FIRSTY= 0.2514379
##LASTX= 1000
##NPOINTS= 651
##XYDATA= (X++(Y..Y))
$$ plain form
538462 367995 379328 391245 403617 416413 429556 443254 457203 471338 485567 499729 513771 527638
558462 541340 554828 568118 581182 594079 606629 618796 630516 641799 652247 662043 671180 679816 687687
580000 694897 701456 707374 712053 715872 718817 721033 722277 722772 722567 721747 719947 717554 714520 710917 706427 701190
606154 695255 688763 681505 673829 665792 657465 648755 639706 630316 620689 610714 600532 590217 579830 569513
629231 559222 548977 538856 528895 519050 509305 499631 490199 480949 471942 463213 454928 446998 439432 432142
652308 425302 418781 412608 406759 401375 396368 391838 387708 384238 381254 378742 376631 375050 373889 373184 372814
676923 373045 373797 375055 376724 379042 381841 385068 388592 392567 396877 401455 406290 411552 417130 423075 429311
701538 435922 442797 449860 457078 464425 471819 479295 486819 494532 502501 510681 519023 527732 536700 545916 555317
$$ packed form
538462C67995J1333J1917J2372J2796J3143J3698J3949J4135J4229J4162J4042E27638
558462E41340J3488J3290J3064J2897J2550J2167J1720J1283J0448R796R137Q636F87687
580000F94897O559N918M679L819K945K216J244M95k05q20j800k393l034l603m490G01190
606154F95255o492p258p676q037q327q710r049r390r627r975j0182j0315j0387E69513
629231E59222j0245j0121r961r845r745r674r432r250r007q729q285p930p566D32142
652308D25302o521o173n849n384n007m530m130l470k984k512k111j581j161p05C72814
676923C73045P52J258J669K318K799L227L524L975M310M578M835N262N578N945D29311
701538D35922O875P063P218P347P394P476P524P713P969Q180Q342Q709Q968R216E55317
$$ plain form
726154 565027 574970 585097 595360 605937 616675 627593 638677 649892 661166 672429 683607 694749
746154 705850 716979 728140 739295 750436 761474 772358 783103 793687 804079 814329 824359 834253
766154 844032 853695 863223 872600 881789 890841 899431 907690 915665 923379 930838 938112 945151 952024 958536 964791
790769 970727 976340 981512 986339 990797 995025 998874 1002437 1005696 1008660 1011183 1013364 1015155 1016619 1017504 1017993
815385 1018136 1017965 1017440 1016683 1015631 1014325 1012557 1010311 1007573 1004389 1000678 996613 992205 987580 982652 977446
840000 972003 966304 960119 953533 946505 939120 931251 923100 914747 906212 897447 888529 879389 869990 860082 849786
864615 839163 828377 817492 806562 795572 784455 773082 761499 749741 737936 726028 714004 701911
884615 689761 677541 665254 652909 640554 628220 615902 603669 591508 579429 567434 555493 543607
$$ packed form
726154E65027R943J0127J0263J0577J0738J0918J1084J1215J1274J1263J1178F94749
746154G05850J1129J1161J1155J1141J1038J0884J0745J0584J0392J0250J0030H34253
766154H44032R663R528R377R189R052Q590Q259P975P714P459P274P039O873O512I64791
790769I70727N613N172M827M458M228L849L563L259K964K523K181J791J464Q85A017993
815385A018136j71n25p57j052j306j768k246k738l184l711m065m408m625m928I77446
840000I72003n699o185o586p028p385p869q151q353q535q765q918r140r399r908H49786
864615H39163j0786j0885j0930j0990j1117j1373j1583j1758j1805j1908j2024G01911
884615F89761j2220j2287j2345j2355j2334j2318j2233j2161j2079j1995j1941E43607
$$ plain form
904615 531831 520104 508453 496868 485345 473931 462610 451405 440398 429522 418837 408306 397943
924615 387764 377740 367846 358163 348614 339238 329998 321027 312274 303684 295218 287010 278919 270954 263096 255431
949231 247949 240703 233711 227085 220619 214299 208085 202006 196104 190410 184886 179636 174608 169789 165144 160691
973846 156379 152190 148107 144259 140609 137134 133836 130727 127787 125000 122303 119711 117185 114711 112312 109950
998462 107646 105387 103151 101017 98896 96743 94567 92347 90108 87883 85705 83626 81582 79592 77676 75911
1023077 74236 72679 71211 69769 68327 66895 65492 64255 63170 62292 61571 60981 60472 60050 59715 59476 59214 58904
1050769 58528 58029 57471 56855 56194 55463 54670 53820 52929 52019 51077 50080 49063 48049 47023 46023 45059 44156 43314
1080000 42503 41701 40838 39907 38957 37984 37106 36384 35758 35203 34691 34110 33438 32708 32052 31495 31035 30666 30316 29889 29432
$$ packed form
904615E31831j1727j1651j1585j1523j1414j1321j1205j1007j0876j0685j0531C97943
924615C87764j0024r894r683r549r376r240q971q753q590q466q208q091p965p858B55431
949231B47949p246o992o626o466o320o214o079n902n694n524n250n028m819m645A60691
973846A56379m189m083l848l650l475l298l109k940k787k697k592k526k474k399A09950
998462A07646k259k236k134k121k153k176k220k239k225k178k079k044j990j916G5911
1023077G4236j557j468j442j442j432j403j237j085q78p21n90n09m22l35k39k62E8904
1050769E8528m99n58o16o61p31p93q50q91r10r42r97j017j014j026j000r64r03D3314
1080000D2503q02q63r31r50r73q78p22o26n55n12n81o72p30o56n57m60l69l50m27B9432
$$ plain form
1112308 29010 28692 28479 28345 28196 27955 27663 27351 27026 26727 26476 26257 26034 25899 25795 25697 25590 25485 25340 25219 25131
1144615 25052 24933 24819 24714 24591 24431 24288 24139 23966 23856 23846 23916 24058 24145 24137 24044 23825 23596 23398 23278 23273 23290 23366 23489
1181538 23569 23597 23534 23378 23162 22993 22934 22978 23249 23597 23839 23916 23824 23562 23208 22884 22763 22747 22789 22871 22953 22959 22982 23032 22982
1220000 22939 22887 22772 22662 22653 22725 22785 22801 22835 22770 22593 22502 22472 22412 22343 22337 22349 22318 22274 22261 22234 22245 22300 22444 22559 22596 22554 22349
1263077 22158 22081 22049 22215 22445 22660 22810 22775 22653 22473 22280 22239 22261 22303 22410 22507 22578 22655 22741 22703 22564 22332 22137 21928
1300000 21829 21885 22043 22346 22666 22811 22810 22497 22125 21908 21908 22233 22685 23072 23331 23288 23036 22807 22576 22354 22319 22313 22295 22208
1336923 22009 21955 21947 21936 22014 22006 21913 21840 21731 21753 21766 21614 21529 21419 21261 21359 21432 21538 21637 21580 21535 21415 21216 21266 21321 21431 21632
1378462 21628 21604 21551 21377 21294 21173 21004 20967 20910 20983 21089 21029 21024 20952 20778 20810 20822 20885 20970 20914 20909 20848 20698 20677 20591 20541 20561 20430
$$ packed form
1112308B9010l18k13j34j49k41k92l12l25k99k51k19k23j35j04r8j07j05j45j21B5131
1144615B5052j19j14j05j23j60j43j49j73j10j0P0J42Q7qr3k19k29j98j20nJ7P6B3489
1181538B3569K8o3j56k16j69n9M4K71L48K42P7r2k62l54l24j21j6M2Q2Q2OK3N0B2982
1220000B2939n2j15j10rP2O0J6L4o5j77r1l0o0o9oJ2l1m4j3k7J1N5J44J15L7m2B2349
1263077B2158p7l2J66K30K15J50l5j22j80j93m1K2M2J07R7P1P7Q6l8j39k32j95B1928
1300000B1829N6J58L03L20J45jl13l72k17%L25M52L87K59m3k52k29k31k22l5oj8B2208
1336923B2009n4qj1P8qr3p3j09K2J3j52q5j10j58R8P3J06R9n7m5j20j99N0N5J10B1632
1378462B1628k4n3j74q3j21j69l7n7P3J06o0np2j74L2J2O3Q5n6no1j50k1q6n0K0B0430
$$ plain form
1421538 20413 20478 20490 20528 20537 20462 20403 20224 20213 20304 20300 20291 20308 20131 20004 19840 19730 19729 19665 19625 19666 19515 19442 19340 19111 18991 18735
1463077 18460 18362 18170 18136 18210 18229 18419 18470 18524 18649 18604 18663 18794 18769 18881 18933 19015 19158 19158 19155 19100 18963 18994 19056 19145 19304 19312
1504615 19219 19122 19002 18915 18860 18801 18896 18978 19025 19129 19126 19115 19193 19180 19211 19177 19026 18913 18706 18510 18466 18368
$$ packed form
1421538B0413O5J2L8Rp5n9j79j1R1mrJ7j77j27j64j10jo4m0M1j51p3j02k29j20A8735
1463077A8460r8j92l4P4J9J90N1N4J25m5N9J31k5J12N2Q2J43%ln5j37L1O2Q9J59A9312
1504615A9219r7j20q7n5n9R5Q2M7J04lj1P8j3L1l4j51j13k07j96m4A8368
1538462A8464  $$checkpoint
##END=
##TITLE= [Cr(en)3]Cl3
##JCAMP-DX= 5.0
##DATA TYPE= UV/VIS SPECTRUM
##DATA CLASS= XYDATA
##ORIGIN= Chemistry Department, UWI, JAMAICA
##OWNER= Prof Robert J. Lancashire
##DATE= 02/07/01
##TIME= 10:23:35.00
##BLOCK_ID= 4
##SPECTROMETER/DATA SYSTEM= PERKIN-ELMER LAMBDA 19 UV/VIS/NIR UV
##$MODELS=
<Models>
<ModelData id="trisen" type="MOL">
[Cr(en)3] - CRENCL01
  ViewerPro         3D                             0

 37 39  0  0  0  0  0  0  0  0999 V2000
   -6.8178   -3.2318    2.3853 Cr  0  0  0  0  0  0  0  0  0  1
   -7.4496   -5.1124    1.8334 N   0  0  0  0  0  0  0  0  0  2
   -6.6922   -4.1087    4.2572 N   0  0  0  0  0  0  0  0  0  3
   -6.8640   -2.4630    0.4500 N   0  0  0  0  0  0  0  0  0  4
   -4.8466   -3.6123    1.8864 N   0  0  0  0  0  0  0  0  0  5
   -8.7019   -2.4343    2.7023 N   0  0  0  0  0  0  0  0  0  6
   -6.2220   -1.3721    3.1908 N   0  0  0  0  0  0  0  0  0  7
   -7.1110   -6.0753    2.9102 C   0  0  0  0  0  0  0  0  0  8
   -7.3924   -5.3992    4.2510 C   0  0  0  0  0  0  0  0  0  9
   -5.6270   -2.8303   -0.2869 C   0  0  0  0  0  0  0  0  0 10
   -4.4764   -2.7950    0.7036 C   0  0  0  0  0  0  0  0  0 11
   -8.6181   -1.0335    2.9840 C   0  0  0  0  0  0  0  0  0 12
   -7.4108   -0.7048    3.8384 C   0  0  0  0  0  0  0  0  0 13
   -8.3175   -5.1069    1.7045 H   0  0  0  0  0  0  0  0  0 37
   -7.0542   -5.3495    1.0913 H   0  0  0  0  0  0  0  0  0 38
   -5.8550   -4.2355    4.4589 H   0  0  0  0  0  0  0  0  0 39
   -7.0700   -3.5847    4.8434 H   0  0  0  0  0  0  0  0  0 40
   -7.5544   -2.7906    0.0312 H   0  0  0  0  0  0  0  0  0 41
   -6.9380   -1.5993    0.4885 H   0  0  0  0  0  0  0  0  0 42
   -4.3274   -3.4083    2.5464 H   0  0  0  0  0  0  0  0  0 43
   -4.7499   -4.4561    1.6942 H   0  0  0  0  0  0  0  0  0 44
   -9.1852   -2.5590    1.9852 H   0  0  0  0  0  0  0  0  0 45
   -9.0770   -2.8457    3.3675 H   0  0  0  0  0  0  0  0  0 46
   -5.6100   -1.5001    3.7833 H   0  0  0  0  0  0  0  0  0 47
   -5.9164   -0.8714    2.5464 H   0  0  0  0  0  0  0  0  0 48
   -7.6419   -6.8607    2.8167 H   0  0  0  0  0  0  0  0  0 49
   -6.1972   -6.3202    2.8478 H   0  0  0  0  0  0  0  0  0 50
   -7.0793   -5.9452    4.9577 H   0  0  0  0  0  0  0  0  0 51
   -8.3257   -5.2613    4.3445 H   0  0  0  0  0  0  0  0  0 52
   -5.7205   -3.7061   -0.6444 H   0  0  0  0  0  0  0  0  0 53
   -5.4849   -2.2170   -0.9874 H   0  0  0  0  0  0  0  0  0 54
   -4.3239   -1.9082    0.9666 H   0  0  0  0  0  0  0  0  0 55
   -3.6928   -3.1546    0.2910 H   0  0  0  0  0  0  0  0  0 56
   -9.4136   -0.7721    3.4403 H   0  0  0  0  0  0  0  0  0 57
   -8.5623   -0.5625    2.1619 H   0  0  0  0  0  0  0  0  0 58
   -7.2867    0.2316    3.8664 H   0  0  0  0  0  0  0  0  0 59
   -7.5324   -1.0478    4.7187 H   0  0  0  0  0  0  0  0  0 60
  1  2  1  0  0  0
  1  3  1  0  0  0
  1  4  1  0  0  0
  1  5  1  0  0  0
  1  6  1  0  0  0
  1  7  1  0  0  0
  2  8  1  0  0  0
  2 14  1  0  0  0
  2 15  1  0  0  0
  3  9  1  0  0  0
  3 16  1  0  0  0
  3 17  1  0  0  0
  4 10  1  0  0  0
  4 18  1  0  0  0
  4 19  1  0  0  0
  5 11  1  0  0  0
  5 20  1  0  0  0
  5 21  1  0  0  0
  6 12  1  0  0  0
  6 22  1  0  0  0
  6 23  1  0  0  0
  7 13  1  0  0  0
  7 24  1  0  0  0
  7 25  1  0  0  0
  8  9  1  0  0  0
  8 26  1  0  0  0
  8 27  1  0  0  0
  9 28  1  0  0  0
  9 29  1  0  0  0
 10 30  1  0  0  0
 10 31  1  0  0  0
 10 11  1  0  0  0
 11 32  1  0  0  0
 11 33  1  0  0  0
 12 34  1  0  0  0
 12 35  1  0  0  0
 12 13  1  0  0  0
 13 36  1  0  0  0
 13 37  1  0  0  0
M  END
</ModelData>
</Models>
##$PEAKS=
<Peaks type="UV-Vis" xUnitsExpected="nm"  >
<PeakData id="1" title="Spin Allowed - delta ~460nm" peakShape="singlet" model="trisen"  xMax="480" xMin="440"    />
<PeakData id="2" title="Spin Allowed ~ 350nm" peakShape="singlet" model="trisen" xMax="370" xMin="330"    />
</Peaks>
##XUNITS= NANOMETERS
##YUNITS= ABSORBANCE
##XFACTOR= 4.5E-4
##YFACTOR= 1.00029136E-6
##FIRSTX= 250
##FIRSTY= 0.78065084
##LASTX= 700
##NPOINTS= 451
##XYDATA= (X++(Y..Y))
$$ plain form
555556 780423 741925 707909 676659 647667 620359 595276 571624 549275 527848 507884 488937 470880
584444 453586 437373 421891 407077 392834 379451 366703 354527 342828 331797 321242 311101 301278
613333 291963 282998 274320 265895 257789 249905 242275 234868 227874 221198 214903 208927 203459 198341 193667 189312
648889 185465 182000 178917 176119 173798 171827 170270 169062 168426 168299 168648 169507 171033 173194 176024 179393 183749
686667 188867 194812 201424 209149 217669 227111 237316 248856 261508 275305 290088 306205 323309 341302
717778 360058 379959 400750 422400 444748 467987 491798 516118 540755 565615 590539 615304 639910
746667 663943 687373 710071 732007 752352 771459 789166 805697 820193 832941 843941 853319 860027
775556 864763 867497 868610 867116 863555 857960 850776 841175 829985 817332 803535 788085 771427 753719 735281
$$ packed form
555556G80423l8498l4016l1250k8992k7308k5083k3652k2349k1427j9964j8947D70880
584444D53586j6213j5482j4814j4243j3383j2748j2176j1699j1031j0555j0141C01278
613333B91963q965q678q425q106p884p630p407o994o676o295n976n468n118m674A89312
648889A85465l465l083k798k321j971j557j208o36j27L49Q59J526K161K830L369A83749
686667A88867N945O612P725Q520R442J0205J1540J2652J3797J4783J6117J7104C41302
717778C60058J9901K0791K1650K2348K3239K3811K4320K4637K4860K4924K4765F39910
746667F63943K3430K2698K1936K0345J9107J7707J6531J4496J2748J1000R378H60027
775556H64763K734J113j494l561n595p184r601j1190j2653j3797j5450j6658j7708G35281
$$ plain form
808889 715825 695829 675388 654565 633520 612316 591175 570161 549466 529215 509442 490018 471325
837778 453109 435497 418394 402372 387335 373315 360122 348232 337360 327410 318318 310529 303694 297813
868889 292758 288943 286114 284238 283157 283316 284365 286273 288911 292663 297177 302454 308367 315298 322991 331415
904444 340412 350362 360949 372202 383965 396554 409747 423449 437595 452505 467955 483850 500191
933333 517135 534397 552041 569939 588282 606911 625763 644710 663816 682859 701837 720753 739477
962222 758075 776418 794570 812436 829985 847152 863969 879991 895346 909938 923830 936832 948976
991111 960230 970785 979845 987856 994755 1000699 1005500 1009315 1012271 1014624 1016054 1016976 1017294 1017040 1015863 1013575
1026667 1010109 1005722 999460 992021 983437 973868 963091 951329 938644 925229 910669 895441 879546 863110
$$ packed form
808889G15825j9996k0441k0823k1045k1204k1141k1014k0695k0251j9773j9424D71325
837778D53109j7612j7103j6022j5037j4020j3193j1890j0872r950r092p789o835B97813
868889B92758l815k829j876j081J59J049J908K638L752M514N277N913O931P693C31415
904444C40412R950J0587J1253J1763J2589J3193J3702J4146J4910J5450J5895E00191
933333E17135J7262J7644J7898J8343J8629J8852J8947J9106J9043J8978J8916G39477
962222G58075J8343J8152J7866J7549J7167J6817J6022J5355J4592J3892J3002I48976
991111I60230J0555R060Q011O899N944M801L815K956K353J430R22L18k54j177A013575
1026667A010109m387o262p439q584r569j0777j1762j2685j3415j4560j5228j5895H63110
$$ plain form
1057778 846007 828427 810402 792091 773334 754323 735090 715635 695956 676183 656345 636476 616703
1086667 597120 577728 558494 539611 520982 502670 484582 466906 449580 432636 416041 400019 384537
1115556 369596 355067 341207 327791 314852 302263 290278 278802 267771 257153 247139 237602 228541
1144444 219799 211629 203840 196433 189344 182731 176469 170587 164992 159811 154883 150242 145823 141690 137780 134092
1180000 130563 127289 124205 121312 118578 116035 113651 111362 109200 107166 105226 103383 101666 100013 98455 96961
1215556 95498 94100 92733 91461 90221 89013 87837 86724 85580 84499 83450 82433 81447 80430 79413 78395
1251111 77378 76392 75407 74453 73531 72641 71815 70956 70130 69271 68413 67586 66760 65902 65075 64248 63422 62564 61705 60910 60084
1297778 59257 58463 57668 56873 56110 55379 54648 53948 53185 52454 51691 50896 50134 49371 48671 48004 47336 46668 46033 45365 44634
$$ packed form
1057778H46007j7580j8025j8311j8757j9011j9233j9455j9679j9773j9838j9869F16703
1086667E97120j9392j9234j8883j8629j8312j8088j7676j7326j6944j6595j6022C84537
1115556C69596j4529j3860j3416j2939j2589j1985j1476j1031j0618j0014r537B28541
1144444B19799q170p789p407p089o613o262n882n595n181m928m641m419m133l910A34092
1180000A30563l274l084k893k734k543k384k289k162k034j940j843j717j653j558I6961
1215556I5498j398j367j272j240j208j176j113j144j081j049j017r86j017j017G8395
1251111G7378r86r85r54r22q90q26q59q26q59q58q27q26q58q27q27q26q58q59p95F0084
1297778E9257p94p95p95p63p31p31p00p63p31p63p95p62p63p00o67o68o68o35o68D4634
$$ plain form
1344444 43934 43235 42599 41963 41391 40851 40278 39674 39070 38466 37894 37322 36782 36305 35796 35287 34811 34334 33889 33444 32998
1391111 32585 32172 31759 31345 30964 30582 30233 29915 29660 29406 29184 28961 28739 28548 28325 28103 27848 27594 27308 27022 26736
1437778 26418 26068 25687 25305 24987 24733 24510 24320 24161 23970 23779 23589 23398 23207 22984 22698 22412 22317 22412 22857 23493
1484444 24129 24479 24351 23811 22921 21999 21268 20727 20441 20219 19996 19774 19615 19456 19329 19233 19106 18979 18820 18661 18534
1531111 18438 18375 18311 18216 18121 17993 17866 17771 17644 17517 17389
$$ packed form
1344444D3934o99o36o36n72n40n73o04o04o04n72n72n40m77n09n09m76m77m45m45C2998
1391111C2585m13m13m14l81l82l49l18k55k54k22k23k22j91k23k22k55k54k86k86B6736
1437778B6418l50l81l82l18k54k23j90j59j91j91j90j91j91k23k86k86r5R5M45B3493
1484444B4129L50j28n40q90r22p31n41k86k22k23k22j59j59j27r6j27j27j59j59A8534
1531111A8438o3o4r5r5j28j27r5j27j27A7389
1555556A7294  $$checkpoint
##END=
##TITLE= cis-K[Cr(ox)2(H2O)2].2 H2O
##JCAMP-DX= 5.0
##DATA TYPE= UV/VIS SPECTRUM
##DATA CLASS= XYDATA
##ORIGIN= Chemistry Department, UWI, JAMAICA
##OWNER= Prof Robert J. Lancashire
##DATE= 02/07/04
##TIME= 10:20:53.00
##BLOCK_ID= 5
##RESOLUTION= 1.000000
##SPECTROMETER/DATA SYSTEM= PERKIN-ELMER LAMBDA 19 UV/VIS/NIR UV
##$MODELS=
<Models>
<ModelData id="ox2" type="MOL">
"kcrox2aq"
  Chime   10090216323D

 15 16  0        0              1 V2000
    0.0000    0.0000    0.0000 Cr  0  0  0  0  0  0  0  0  0  0  0  0
   -1.5440    1.1320   -0.6400 O   0  0  0  0  0  0  0  0  0  0  0  0
    0.0280    1.2680    1.5880 O   0  0  0  0  0  0  0  0  0  0  0  0
   -2.3160    3.1960   -0.4480 O   0  0  0  0  0  0  0  0  0  0  0  0
   -0.9960    3.2440    1.8800 O   0  0  0  0  0  0  0  0  0  0  0  0
    1.3360    0.8920   -1.2760 O   0  0  0  0  0  0  0  0  0  0  0  0
   -1.5160    2.2560   -0.1520 C   0  0  0  0  0  0  0  0  0  0  0  0
   -0.6920    2.3240    1.0880 C   0  0  0  0  0  0  0  0  0  0  0  0
   -1.2160   -2.4880    0.6160 C   0  0  0  0  0  0  0  0  0  0  0  0
   -0.8480   -2.4320   -0.9360 C   0  0  0  0  0  0  0  0  0  0  0  0
   -1.1640   -1.2960    1.0360 O   0  0  0  0  0  0  0  0  0  0  0  0
   -0.3360   -1.3520   -1.4280 O   0  0  0  0  0  0  0  0  0  0  0  0
   -1.5960   -3.4480    0.9720 O   0  0  0  0  0  0  0  0  0  0  0  0
   -1.2000   -3.4440   -1.5880 O   0  0  0  0  0  0  0  0  0  0  0  0
    1.7280   -0.6720    0.7600 O   0  0  0  0  0  0  0  0  0  0  0  0
 10 14  2  0
 10 12  1  0
  9 13  2  0
  9 11  1  0
  9 10  1  0
  7  8  1  0
  5  8  2  0
  4  7  2  0
  3  8  1  0
  2  7  1  0
  1 15  1  0
  1 12  1  0
  1 11  1  0
  1  6  1  0
  1  3  1  0
  1  2  1  0
M  END
</ModelData>
</Models>
##$PEAKS=
<Peaks type="UV-Vis" xUnitsExpected="nm"  >
<PeakData id="1" title="Spin Forbidden Band ~672nm" peakShape="singlet" model="ox2" xMax="680" xMin="650"    />
<PeakData id="2" title="Spin Allowed - delta ~574nm" peakShape="singlet" model="ox2" xMax="600" xMin="540"    />
<PeakData id="3" title="Spin Allowed ~ 406nm" peakShape="singlet" model="ox2" xMax="440" xMin="380"    />
</Peaks>
##XUNITS= NANOMETERS
##YUNITS= ABSORBANCE
##XFACTOR= 6.5E-4
##YFACTOR= 8.42815161E-7
##FIRSTX= 350
##FIRSTY= 0.42375696
##LASTX= 1000
##NPOINTS= 651
##XYDATA= (X++(Y..Y))
$$ plain form
538462 502788 504291 505106 505266 504917 504291 503933 504245 505393 507270 509747 512151 514140 515596 516475 517441 518964 521315
566154 525575 531265 538098 545595 553145 560226 566686 572776 579043 586127 594518 604146 615446 627593 640117
589231 652693 664720 676255 687399 698300 709253 720583 732456 744840 757852 771163 784579 797992
609231 811126 823876 836149 847969 859066 869752 880124 890322 900278 909945 919191 928029 936041 943348
630769 949887 955757 960575 964489 967423 969579 970487 970445 969449 967655 964643 960595 955530 949686 942594 934567 925644
656923 915989 905366 894030 882032 869491 855952 841671 826702 811191 795111 778650 761829 744726
676923 727184 709370 691302 673037 654631 636112 617547 599002 580571 562337 544398 526780 509794
696923 493230 477042 461134 445585 430354 415473 400902 386872 373249 360048 347234 335084 323418
$$ packed form
538462E02788J503Q15J60l49o26l58L12J148J877K477K404J989J456Q79R66J523E21315
566154E25575N690O833P497P550P081O460O090O267P084Q391R628J1300J2147F40117
589231F52693J2027J1535J1144J0901J0953J1330J1873J2384J3012J3311J3416G97992
609231H11126J2750J2273J1820J1097J0686J0372J0198R956R667R246Q838Q012I43348
630769I49887N870M818L914K934K156R08m2r96j794l012m048n065n844p092q027I25644
656923I15989j0623j1336j1998j2541j3539j4281j4969j5511j6080j6461j6821G44726
676923G27184j7814j8068j8265j8406j8519j8565j8545j8431j8234j7939j7618E09794
696923D93230j6188j5908j5549j5231j4881j4571j4030j3623j3201j2814j2150C23418
$$ plain form
716923 312184 301277 290895 280949 271470 262399 253918 245833 238173 230862 224231 218189 212755 207852 203806
740000 200330 197354 194717 192620 190893 189525 188508 188076 188015 188330 188973 190192 191847 193922 196349 199282 202609
766154 206393 210581 215395 220687 226385 232374 238727 245293 252023 258909 266203 273869 281858 290105 298692 307392
790769 316158 325012 334054 343250 352597 362082 371812 381700 391687 401697 411679 421669 431672 441665 451710
813846 461738 471676 481527 491328 501085 510773 520393 529890 539192 548285 557204 565806 574168 582349 590407 598250
838462 605916 613342 620494 627168 633499 639505 645249 650571 655611 660323 664757 668838 672597 675989 679085 681598
863077 683633 685162 686313 687049 687468 687618 687590 687122 686279 685048 683501 681483 679137 676502 673622 670303 666696 662775
890769 658556 653909 648947 643662 638141 632357 626400 620251 613937 607333 600447 593290 585947 578303 570478 562530
$$ packed form
716923C12184j0907j0382r946r479r071q481q085p660p311o631o042n434m903B03806
740000B00330k976k637k097j727j368j017m32o1L15O43J219J655K075K427K933B02609
766154B06393M188M814N292N698N989O353O566O730O886P294P666P989Q247Q587C07392
790769C16158Q854R042R196R347R485R730R888R987J0010R982R990J0003R993D51710
813846D61738R938R851R801R757R688R620R497R302R093Q919Q602Q362Q181Q058E98250
838462F05916P426P152O674O331O006N744N322N040M712M434M081L759L392L096F81598
863077F83633J529J151P36M19J50k8m68q43j231j547k018k346k635k880l319l607F62775
890769F58556m647m962n285n521n784n957o149o314o604o886p157p343p644p825E62530
$$ plain form
915385 554501 546338 538075 529695 521187 512487 503680 494796 485859 476915 467957 458921 449814 440619 431315 421952
940000 412582 403283 394021 384723 375380 365967 356546 347203 337971 328910 319941 310976 302012 293120 284321 275648
964615 267134 258896 250863 242981 235236 227643 220115 212691 205404 198349 191531 184936 178522 172376 166458 160762
989231 155212 149861 144689 139663 134737 129967 125296 120688 116137 111731 107378 103069 98768 94474 90197 85989
1013846 81895 78018 74310 70816 67449 64175 60917 57633 54330 51075 47989 45139 42458 40002 37630 35301
1038462 33029 30821 28667 26608 24645 22845 21177 19714 18499 17839 17643 17867 18352 18872 19154 19035 18552 17668
1066154 16553 15199 13646 11736 9490 6954 4251 1596 -885 -3151 -5193 -6935 -8525 -9936 -11194 -12162
1090769 -12921 -13569 -14162 -14824 -15615 -16485 -17391 -18200 -18842 -19332 -19704 -19965 -20248 -20570 -20938 -21380 -21795 -22154 -22462 -22679 -22917
$$ packed form
915385E54501q163q263q380q508q700q807q884q937q944q958r036r107r195r304D21952
940000D12582r299r262r298r343r413r421r343r232r061q969q965q964q892q799B75648
964615B67134q238q033p882p745p593p528p424p287p055o818o595o414o146n918A60762
989231A55212n351n172n026m926m770m671m608m551m406m353m309m301m294m277H5989
1013846H1895l877l708l494l367l274l258l284l303l255l086k850k681k456k372C5301
1038462C3029k208k154k059j963j800j668j463j215o60j96K24M85N20K82j19m83A7668
1066154A6553j354j553j910k246k536k703k655k481k266k042j742j590j411j258a2162
1090769a2921o48n93o62p91q70r06q09o42m90l72k61k83l22l68m42m15l59l08k17b2917
$$ plain form
1123077 -23167 -23411 -23653 -23832 -23974 -24123 -24339 -24660 -24972 -25213 -25304 -25239 -25083 -24901 -24853 -25017 -25303 -25638 -25917 -26066 -26083 -26002
1156923 -25928 -25939 -25986 -26033 -26076 -26140 -26213 -26309 -26382 -26396 -26362 -26292 -26260 -26270 -26280 -26333 -26383 -26452 -26566 -26690 -26783 -26794 -26718 -26617 -26443 -26313 -26307
1198462 -26395 -26607 -26826 -26947 -26923 -26698 -26447 -26270 -26173 -26305 -26466 -26528 -26490 -26418 -26274 -26114 -26018 -26089 -26166 -26207 -26237 -26242 -26197 -26224 -26351
1236923 -26428 -26407 -26309 -26152 -25957 -25878 -25965 -26158 -26324 -26402 -26385 -26279 -26049 -25842 -25723 -25732 -25902 -26109 -26295 -26404 -26206 -25865 -25481
1272308 -25131 -25005 -25077 -25313 -25555 -25691 -25723 -25625 -25402 -25178 -25009 -24929 -24895 -25021 -25187 -25339 -25423 -25466 -25448 -25379 -25283 -25212 -25203 -25278 -25409
1310769 -25630 -25849 -25905 -25792 -25584 -25446 -25510 -25856 -26727 -27812 -28706 -29358 -29513 -29378 -29134 -28961 -29029 -29168 -29244 -29272 -29193 -29117
1344615 -29011 -28901 -28737 -28565 -28437 -28384 -28398 -28424 -28389 -28334 -28230 -28111 -28003 -27930 -27849 -27803 -27771 -27767 -27742 -27621 -27478 -27330 -27209 -27146 -27101
1383077 -27106 -27153 -27119 -27051 -26918 -26743 -26572 -26461 -26447 -26484 -26486 -26486 -26429 -26311 -26160 -26026 -25920 -25850 -25845 -25876 -25894 -25869 -25802 -25692 -25579 -25414
$$ packed form
1123077b3167k44k42j79j42j49k16l21l12k41r1O5J56J82M8j64k86l35k79j49j7b6002
1156923b5928j1m7m7m3o4p3r6p3j4L4P0L2j0j0n3n0o9j14j24r3j1P6J01J74J30b6307
1198462b6395k12k19j21K4K25K51J77R7j32j61o2L8P2J44J60R6p1p7m1l0nM5k7b6351
1236923b6428K1R8J57J95P9q7j93j66p8J7J06K30K07J19rj70k07j86j09J98L41b5481
1272308b5131J26p2k36k42j36l2R8K23K24J69Q0L4j26j66j52q4m3J8O9R6P1Rp5b5409
1310769b5630k19n6J13K08J38o4l46q71j085q94o52j55J35K44J73o8j39p6k8P9b9117
1344615b9011J10J64J72J28N3j4k6L5N5J04J19J08P3Q1M6L2MK5J21J43J48J21O3b7101
1383077b7106m7L4O8J33J75J71J11J4l7k%N7J18J51J34J06P0Nl1j8K5O7J10J13b5414
$$ plain form
1423077 -25265 -25096 -24966 -24886 -24793 -24719 -24674 -24590 -24513 -24393 -24274 -24057 -23824 -23670 -23539 -23459 -23420 -23367 -23305 -23153 -23023 -22896 -22736 -22595
1460000 -22450 -22310 -22144 -21903 -21668 -21407 -21114 -20836 -20598 -20443 -20309 -20255 -20269 -20259 -20208 -20170 -20141 -20123 -20063 -20041 -20090 -20168 -20336 -20504
1496923 -20649 -20763 -20805 -20845 -20897 -20995 -21147 -21288 -21492 -21680 -21800 -21850 -21854 -21890 -21930 -22083 -22273 -22439 -22602 -22761 -22899 -23014 -23100 -23249
1533846 -23397 -23563 -23763
$$ packed form
1423077b5265J69J30Q0R3P4M5Q4P7J20J19K17K33J54J31Q0L9N3O2J52J30J27J60b2595
1460000b2450J40J66K41K35K61K93K78K38J55J34N4j4J0N1L8K9J8O0K2m9p8j68b0504
1496923b0649j14m2m0n2r8j52j41k04j88j20n0ml6m0j53j90j66j63j59j38j15q6b3249
1533846b3397j66b3763
1538462b3869  $$checkpoint
##END=
##TITLE= K3[Cr(ox)3]
##JCAMP-DX= 5.00
##DATA TYPE= UV/VIS SPECTRUM
##DATA CLASS= XYDATA
##ORIGIN= Chemistry Department, UWI, JAMAICA
##OWNER= Prof Robert J. Lancashire
##DATE= 96/11/18
##TIME= 11:49:16.00
##BLOCK_ID= 6
##$MODELS=
<Models>
<ModelData id="ox3" type="MOL">
CROXKH
  ViewerPro         3D                             0

 19 21  0  0  0  0  0  0  0  0999 V2000
    1.0289    2.5863    2.4618 Cr  0  0  0  0  0  0  0  0  0  1
    0.1574    1.2186    3.6004 O   0  0  0  0  0  0  0  0  0  5
    2.3376    2.5908    3.9146 O   0  0  0  0  0  0  0  0  0  6
    0.2281    0.4410    5.6926 O   0  0  0  0  0  0  0  0  0  7
    2.7246    1.6754    5.9093 O   0  0  0  0  0  0  0  0  0  8
    2.1632    1.3879    1.3574 O   0  0  0  0  0  0  0  0  0  9
   -0.2574    2.2778    1.0166 O   0  0  0  0  0  0  0  0  0 10
    2.2623    0.5945   -0.7280 O   0  0  0  0  0  0  0  0  0 11
   -0.4295    1.2678   -0.9634 O   0  0  0  0  0  0  0  0  0 12
   -0.1340    3.9492    3.2546 O   0  0  0  0  0  0  0  0  0 13
    1.8476    4.1776    1.6273 O   0  0  0  0  0  0  0  0  0 14
   -0.5891    6.1128    3.1433 O   0  0  0  0  0  0  0  0  0 15
    1.7635    6.4002    1.7032 O   0  0  0  0  0  0  0  0  0 16
    0.6916    1.0867    4.7608 C   0  0  0  0  0  0  0  0  0 17
    2.0383    1.8329    4.9174 C   0  0  0  0  0  0  0  0  0 18
    1.6690    1.1478    0.1950 C   0  0  0  0  0  0  0  0  0 19
    0.1983    1.5946    0.0305 C   0  0  0  0  0  0  0  0  0 20
    0.0897    5.1383    2.8596 C   0  0  0  0  0  0  0  0  0 21
    1.3294    5.2919    1.9957 C   0  0  0  0  0  0  0  0  0 22
  1  2  1  0  0  0
  1  3  1  0  0  0
  1  6  1  0  0  0
  1  7  1  0  0  0
  1 10  1  0  0  0
  1 11  1  0  0  0
  2 14  1  0  0  0
  3 15  1  0  0  0
  4 14  2  0  0  0
  5 15  2  0  0  0
  6 16  1  0  0  0
  7 17  1  0  0  0
  8 16  2  0  0  0
  9 17  2  0  0  0
 10 18  1  0  0  0
 11 19  1  0  0  0
 12 18  2  0  0  0
 13 19  2  0  0  0
 14 15  1  0  0  0
 16 17  1  0  0  0
 18 19  1  0  0  0
M  END
</ModelData>
</Models>
##$PEAKS=
<Peaks type="UV-Vis" xUnitsExpected="nm"  >
<PeakData id="1" title="Spin Forbidden Band ~672nm" peakShape="singlet" model="ox3" xMax="680" xMin="650"    />
<PeakData id="2" title="Spin Allowed - delta ~574nm" peakShape="singlet" model="ox3" xMax="600" xMin="540"    />
<PeakData id="3" title="Spin Allowed ~ 406nm" peakShape="singlet" model="ox3" xMax="440" xMin="380"    />
</Peaks>
##XUNITS= NANOMETERS
##YUNITS= ABSORBANCE
##XFACTOR= 5.0200032E-4
##YFACTOR= 1.572176E-6
##FIRSTX= 297.99968498
##FIRSTY= 1.59061762
##LASTX= 800.00000498
##NPOINTS= 252
##XYDATA= (X++(Y..Y))
$$ plain form
593624 1011730 931108 854817 781719 710867 641943 575232 511493 451358 394859 340890 290082 245218
645418 206709 173638 145721 122894 104588 90107 78662 69556 62221 56277 51440 47741 45180 43726
701195 43251 43504 44390 45812 47741 50175 53084 56404 60198 64466 69145 74204 79610 85396 91498 97822 104366
768924 111037 117867 124791 131620 138354 144930 151317 157387 163047 168295 173037 177211 180783 183692 185842 187296
832668 187992 187897 187075 185463 183123 180025 176231 171804 166777 161213 155142 148661 141832 134687 127320 119858 112460
900398 105220 98264 91625 85365 79516 74109 69145 64593 60514 56941 53938 51567 49796 48563 47678 46793
964143 46034 45623 45465 45338 45370 45781 46666 47994 49670 51661 53906 56341 58996 61842 64846 68007 71264 74647
1035856 78188 81792 85460 89190 92953 96715 100477 104208 107876 111480 114958 118341 121597 124664 127541 130260
$$ packed form
593624A011730q0622p6291p3098p0852o8924o6711o3739o0135n6499n3969n0808B45218
645418B06709l3071k7917k2827j8306j4481j1445r106p335n944m837l699k561D3726
701195D3251K53Q86J422J929K434K909L320L794M268M679N059N406N786O102O324A04366
768924A11037O830O924O829O734O576O387O070N660N248M742M174L572K909K150A87296
832668A87992r5q22j612k340l098l794m427n027n564o071o481o829p145p367p462A12460
900398A05220o956o639o260n849n407m964m552m079l573l003k371j771j233q85D6793
964143D6034m11j58j27L2M11Q85J328J676J991K245K435K655K846L004L161L257G4647
1035856G8188L604L668L730L763L762L762L731L668L604L478L383L256L067K877A30260
$$ plain form
1099601 132758 135003 136995 138765 140251 141358 142180 142812 143191 143286 143097 142654 141895 140852 139587 138069 136331 134339
1171314 132157 129754 127130 124380 121471 118436 115274 112017 108698 105283 101805 98233 94660 91087 87483 83910
1235059 80369 76828 73350 69936 66584 63328 60166 57194 54412 51693 49037 46508 44168 42018 40058 38319
1298804 36770 35347 34051 32850 31648 30320 28834 27317 26052 25040 24123 23270 22385 21341 20329 19507 18875
1366533 18306 17769 17294 17231 18274 19855 20013 18432 16630 15555 15018 14702 14480 14259 14038 13911 13848 13848 13911 14006 14164
1450199 14417 14828 15271 15682 15998 16124 16156 16093 15998 15872 15745 15650 15555 15429 15302 15176 15049 14923 14765 14607 14480 14322
1537847 14101 13943 13753 13564 13374 13184 12994 12836 12647 12457 12267 12109 11951 11825
$$ packed form
1099601A32758K245J992J770J486J107Q22O32L79R5j89m43p59j043j265j518j738A34339
1171314A32157k403k624k750k909l035l162l257l319l415l478l572l573l573l604H3910
1235059H0369l541l478l414l352l256l162k972k782k719k656k529k340k150j960C8319
1298804C6770j423j296j201j202j328j486j517j265j012r17q53q85j044j012q22A8875
1366533A8306n37m75o3J043J581J58j581j802j075n37l16k22k21k21j27o3%O3R5A4164
1450199A4417M11M43M11L16J26L2o3r5j26j27r5r5j26j27j26j27j26j58j58j27A4322
1537847A4101j58j90j89j90j90j90j58j89j90j90j58j58A1825
1593624A1730  $$checkpoint
##END=
##TITLE= [Cr(III)(EDTA)H2O]-
##JCAMP-DX= 5.0
##DATA TYPE= UV/VIS SPECTRUM
##DATA CLASS= XYDATA
##ORIGIN= Chemistry Department, UWI, JAMAICA
##OWNER= Prof Robert J. Lancashire
##DATE= 02/07/09
##TIME= 11:36:45.00
##BLOCK_ID= 7
##RESOLUTION= 1.000000
##SPECTROMETER/DATA SYSTEM= PERKIN-ELMER LAMBDA 19 UV/VIS/NIR UV
##$MODELS=
<Models>
<ModelData id="edta" type="MOL">
EDTACR01
  ViewerPro         3D                             0

 37 40  0  0  0  0  0  0  0  0999 V2000
    1.2101    7.3221    2.4757 Cr  0  0  0  0  0  0  0  0  0  1
    2.3088    7.4344    4.0645 O   0  0  0  0  0  0  0  0  0  2
   -0.5007    7.5175    3.3541 O   0  0  0  0  0  0  0  0  0  3
    0.3236    7.1859    0.7103 O   0  0  0  0  0  0  0  0  0  4
    1.5060    9.2761    2.1570 O   0  0  0  0  0  0  0  0  0  5
    0.9185    5.3848    3.0492 N   0  0  0  0  0  0  0  0  0  6
    2.8423    6.5334    1.3375 N   0  0  2  0  0  0  0  0  0  7
    3.0150    6.2929    5.8507 O   0  0  0  0  0  0  0  0  0  8
    5.5327    5.8852    0.4245 O   0  0  0  0  0  0  0  0  0  9
    6.1389    8.0082    0.8576 O   0  0  0  0  0  0  0  0  0 10
    0.5829    6.8870   -1.4848 O   0  0  0  0  0  0  0  0  0 11
   -2.3792    6.4175    3.8704 O   0  0  0  0  0  0  0  0  0 12
    1.3681    5.2751    4.4699 C   0  0  0  0  0  0  0  0  0 13
    2.3120    6.3910    4.8493 C   0  0  0  0  0  0  0  0  0 14
   -0.5533    5.1628    2.9522 C   0  0  0  0  0  0  0  0  0 15
   -1.2321    6.4441    3.4529 C   0  0  0  0  0  0  0  0  0 16
    4.0056    7.4229    1.5177 C   0  0  0  0  0  0  0  0  0 17
    5.2838    6.9896    0.8559 C   0  0  0  0  0  0  0  0  0 18
    2.4474    6.4440   -0.1040 C   0  0  0  0  0  0  0  0  0 19
    1.0155    6.8676   -0.3413 C   0  0  0  0  0  0  0  0  0 20
    3.0643    5.1558    1.9265 C   0  0  0  0  0  0  0  0  0 21
    1.7188    4.5015    2.1604 C   0  0  0  0  0  0  0  0  0 22
    2.5375    5.5970   -0.4331 H   0  0  0  0  0  0  0  0  0 23
    2.9633    6.9763   -0.7103 H   0  0  0  0  0  0  0  0  0 24
    3.5940    4.6067    1.3514 H   0  0  0  0  0  0  0  0  0 25
    3.5439    5.3052    2.7200 H   0  0  0  0  0  0  0  0  0 26
    1.2306    4.4298    1.3687 H   0  0  0  0  0  0  0  0  0 27
    1.9196    3.5633    2.5814 H   0  0  0  0  0  0  0  0  0 28
    0.7660    5.4378    5.0762 H   0  0  0  0  0  0  0  0  0 29
    1.6965    4.4741    4.6431 H   0  0  0  0  0  0  0  0  0 30
   -0.7922    5.1018    2.0617 H   0  0  0  0  0  0  0  0  0 31
   -0.7639    4.3856    3.4130 H   0  0  0  0  0  0  0  0  0 32
    4.2719    7.4361    2.3909 H   0  0  0  0  0  0  0  0  0 33
    3.7106    8.3645    1.2128 H   0  0  0  0  0  0  0  0  0 34
    6.9273    7.5599    0.5371 H   0  0  0  0  0  0  0  0  0 35
    2.1869    9.8765    2.4428 H   0  0  0  0  0  0  0  0  0 36
    0.7702    9.8411    1.8884 H   0  0  0  0  0  0  0  0  0 37
  1  2  1  0  0  0
  1  3  1  0  0  0
  1  4  1  0  0  0
  1  5  1  0  0  0
  1  6  1  0  0  0
  1  7  1  0  0  0
  2 14  1  0  0  0
  3 16  1  0  0  0
  4 20  1  0  0  0
  5 36  1  0  0  0
  5 37  1  0  0  0
  6 13  1  0  0  0
  6 15  1  0  0  0
  6 22  1  0  0  0
  7 17  1  0  0  0
  7 19  1  0  0  0
  7 21  1  0  0  0
  8 14  2  0  0  0
  9 18  2  0  0  0
 10 18  1  0  0  0
 10 35  1  0  0  0
 11 20  2  0  0  0
 12 16  2  0  0  0
 13 14  1  0  0  0
 13 29  1  0  0  0
 13 30  1  0  0  0
 15 31  1  0  0  0
 15 32  1  0  0  0
 15 16  1  0  0  0
 17 18  1  0  0  0
 17 33  1  0  0  0
 17 34  1  0  0  0
 19 23  1  0  0  0
 19 24  1  0  0  0
 19 20  1  0  0  0
 21 25  1  0  0  0
 21 26  1  0  0  0
 21 22  1  0  0  0
 22 27  1  0  0  0
 22 28  1  0  0  0
M  END
</ModelData>
</Models>
##$PEAKS=
<Peaks type="UV-Vis" xUnitsExpected="nm"  >
<PeakData id="1" title="Spin Allowed - delta ~545nm" peakShape="singlet" model="edta" xMax="575" xMin="515"    />
<PeakData id="2" title="Spin Allowed ~ 390nm" peakShape="singlet" model="edta" xMax="420" xMin="360"    />
</Peaks>
##XUNITS= NANOMETERS
##YUNITS= ABSORBANCE
##XFACTOR= 3.8E-4
##YFACTOR= 5.71354032E-7
##FIRSTX= 320
##FIRSTY= 0.01035702
##LASTX= 700
##NPOINTS= 381
##XYDATA= (X++(Y..Y))
$$ plain form
842105 18127 18862 19739 20791 22032 23425 24964 26625 28450 30484 32754 35318 38171 41314 44748 48452 52439
886842 56735 61377 66388 71789 77572 83782 90415 97493 105059 113109 121650 130691 140225 150241 160734 171676
928947 183074 194935 207220 219955 233130 246700 260597 274765 289160 303721 318412 333198 348100
963158 363083 378083 393028 407856 422507 436903 450980 464665 477959 490825 503213 515068 526344
997368 537031 547088 556420 564942 572654 579506 585455 590464 594556 597759 600073 601455 601902 601420 599987 597577
1039474 594196 589888 584660 578531 571520 563689 555085 545775 535797 525229 514123 502496 490390 477860 464980
1078947 451841 438532 425130 411718 398352 385031 371810 358744 345899 333335 321097 309257 297843
1113158 286861 276288 266136 256443 247227 238491 230262 222563 215390 208727 202533 196745 191393 186478 181984
$$ packed form
842105A8127P35Q77J052J241J393J539J661J825K034K270K564K853L143L434L704E2439
886842E6735M642N011N401N783O210O633P078P566Q050Q541R041R534J0016J0493A71676
928947A83074J1861J2285J2735J3175J3570J3897J4168J4395J4561J4691J4786C48100
963158C63083J5000J4945J4828J4651J4396J4077J3685J3294J2866J2388J1855E26344
997368E37031J0057R332Q522P712O852N949N009M092L203K314J382M47m82j433E97577
1039474E94196m308n228o129p011p831q604r310r978j0568j1106j1627j2106j2530D64980
1078947D51841j3309j3402j3412j3366j3321j3221j3066j2845j2564j2238j1840B97843
1113158B86861j0573j0152r693r216q736q229p699p173o663o194n788n352m915A81984
$$ plain form
1152632 177895 174228 171001 168208 165808 163783 162192 161061 160377 160127 160337 160990 162061 163529 165449 167912 170961
1197368 174564 178611 182962 187408 191795 196066 200337 204803 209665 215035 220966 227458 234466 241960 249929 258381
1239474 267269 276498 285928 295470 305079 314810 324809 335242 346227 357799 369927 382541 395545 408846
1276316 422399 436187 450213 464448 478862 493447 508193 523085 538095 553193 568346 583538 598732
1310526 613905 629043 644135 659189 674174 689056 703814 718448 732947 747271 761369 775215 788795
1344737 802060 814969 827534 839781 851719 863339 874642 885628 896289 906571 916430 925859 934834 943333
1381579 951363 958941 966070 972770 979025 984820 990151 994996 999349 1003214 1006604 1009535 1012035 1014105 1015754 1016977
1423684 1017772 1018127 1018041 1017521 1016592 1015262 1013542 1011431 1008925 1006031 1002757 999095 995040 990596 985774 980609 975124
$$ packed form
1152632A77895l667l227k793k400k025j591j131o84k50K10O53J071J468J920K463A70961
1197368A74564M047M351M446M387M271M271M466M862N370N931O492P008P494P969B58381
1239474B67269R229R430R542R609R731R999J0433J0985J1572J2128J2614J3004D08846
1276316D22399J3788J4026J4235J4414J4585J4746J4892J5010J5098J5153J5192E98732
1310526F13905J5138J5092J5054J4985J4882J4758J4634J4499J4324J4098J3846G88795
1344737H02060J2909J2565J2247J1938J1620J1303J0986J0661J0282R859R429Q975I43333
1381579I51363P578P129O700O255N795N331M845M353L865L390K931K500K070J649A016977
1423684A017772L55q6n20r29j330j720k111k506k894l274l662m055m444m822n165I75124
$$ plain form
1468421 969343 963287 956971 950381 943492 936304 928813 921037 912979 904662 896094 887303 878291 869071 859661 850067
1510526 840276 830289 820108 809768 799294 788712 778029 767255 756384 745419 734335 723152 711918
1544737 700669 689415 678161 666923 655709 644508 633273 622024 610798 599602 588436 577313 566264
1578947 555304 544419 533594 522862 512210 501626 491123 480697 470355 460093 449919 439862 429959
1613158 420202 410607 401179 391883 382712 373642 364662 355781 347018 338379 329892 321550 313342 305284 297374 289612
1655263 282011 274579 267325 260261 253365 246621 240037 233596 227285 221098 215038 209131 203377 197753 192277 186965
1697368 181817 176829 171985 167317 162859 158615 154582 150772 147152 143659 140176 136628 132988 129242 125421 121602
1739474 117859 114246 110774 107452 104329 101457 98857 96541 94444 92470 90476 88311 85926 83348 80654 77952
$$ packed form
1468421I69343o056o316o590o889p188p491p776q058q317q568q791r012r220r410H50067
1510526H40276r987j0181j0340j0474j0582j0683j0774j0871j0965j1084j1183G11918
1544737G00669j1254j1254j1238j1214j1201j1235j1249j1226j1196j1166j1123E66264
1578947E55304j0885j0825j0732j0652j0584j0503j0426j0342j0262j0174j0057D29959
1613158D20202r595r428r296r171r070q980q881q763q639q487q342q208q058p910B89612
1655263B82011p432p254p064o896o744o584o441o311o187o060n907n754n624n476A86965
1697368A81817m988m844m668m458m244m033l810l620l493l483l548l640l746l821A21602
1739474A17859l613l472l322l123k872k600k316k097j974j994k165k385k578k694G7952
$$ plain form
1781579 75330 72829 70478 68249 66122 64093 62173 60358 58647 57002 55424 53914 52493 51205 50067 49104
1823684 48313 47627 46946 46196 45298 44246 43059
$$ packed form
1781579G5330k501k351k229k127k029j920j815j711j645j578j510j421j288j138D9104
1823684D8313o86o81p50q98j052D3059
1842105D1794  $$checkpoint
##END=
##TITLE= K3[Cr(NCS)6]
##JCAMP-DX= 5.0
##DATA TYPE= UV/VIS SPECTRUM
##DATA CLASS= XYDATA
##BLOCK_ID= 8
##ORIGIN= Chemistry Department, UWI, JAMAICA $$Exported PE Spectrum Data File
##OWNER= Prof Robert J. Lancashire
##DATE= 02/07/09
##TIME= 11:40:11.00
##RESOLUTION= 1.000000
##SPECTROMETER/DATA SYSTEM= PERKIN-ELMER LAMBDA 19 UV/VIS/NIR UV
##$MODELS=
<Models>
<ModelData id="ncs" type="MOL">
TMCRTC
  ViewerPro         3D                             0

 19 18  0  0  0  0  0  0  0  0999 V2000
    0.0000    0.0000    0.0000 Fe  0  0  0  0  0  0  0  0  0  1
    1.9560    0.5301    0.2616 N   0  0  0  0  0  0  0  0  0  2
    3.0179    0.8463    0.3938 C   0  0  0  0  0  0  0  0  0  3
    4.5850    1.3243    0.5879 S   0  0  0  0  0  0  0  0  0  4
   -0.5584    1.8042    0.8157 N   0  0  0  0  0  0  0  0  0  5
   -0.6947    2.8830    1.1926 C   0  0  0  0  0  0  0  0  0  6
   -0.8678    4.3757    1.7383 S   0  0  0  0  0  0  0  0  0  7
   -0.0116   -0.8649    1.8508 N   0  0  0  0  0  0  0  0  0  8
    0.1069   -1.3113    2.8634 C   0  0  0  0  0  0  0  0  0  9
    0.2341   -2.0004    4.3654 S   0  0  0  0  0  0  0  0  0 10
   -1.9560   -0.5301   -0.2616 N   0  0  0  0  0  0  0  0  0 36
    0.5584   -1.8042   -0.8157 N   0  0  0  0  0  0  0  0  0 37
    0.0116    0.8649   -1.8508 N   0  0  0  0  0  0  0  0  0 38
   -3.0179   -0.8463   -0.3938 C   0  0  0  0  0  0  0  0  0 39
    0.6947   -2.8830   -1.1926 C   0  0  0  0  0  0  0  0  0 40
   -0.1069    1.3113   -2.8634 C   0  0  0  0  0  0  0  0  0 41
   -4.5850   -1.3243   -0.5879 S   0  0  0  0  0  0  0  0  0 42
    0.8678   -4.3757   -1.7383 S   0  0  0  0  0  0  0  0  0 43
   -0.2341    2.0004   -4.3654 S   0  0  0  0  0  0  0  0  0 44
  1  2  1  0  0  0
  1  5  1  0  0  0
  1  8  1  0  0  0
  1 11  1  0  0  0
  1 12  1  0  0  0
  1 13  1  0  0  0
  2  3  2  0  0  0
  3  4  2  0  0  0
  5  6  2  0  0  0
  6  7  2  0  0  0
  8  9  2  0  0  0
  9 10  2  0  0  0
 11 14  2  0  0  0
 12 15  2  0  0  0
 13 16  2  0  0  0
 14 17  2  0  0  0
 15 18  2  0  0  0
 16 19  2  0  0  0
M  END
</ModelData>
</Models>
##$PEAKS=
<Peaks type="UV-Vis" xUnitsExpected="nm"  >
<PeakData id="1" title="Spin Allowed - delta ~565nm" peakShape="singlet" model="ncs" xMax="595" xMin="535"    />
<PeakData id="2" title="Spin Allowed ~ 420nm" peakShape="singlet" model="ncs" xMax="450" xMin="390"    />
</Peaks>
##XUNITS= NANOMETERS
##YUNITS= ABSORBANCE
##XFACTOR= 3.2E-4
##YFACTOR= 1.05747497E-6
##FIRSTX= 380
##FIRSTY= 0.73810804
##LASTX= 700
##NPOINTS= 321
##XYDATA= (X++(Y..Y))
$$ plain form
1187500 697991 644838 601923 567934 541683 522122 508349 499563 495093 494363 496876 502156 509791 519395 530621
1234375 543190 556847 571347 586477 602059 617919 633904 649878 665704 681295 696540 711304 725474
1275000 738964 751679 763559 774548 784605 793706 801810 808883 814891 819825 823639 826338 827910 828359 827688
1321875 825913 823060 819139 814188 808225 801305 793466 784752 775223 764926 753908 742190 729821 716835 703295
1368750 689246 674753 659888 644712 629286 613648 597857 581956 565993 550001 534036 518142 502369
1409375 486759 471354 456205 441338 426773 412519 398601 385032 371841 359064 346747 334927 323626
1450000 312853 302608 292889 283684 274999 266857 259276 252277 245867 240056 234836 230197 226135 222646 219734 217399
1500000 215638 214451 213829 213763 214248 215285 216880 219040 221749 224987 228751 233016 237787 243050 248805 255050 261788
$$ packed form
1187500F97991n3153m2915l3989k6251j9561j3773q786m470p30K513N280P635R604E30621
1234375E43190J3657J4500J5130J5582J5860J5985J5974J5826J5591J5245J4764G25474
1275000G38964J2715J1880J0989J0057R101Q104P073O008M934L814K699J572M49H27688
1321875H25913k853l921m951n963o920p839q714r529j0297j1018j1718j2369j2986G03295
1368750F89246j4493j4865j5176j5426j5638j5791j5901j5963j5992j5965j5894E02369
1409375D86759j5405j5149j4867j4565j4254j3918j3569j3191j2777j2317j1820C23626
1450000C12853j0245r719r205q685q142p581o999o410n811n220m639m062l489k912B17399
1500000B15638j187o22o6M85J037J595K160K709L238L764M265M771N263N755O245B61788
$$ plain form
1553125 268999 276674 284806 293378 302393 311835 321699 331975 342650 353729 365193 377030 389231 401793
1596875 414698 427930 441455 455255 469303 483558 497984 512542 527193 541889 556584 571241 585827
1637500 600314 614693 628940 643026 656925 670596 684009 697135 709967 722537 734910 747177 759466
1678125 771904 784600 797628 811002 824674 838528 852413 866164 879627 892646 905113 916945 928093
1718750 938518 948189 957109 965286 972721 979463 985598 991159 996175 1000637 1004512 1007749 1010294 1012087 1013196 1013661
1768750 1013492 1012713 1011338 1009371 1006799 1003613 999805 995427 990480 984960 978868 972219 965027 957302 949046 940270
1818750 931004 921277 911103 900503 889504 878129 866384 854264 841804 829035 815998 802709 789199
1859375 775483 761576 747475 733197 718765 704210 689550 674821 660044 645233 630405 615575 600750
$$ packed form
1553125B68999P675Q132Q572R015R442R864J0276J0675J1079J1464J1837J2201D01793
1596875D14698J3232J3525J3800J4048J4255J4426J4558J4651J4696J4695J4657E85827
1637500F00314J4379J4247J4086J3899J3671J3413J3126J2832J2570J2373J2267G59466
1678125G71904J2696J3028J3374J3672J3854J3885J3751J3463J3019J2467J1832I28093
1718750I38518R671Q920Q177P435O742O135N561N016M462L875L237K545J793J109A013661
1768750A013492p79j375j967k572l186l808m378m947n520o092o649p192p725q256I40270
1818750I31004r727j0174j0600j0999j1375j1745j2120j2460j2769j3037j3289G89199
1859375G75483j3907j4101j4278j4432j4555j4660j4729j4777j4811j4828j4830F00750
$$ plain form
1900000 585947 571174 556462 541845 527349 512993 498798 484771 470901 457192 443634 430232 416998
1940625 403951 391115 378512 366155 354051 342198 330591 319217 308077 297170 286509 276103 265949
1981250 256040 246370 236933 227723 218746 210005 201528 193320 185371 177682 170250 163069 156128 149420 142931 136669
2031250 130631 124798 119177 113778 108597 103631 98869 94296 89913 85708 81662 77783 74087 70555 67181 63954
2081250 60874 57930 55117 52431 49875 47456 45148 42953 40864 38880 36987 35184 33470 31853 30334 28912
2131250 27590 26367 25238 24180 23178 22217 21278 20357 19467 18605 17801 17081 16438 15875 15374 14905 14469 14061
$$ packed form
1900000E85947j4773j4712j4617j4496j4356j4195j4027j3870j3709j3558j3402D16998
1940625D03951j2836j2603j2357j2104j1853j1607j1374j1140j0907j0661j0406B65949
1981250B56040r670r437r210q977q741q477q208p949p689p432p181o941o708o489A36669
2031250A30631n833n621n399n181m966m762m573m383m205m046l879l696l532l374F3954
2081250F0874k944k813k686k556k419k308k195k089j984j893j803j714j617j519B8912
2131250B7590j223j129j058j002r61r39r21q90q62q04p20o43n63n01m69m36A4061
2187500A3661  $$checkpoint
##END=
##TITLE= NH4[Cr(NH3)2(NCS)4]- Reinecke salt
##JCAMP-DX= 5.0
##DATA TYPE= UV/VIS SPECTRUM
##DATA CLASS= XYDATA
##BLOCK_ID= 9
##ORIGIN= Chemistry Department, UWI, JAMAICA $$Exported PE Spectrum Data File
##OWNER= Prof Robert J. Lancashire
##DATE= 02/07/09
##TIME= 11:47:52.00
##RESOLUTION= 1.000000
##SPECTROMETER/DATA SYSTEM= PERKIN-ELMER LAMBDA 19 UV/VIS/NIR UV
##$MODELS=
<Models>
<ModelData id="rein" type="MOL">
Reinecke Salt

  created with ArgusLab version 4.0.1
 21 20  0  0  0  0  0  0  0  0  0 V2000
   -2.0872   -3.1707    1.1748 S   0  0  0  0  0  0  0  0  0  0  0  0
   -1.7898   -1.6827    0.8419 C   0  0  0  0  0  0  0  0  0  0  0  0
   -1.5507   -0.4854    0.5740 N   0  0  0  0  0  0  0  0  0  0  0  0
   -1.1910    1.3153    0.1712 Cr  0  0  0  0  0  0  0  0  0  0  0  0
    0.4236    1.2068    1.1280 N   0  0  0  0  0  0  0  0  0  0  0  0
   -2.8056    1.4238   -0.7856 N   0  0  0  0  0  0  0  0  0  0  0  0
   -0.8313    3.1161   -0.2316 N   0  0  0  0  0  0  0  0  0  0  0  0
   -0.5921    4.3133   -0.4995 C   0  0  0  0  0  0  0  0  0  0  0  0
   -0.2950    5.8014   -0.8323 S   0  0  0  0  0  0  0  0  0  0  0  0
   -0.2977    0.7862   -1.3962 N   0  0  0  0  0  0  0  0  0  0  0  0
    0.2962    0.4344   -2.4383 C   0  0  0  0  0  0  0  0  0  0  0  0
    1.0342   -0.0028   -3.7334 S   0  0  0  0  0  0  0  0  0  0  0  0
   -2.0842    1.8444    1.7386 N   0  0  0  0  0  0  0  0  0  0  0  0
   -2.7716    2.3467    2.6538 C   0  0  0  0  0  0  0  0  0  0  0  0
   -3.6258    2.9710    3.7913 S   0  0  0  0  0  0  0  0  0  0  0  0
    0.6537    0.2380    1.2909 H   0  0  0  0  0  0  0  0  0  0  0  0
    1.1608    1.6425    0.5942 H   0  0  0  0  0  0  0  0  0  0  0  0
    0.3230    1.6819    2.0125 H   0  0  0  0  0  0  0  0  0  0  0  0
   -3.3873    0.6323   -0.5546 H   0  0  0  0  0  0  0  0  0  0  0  0
   -3.2854    2.2768   -0.5402 H   0  0  0  0  0  0  0  0  0  0  0  0
   -2.6108    1.4203   -1.7756 H   0  0  0  0  0  0  0  0  0  0  0  0
  1  2  2  0  0  0  0
  2  3  2  0  0  0  0
  3  4  1  0  0  0  0
  4  5  1  0  0  0  0
  4  7  1  0  0  0  0
  4 10  1  0  0  0  0
  4 13  1  0  0  0  0
  4  6  1  0  0  0  0
  5 16  1  0  0  0  0
  5 17  1  0  0  0  0
  5 18  1  0  0  0  0
  6 19  1  0  0  0  0
  6 20  1  0  0  0  0
  6 21  1  0  0  0  0
  7  8  2  0  0  0  0
  8  9  2  0  0  0  0
 10 11  2  0  0  0  0
 11 12  2  0  0  0  0
 13 14  2  0  0  0  0
 14 15  2  0  0  0  0
M  END
</ModelData>
</Models>
##$PEAKS=
<Peaks type="UV-Vis" xUnitsExpected="nm"  >
<PeakData id="1" title="Spin Allowed - delta ~520nm" peakShape="singlet" model="rein"  xMax="560" xMin="480"    />
<PeakData id="2" title="Spin Allowed ~ 392nm" peakShape="singlet" model="rein" xMax="430" xMin="370"    />
</Peaks>
##XUNITS= NANOMETERS
##YUNITS= ABSORBANCE
##XFACTOR= 3.41E-4
##YFACTOR= 8.79599929E-7
##FIRSTX= 359
##FIRSTY= 0.905159
##LASTX= 700
##NPOINTS= 342
##XYDATA= (X++(Y..Y))
$$ plain form
1052786 1029058 926422 839319 765990 704858 654399 613240 580196 554174 534187 519382 509036 502459
1090909 499028 498197 499534 502675 507257 512931 519415 526462 533777 541122 548318 555246 561792 567841 573307 578142
1137830 582310 585727 588355 590162 591123 591195 590351 588590 585932 582398 578000 572790 566820 560131 552747 544709 536072
1187683 526865 517099 506826 496127 485057 473691 462090 450323 438439 426452 414363 402217 390071
1225806 377974 366006 354224 342700 331469 320537 309908 299591 289615 280005 270796 262030 253760 245999
1266862 238747 232009 225766 220034 214823 210152 206022 202450 199428 196937 194964 193479 192509 192073 192173 192797 193966
1316716 195667 197890 200588 203750 207377 211454 215964 220891 226240 232005 238175 244735 251688 259014 266685 274671
1363636 282966 291563 300445 309623 319098 328851 338839 349016 359326 369733 380209 390750 401390 412158
$$ packed form
1052786A029058j02636q7103p3329o1132n0459m1159l3044k6022j9987j4805j0346E02459
1090909D99028q31J337L141M582N674O484P047P315P345P196O928O546O049N466E78142
1137830E82310L417K628J807R61P2q44j761k658l534m398n210n970o689p384q038E36072
1187683E26865r766j0273j0699j1070j1366j1601j1767j1884j1987j2089j2146C90071
1225806C77974j1968j1782j1524j1231j0932j0629j0317r976r610r209q766q270B45999
1266862B38747o738o243n732n211m671m130l572l022k491j973j485r70m36J00O24A93966
1316716A95667K223K698L162L627M077M510M927N349N765O170O560O953P326P671B74671
1363636B82966Q597Q882R178R475R753R988J0177J0310J0407J0476J0541J0640D12158
$$ plain form
1404692 423063 434108 445276 456493 467647 478612 489270 499532 509365 518777 527835 536659 545359 554038
1445748 562748 571488 580212 588850 597292 605416 613142 620425 627258 633645 639618 645230 650542 655605 660418 665004
1492669 669363 673485 677328 680856 684046 686881 689337 691390 693032 694245 695018 695320 695142 694488 693362 691767 689727
1542522 687274 684431 681229 677688 673835 669689 665257 660550 655579 650357 644906 639248 633398 627381 621215 614919
1589443 608495 601933 595240 588427 581479 574399 567200 559899 552514 545064 537557 530012 522441 514830 507195 499535
1636364 491852 484147 476429 468695 460944 453186 445420 437648 429869 422098 414336 406593 398879 391202 383579 376012
1683284 368478 360969 353488 346038 338623 331265 323969 316749 309596 302490 295420 288403 281452 274584 267809 261130
1730205 254559 248091 241704 235382 229141 222999 216957 211003 205144 199400 193769 188233 182790 177458 172245 167139
$$ packed form
1404692D23063J1045J1168J1217J1154J0965J0658J0262R833R412R058Q824Q700E54038
1445748E62748Q740Q724Q638Q442Q124P726P283O833O387N973N612N312N063M813F65004
1492669F69363M122L843L528L190K835K456K053J642J213P73L02j78o54j126j595F89727
1542522F87274k843l202l541l853m146m432m707m971n222n451n658n850o017o166F14919
1589443F08495o562o693o813o948p080p199p301p385p450p507p545p571p611p635D99535
1636364D91852p705p718p734p751p758p766p772p779p771p762p743p714p677p623C76012
1683284C68478p509p481p450p415p358p296p220p153p106p070p017o951o868o775B61130
1730205B54559o468o387o322o241o142o042n954n859n744n631n536n443n332n213A67139
$$ plain form
1777126 162143 157262 152495 147831 143264 138794 134436 130198 126082 122101 118245 114495 110849 107286 103802 100406
1824047 97118 93940 90887 87949 85127 82413 79787 77243 74785 72415 70136 67955 65866 63872 61957 60112
1870968 58334 56625 54989 53438 51952 50531 49167 47865 46634 45466 44357 43319 42350 41426 40547 39707 38917
1920821 38177 37465 36790 36165 35596 35077 34611 34193 33802 33430 33043 32660 32286 31925 31591 31291 31019 30764 30545 30350 30188
1982405 30044 29918 29810 29711 29609 29516 29442 29390 29354 29334 29317 29304 29278 29236 29197 29158 29118 29086 29062 29058 29080 29099 29120 29153
$$ packed form
1777126A62143m881m767m664m567m470m358m238m116l981l856l750l646l563l484A00406
1824047I7118l178l053k938k822k714k626k544k458k370k279k181k089j994j915F0112
1870968E8334j709j636j551j486j421j364j302j231j168j109j038r69r24q79q40C8917
1920821C8177p12o75o25n69n19m66m18l91l72l87l83l74l61l34l00k72k55k19j95C0188
1982405C0044j26j08r9j02r3p4n2l6k0j7j3k6m2l9l9m0l2k4mK2J9K1B9153
2052786B9173  $$checkpoint
##END=
##TITLE= [Cr(urea)6]Cl3
##JCAMP-DX= 4.24   $$ ISAS JCAMP-DX check program V1.1/a
##DATA TYPE= UV/VIS SPECTRUM
##BLOCK_ID= 10
##ORIGIN= Chemistry Department, UWI, JAMAICA $$Exported PE Spectrum Data File
##OWNER= Prof Robert J. Lancashire
##DATE= 02/07/22
##TIME= 16:33
##SPECTROMETER/DATA SYSTEM= PERKIN-ELMER LAMBDA 19 UV/VIS/NIR UV
##$MODELS=
<Models>
<ModelData id="urea" type="MOL">
Cr(urea)6- URCRCL
RLViewerPro         3D                             0

 25 24  0  0  0  0  0  0  0  0999 V2000
    0.0000    0.0000    0.0000 Cr  0  0  0  0  0  0  0  0  0  1
   -0.0940    1.6168    1.1049 O   0  0  0  0  0  0  0  0  0  4
    0.8334    2.4230    1.5429 C   0  0  0  0  0  0  0  0  0  5
    0.4496    3.6717    1.8481 N   0  0  0  0  0  0  0  0  0  6
    2.0865    2.0503    1.6573 N   0  0  0  0  0  0  0  0  0  7
    0.0940   -1.6168   -1.1049 O   0  0  0  0  0  0  0  0  0 13
   -1.3532   -0.8898    1.1049 O   0  0  0  0  0  0  0  0  0 14
    1.3532    0.8898   -1.1049 O   0  0  0  0  0  0  0  0  0 15
    1.4472   -0.7270    1.1049 O   0  0  0  0  0  0  0  0  0 16
   -1.4472    0.7270   -1.1049 O   0  0  0  0  0  0  0  0  0 17
   -0.8334   -2.4230   -1.5429 C   0  0  0  0  0  0  0  0  0 18
   -2.5150   -0.4898    1.5429 C   0  0  0  0  0  0  0  0  0 19
    2.5150    0.4898   -1.5429 C   0  0  0  0  0  0  0  0  0 20
    1.6817   -1.9332    1.5429 C   0  0  0  0  0  0  0  0  0 21
   -1.6817    1.9332   -1.5429 C   0  0  0  0  0  0  0  0  0 22
   -0.4496   -3.6717   -1.8481 N   0  0  0  0  0  0  0  0  0 23
   -2.0865   -2.0503   -1.6573 N   0  0  0  0  0  0  0  0  0 24
   -3.4046   -1.4465    1.8481 N   0  0  0  0  0  0  0  0  0 25
   -2.8189    0.7818    1.6573 N   0  0  0  0  0  0  0  0  0 26
    3.4046    1.4465   -1.8481 N   0  0  0  0  0  0  0  0  0 27
    2.8189   -0.7818   -1.6573 N   0  0  0  0  0  0  0  0  0 28
    2.9550   -2.2252    1.8481 N   0  0  0  0  0  0  0  0  0 29
    0.7324   -2.8321    1.6573 N   0  0  0  0  0  0  0  0  0 30
   -2.9550    2.2252   -1.8481 N   0  0  0  0  0  0  0  0  0 31
   -0.7324    2.8321   -1.6573 N   0  0  0  0  0  0  0  0  0 32
  1  2  1  0  0  0
  1  6  1  0  0  0
  1  7  1  0  0  0
  1  8  1  0  0  0
  1  9  1  0  0  0
  1 10  1  0  0  0
  2  3  2  0  0  0
  3  4  1  0  0  0
  3  5  1  0  0  0
  6 11  2  0  0  0
  7 12  2  0  0  0
  8 13  2  0  0  0
  9 14  2  0  0  0
 10 15  2  0  0  0
 11 16  1  0  0  0
 11 17  1  0  0  0
 12 18  1  0  0  0
 12 19  1  0  0  0
 13 20  1  0  0  0
 13 21  1  0  0  0
 14 22  1  0  0  0
 14 23  1  0  0  0
 15 24  1  0  0  0
 15 25  1  0  0  0
M  END
</ModelData>
</Models>
##$PEAKS=
<Peaks type="UV-Vis" xUnitsExpected="nm"  >
<PeakData id="1" title="Spin Forbidden Band ~694nm" peakShape="singlet" model="urea" xMax="710" xMin="670"    />
<PeakData id="2" title="Spin Allowed - delta ~624nm" peakShape="singlet" model="urea" xMax="650" xMin="600"    />
<PeakData id="3" title="Spin Allowed ~ 447nm" peakShape="singlet" model="urea" xMax="470" xMin="410"    />
</Peaks>
##RESOLUTION=   1.000000
##DELTAX=  -1.000000
##XUNITS= NANOMETERS
##YUNITS= ABSORBANCE
##XFACTOR=   .3051851E-01
##YFACTOR=   .2526176E-04
##FIRSTX=   1000.000
##LASTX=   350.0000
##MAXY=   .8277520
##MINY=   .2399087E-02
##NPOINTS=    651
##FIRSTY=   .3394008E-02
##XYDATA=(X++(Y..Y))
$$ plain form
32767 134 132 129 126 123 121 119 119 119 118 118 117 116 114 113 112 113 113 113 114 114 113 112 110 109 108 106 106 105 105 104 104 103 103 102 101 100 99 98 97 97 96 96 95 95 95 96 97 99 102 104 106 108 110 111 112 113 115 117 119 120 122 122 121 120 120 120 120 121 123 124 126 127 127 128
30342 128 127 127 128 128 129 129 130 130 130 130 130 131 131 131 131 131 130 128 127 125 124 123 123 123 124 125 125 126 126 127 127 126 126 127 127 126 125 124 124 122 122 122 122 123 123 123 123 124 124 124 126 127 129 130 130 129 128 126 123 122 121 124 129 136 145 155 162 167 171 175
28049 175 177 177 174 172 168 165 162 162 162 163 164 163 163 163 165 167 170 173 175 176 174 173 170 169 169 170 174 178 184 189 193 197 199 202 205 208 212 214 216 216 217 218 222 229 238 249 259 267 274 279 282 286 291 298 307 316 327 337 346 354 361
26050 361 369 376 385 396 408 422 437 453 470 488 506 525 545 566 587 608 629 652 675 699 725 753 782 813 846 880 915 951 989 1030 1071 1114 1158 1204 1253 1303 1356 1411
24805 1411 1469 1529 1589 1652 1717 1786 1858 1933 2010 2090 2173 2258 2347 2441 2539 2641 2747 2857 2970 3087 3209 3334 3464 3598 3736 3880 4029
23920 4029 4182 4341 4505 4674 4848 5028 5215 5409 5610 5818 6034 6257 6487 6723 6967 7217 7477 7746 8026 8319 8628
23232 8628 8952 9293 9655 10036 10438 10857 11291 11731 12168 12593 12991 13345 13622 13789 13819 13707 13472 13165 12857 12625 12526 12581
22511 12581 12778 13084 13458 13863 14277 14691 15108 15534 15974 16431 16906 17401 17911 18433 18962 19491 20013 20524 21020 21501 21964 22406
$$ packed form
32767A34klUkT%Tj%jTkjTJ%TJ%jTkjTk%j%j%j%jX%j%j%TJTKLKVJUKUJK%jT%UJKJKJ%J
30342A28j%J%J%J%VJ%VjkjkjT%TJT%J%J%j%J%jU%k%UJ%UJ%TKJKJ%jTkljTLNPRJ0PNMT
28049A75K%lkmlT%TJTj%TKTLTKJkjlj%JMTONMTKLUMKT%JTMPRJ1J0QPNLMNPRTJ1J0RQP
26050C61QPRJ1J2J4J5J6J7J8TJ9K0K1VK3TK4K6K8K9L1L3L4L5L6L8M1TM3M4M6M9N0N3N5
24805A411N8O0TO3O5O9P2P5P7Q0Q3Q5Q9R4R8J02J06J10J13J17J22J25J30J34J38J44J49
23920D029J53J59J64J69J74J80J87J94K01K08K16K23K30K36K44K50K60K69K80K93L09
23232H628L24L41L62L81M02M19M34M40M37M25L98L54K77J67L0j12k35l07l08k32r9N5
22511A2581J97L06L74M05M14TM17M26M40M57M75M95N10N22N29TN22N11M96M81M63M42
$$ plain form
21790 22406 22822 23205 23549 23848 24100 24309 24483 24636 24784 24942 25123 25334 25577 25849 26146 26463 26797 27144 27506 27880 28267
21102 28267 28662 29060 29456 29842 30211 30558 30877 31166 31424 31652 31851 32024 32174 32303 32412 32505 32583 32647 32697 32735 32758 32767 32760 32737 32695
20283 32695 32637 32561 32469 32360 32234 32090 31930 31753 31557 31346 31118 30874 30613 30336 30044 29735 29412 29075 28725 28364 27992 27609
19562 27609 27217 26815 26404 25984 25555 25117 24670 24215 23752 23282 22808 22329 21848 21364 20878 20391 19903 19415 18929 18445 17964 17486
18841 17486 17012 16541 16074 15611 15152 14699 14252 13810 13376 12949 12530 12119 11715 11320 10933 10555 10187 9828 9479 9141 8813
18153 8813 8495 8186 7888 7600 7322 7053 6796 6549 6312 6087 5871 5667 5474 5290 5117 4954 4801 4657 4524 4400 4288
17465 4288 4186 4094 4014 3944 3885 3836 3799 3772 3756 3751 3757 3774 3804 3845 3897 3961 4037 4126 4227 4341 4469 4611 4766 4935 5117 5312 5521 5743
16547 5743 5980 6231 6496 6776 7071 7381 7707 8048 8404 8775 9161 9562 9977 10405 10848 11305 11772 12248 12729 13207 13676
$$ packed form
21790B2406M16L83L44K99K52K09J74J53J48J58J81K11K43K72K97L17L34L47L62L74L87
21102B8267L95L98L96L86L69L47L19K89K58K28J99J73J50J29J09R3P8O4N0L8K3Rpk3m2
20283C2695n8p6r2j09j26j44j60j77j96k11k28k44k61k77k92l09l23l37l50l61l72l83
19562B7609l92m02m11m20m29m38m47m55m63m70m74m79m81m84m86m87m88Tm86m84m81m78
18841A7486m74m71m67m63m59m53m47m42m34m27m19m11m04l95l87l78l68l59l49l38l28
18153H813l18l09k98k88k78k69k57k47k37k25k16k04j93j84j73j63j53j44j33j24j12
17465D288j02r2q0p0n9m9l7k7j6nOJ7L0M1N2O4P6Q9J01J14J28J42J55J69J82J95K09K22
16547E743K37K51K65K80K95L10L26L41L56L71L86M01M15M28M43M57M67M76M81M78M69
$$ plain form
15859 13676 14129 14563 14977 15373 15758 16138 16520 16907 17301 17700 18101 18506 18912 19323 19740 20165 20597 21036 21477 21918 22355 22784
15138 22784 23202 23606 23993 24363 24713 25041 25348 25630 25887 26118 26322 26500 26651 26774 26868 26933 26967 26969 26940 26880 26788 26667 26515 26335
14352 26335 26126 25889 25626 25336 25020 24678 24311 23920 23505 23070 22615 22142 21652 21146 20626 20093 19550 18996 18435 17867 17296
13664 17296 16721 16145 15569 14996 14425 13857 13294 12737 12188 11648 11119 10603 10099 9609 9132 8669 8220 7786 7366 6963 6575 6204
12943 6204 5848 5507 5181 4870 4574 4294 4028 3777 3540 3317 3106 2909 2724 2551 2388 2235 2092 1958 1835 1721 1619
12255 1619 1527 1443 1367 1297 1231 1171 1116 1065 1021 980 943 910 878 849 823 799 778 760 746 734 725 717 711 706
$$ packed form
15859A3676M53M34M14L96L85L80L82L87L94L99M01M05M06M11M17M25M32M39M41TM37M29
15138B2784M18M04L87L70L50L28L07K82K57K31K04J78J51J23R4O5L4Kk9o0r2j21j52j80
14352B6335k09k37k63k90l16l42l67l91m15m35m55m73m90n06n20n33n43n54n61n68n71
13664A7296n75n76Tn73n71n68n63n57n49n40n29n16n04m90m77m63m49m34m20m03l88l71
12943F204l56l41l26l11k96k80k66k51k37k23k11j97j85j73j63j53j43j34j23j14j02
12255A619r2q4p6p0o6o0n5n1m4m1l7l3l2k9k6k4k1j8j4j2rqon
11468G06
##END=
##END= $$ of all data