##TITLE= Compound file, contains several data records
##JCAMP-DX= 5.0
##DATA TYPE= LINK
##BLOCKS=4
##ORIGIN= Department of Chemistry, UWI, JAMAICA
##OWNER= public domain
##TITLE= acetophenone
##JCAMP-DX= 4.24   $$ ISAS JCAMP-DX check program V1.1/a
##DATA TYPE= INFRARED SPECTRUM
##BLOCK_ID=1
##ORIGIN= Dept of Chemistry, UWI, JAMAICA
##OWNER= Public domain
##DATE=99/10/22
##TIME=13:54:00
##SPECTROMETER/DATA SYSTEM= PERKIN-ELMER 1000 FT-IR
##CAS REGISTRY NO=98-86-2
##MOLFORM=C 8 H 8 O
##$MODELS=
<Models>
 <ModelData id="acetophenone" type="MOL">
acetophenone
  DSViewer          3D                             0

 17 17  0  0  0  0  0  0  0  0999 V2000
   -1.6931    0.0078    0.0000 C   0  0  0  0  0  0  0  0  0  1
   -0.2141    0.0078    0.0000 C   0  0  0  0  0  0  0  0  0  2
    2.5839    0.0872    0.0000 C   0  0  0  0  0  0  0  0  0  3
    0.4615    1.2373   -0.0005 C   0  0  0  0  0  0  0  0  0  4
    0.5257   -1.1809    0.0001 C   0  0  0  0  0  0  0  0  0  5
    1.9188   -1.1393    0.0005 C   0  0  0  0  0  0  0  0  0  6
    1.8539    1.2756   -0.0001 C   0  0  0  0  0  0  0  0  0  7
   -0.1262    2.1703   -0.0009 H   0  0  0  0  0  0  0  0  0  8
    0.0144   -2.1556    0.0002 H   0  0  0  0  0  0  0  0  0  9
    2.4947   -2.0764    0.0009 H   0  0  0  0  0  0  0  0  0 10
    2.3756    2.2439   -0.0001 H   0  0  0  0  0  0  0  0  0 11
    3.6838    0.1161    0.0003 H   0  0  0  0  0  0  0  0  0 12
   -2.3403    1.0639    0.0008 O   0  0  0  0  0  0  0  0  0 13
   -2.3832   -1.3197   -0.0010 C   0  0  0  0  0  0  0  0  0 14
   -2.0973   -1.8988    0.9105 H   0  0  0  0  0  0  0  0  0 15
   -2.0899   -1.9018   -0.9082 H   0  0  0  0  0  0  0  0  0 16
   -3.4920   -1.1799   -0.0059 H   0  0  0  0  0  0  0  0  0 17
  1  2  1  0  0  0
  2  5  4  0  0  0
  2  4  4  0  0  0
  3 12  1  0  0  0
  4  7  4  0  0  0
  5  6  4  0  0  0
  6 10  1  0  0  0
  6  3  4  0  0  0
  7  3  4  0  0  0
  7 11  1  0  0  0
  8  4  1  0  0  0
  9  5  1  0  0  0
 13  1  2  0  0  0
 14 16  1  0  0  0
 14  1  1  0  0  0
 14 15  1  0  0  0
 17 14  1  0  0  0
M  END
  </ModelData>
 <ModelData id="1" type="XYZVIB" baseModel="acetophenone" vibrationScale=".1">
17
1  Energy: -1454.38826  Freq: 3199.35852
C    -1.693100    0.007800    0.000000   -0.000980    0.000120    0.000000
C    -0.214100    0.007800    0.000000    0.003900    0.000240    0.000000
C     2.583900    0.087200    0.000000   -0.072220   -0.001840   -0.000020
C     0.461500    1.237300   -0.000500    0.010380   -0.018700    0.000000
C     0.525700   -1.180900    0.000100    0.015340    0.031820    0.000000
C     1.918800   -1.139300    0.000500   -0.040360    0.066100   -0.000040
C     1.853900    1.275600   -0.000100   -0.033500   -0.061960    0.000000
H    -0.126200    2.170300   -0.000900   -0.119140    0.189180   -0.000080
H     0.014400   -2.155600    0.000200   -0.186580   -0.348620    0.000020
H     2.494700   -2.076400    0.000900    0.475780   -0.775720    0.000360
$$ [...]
##$PEAKS=
<Peaks type="IR" xUnits="1/cm" yUnits="TRANSMITTANCE" >
<PeakData id="1" title="asymm stretch of aromatic CH group (~3100 cm-1)" peakShape="broad" model="1.1" xMax="3121" xMin="3092"  yMax="1" yMin="0" />
<PeakData id="2" title="symm stretch of aromatic CH group (~3085 cm-1)" peakShape="broad" model="1.2" xMax="3091" xMin="3072"  yMax="1" yMin="0" />
<PeakData id="3" title="asymm stretch of CH group (~3060 cm-1)" peakShape="broad" model="1.3" xMax="3071" xMin="3049"  yMax="1" yMin="0" />
<PeakData id="4" title="symm stretch of CH group (~3040 cm-1)" peakShape="broad" model="1.4" xMax="3048" xMin="3032"  yMax="1" yMin="0" />
<PeakData id="5" title="asymm bend of CH3 group (~3030 cm-1)" peakShape="broad" model="1.5" xMax="3031" xMin="3020"    yMax="1" yMin="0" />
<PeakData id="6" title="asymm stretch of methyl group (~3005 cm-1)" peakShape="broad" model="1.6" xMax="3015" xMin="2985"  yMax="1" yMin="0" />
<PeakData id="7" title="symm stretch of methyl group (~2970 cm-1)" peakShape="broad" model="1.7" xMax="2980" xMin="2951"   yMax="1" yMin="0" />
<PeakData id="8" title="symm stretch of CH group (~2920 cm-1)" peakShape="broad" model="1.8" xMax="2945" xMin="2890"  yMax="1" yMin="0" />
<PeakData id="9" title="Carbonyl stretching band (~1685 cm-1)" peakShape="broad" model="1.9" xMax="1715" xMin="1655"  yMax="1" yMin="0" />
<PeakData id="10" title="C-C of aromatic group (~1600 cm-1)" peakShape="broad" model="1.12" xMax="1630" xMin="1570"  yMax="1" yMin="0" />
<PeakData id="11" title="symm stretch of CH3 group (~1450 cm-1)" peakShape="broad" model="1.14" xMax="1470" xMin="1430"  yMax="1" yMin="0" />
<PeakData id="12" title="C-H twist of methyl group (~1360 cm-1)" peakShape="broad" model="1.16" xMax="1390" xMin="1330"  yMax="1" yMin="0" />
<PeakData id="13" title="scissors of aromatic C-H groups (~1265 cm-1)" peakShape="broad" model="1.21" xMax="1285" xMin="1245"  yMax="1" yMin="0" />
<PeakData id="14" title="scissors of CH group (~1180 cm-1)" peakShape="broad" model="1.22" xMax="1220" xMin="1140"  yMax="1" yMin="0" />
<PeakData id="15" title="symm stretch of CH3 group (~1080 cm-1)" peakShape="broad" model="1.25" xMax="1108" xMin="1048"  yMax="1" yMin="0" />
<PeakData id="16" title="symm stretch of CH group (~1025 cm-1)" peakShape="broad" model="1.26" xMax="1045" xMin="1015"  yMax="1" yMin="0" />
<PeakData id="17" title="asymm bend of CH3 group (~1000 cm-1)" peakShape="broad" model="1.27" xMax="1014" xMin="981"  yMax="1" yMin="0" />
<PeakData id="18" title="aromatic ring perturbation mode (~955 cm-1)" peakShape="broad" model="1.28" xMax="976" xMin="936"  yMax="1" yMin="0" />
<PeakData id="19" title="aromatic ring perturbation mode (~760 cm-1)" peakShape="broad" model="1.31" xMax="780" xMin="740"  yMax="1" yMin="0" />
<PeakData id="20" title="aromatic ring perturbation mode (~690 cm-1)" peakShape="broad" model="1.33" xMax="710" xMin="670"  yMax="1" yMin="0" />
<PeakData id="21" title="concerted rocking mode of CH groups (~590 cm-1)" peakShape="broad" model="1.37" xMax="605" xMin="560"  yMax="1" yMin="0" />
</Peaks>
##DELTAX=   .9643013
##XUNITS= 1/CM
##YUNITS= TRANSMITTANCE
##XFACTOR=   .1221008    
##YFACTOR=   .2982387E-04
##FIRSTX=   499.5000    
##LASTX=   4000.878    
##MAXY=   .9772386    
##MINY=   .9185180E-04
##NPOINTS=   3632
##FIRSTY=   .6180727    
##XYDATA=(X++(Y..Y))
$$ [...]
290231A074l247j739K709J034j961J534p75K050K11k742o76O16j90K469l59J950
$$ 1074 -2173 -3912 -1203 -169 -2130 -596 -1371 679 890 -1852 -2528 -1912 -2102 367 8 1958
290719A958j853o13j574J393J316K920o01k180m88j502j520K427K476j412j452
$$ 1958 105 -508 -2082 -689 627 3547 2946 766 278 -1224 -2744 -317 2159 747 -705
291177g05K97j847Q37l63J637R77q69l96n94J996O40k594P25M136j388m28N16
$$ -705 -408 -2255 -1418 -1781 -144 833 -36 -432 -1026 970 1610 -984 -259 3877 2489 2061 2577
291695B577k168k02J83n35j735R81n73Q01K442J747K01l538J118j354k507J332
$$ 2577 409 207 390 -145 -1880 -899 -1472 -671 1771 3518 3719 181 1299 -55 -2562 -1230
292184a230j55L25J131q83p20j023O38O7n61N03M00R96r5J645J9k814o77L490
$$ -1230 -1385 -1060 71 -812 -1532 -2555 -1917 -1850 -2411 -1908 -1508 -512 -607 1038 1057 -1757 -2434 1056
292733A056k029P44L75l00P7K25P45J475k554j445j373L258j839J372J312k426
$$ 1056 -973 -229 146 -154 -77 148 893 2368 -186 -1631 -3004 254 -1585 -213 1099 -1327
293221a327j280N262j768j209K28M33k009O28R70q17K279J011O36k634J922l38
$$ -1327 -2607 2655 887 -322 -94 339 -1670 -1042 -72 -889 1390 2401 3037 403 2325 1987
293710A987j455j710k7P48P41J042j42j115J395k90L3j063p44R65j866J58J789
$$ 1987 532 -1178 -1205 -457 284 1326 1184 69 1464 1174 1207 144 -600 365 -1501 -1343 446
294229D46k377n72J140K72j31k62L247N18q09j700l566L555J520k560l171j310
$$ 446 -1931 -2503 -1363 -1091 -1222 -1484 1763 2281 1472 -228 -3794 -239 1281 -1279 -4450 -5760
294717e760O394J345j455K398k233J618J230l120O50j793Q44K29k547J905P07
$$ -5760 634 1979 524 2922 689 2307 3537 417 1067 -726 118 347 -2200 -295 412
295175D12j09K44m288L223j53l71J104j41j957J420K282l266k4M70o50J528j6
$$ 412 303 547 -3741 -518 -671 -1042 62 -79 -2036 -616 1666 -1600 -1624 -1154 -1804 -276 -292
295693b92k08L42O88m10j998O63l412L028K179J606M56k210J421k820J27J548
$$ -292 -500 -158 530 120 -1878 -1215 -4627 -1599 580 2186 2642 432 1853 -967 -840 708
296182G08L729j686R58m294K55N46j815j194J316R52Q4J532k495k484L158k879
$$ 708 4437 2751 3709 -585 -330 216 -1599 -2793 -1477 -525 -441 1091 -1404 -3888 -730 -3609
296670c609K047J928r67P75j92m08L6J814j842p43K886l06l528P49J709j526j201
$$ -3609 -1562 366 -601 174 -18 -426 -390 1424 -418 -1161 1725 1419 -2109 -1360 349 -1177 -2378
297189b378p13n61K774o13L398j71m086J639K343o33l651K237l1O44p2P88J547
$$ -2378 -3091 -3652 -878 -1491 1907 1736 -2350 -711 1632 999 -2652 -415 -446 198 126 914 2461
297708B461j419k120K00K09J79PO27j861Q30k412N38J85K158O47J173l138L91
$$ 2461 1042 -1078 -878 -669 -490 -483 144 -1717 -887 -3299 -2761 -2576 -418 229 1402 -1736 -1345
298226a345M1R90j92j859J328k225K535o48J88J338J165o73Q62J693k093k26K29
$$ -1345 -1304 -314 -506 -2365 -1037 -3262 -727 -1375 -1187 151 1316 643 1505 3198 1105 879 1108
298745A108J620j887J845j898L42J073M33L26l518k216L866k635k83N16K952j029
$$ 1108 2728 841 2686 788 1130 2203 2636 2962 -556 -2772 1094 -1541 -1824 -1308 1644 615
299234F15j799k241J487j170J387p73J941k94Q15o67j393j800K128J821j270J194
$$ 615 -1184 -3425 -1938 -3108 -1721 -2494 -553 -847 -32 -699 -2092 -3892 -1764 57 -1213 -19
299722a9K454l984M09r30J154P65L754M20j795j824J2L17J149j842J706N04j259
$$ -19 2435 -1549 -1140 -2070 -916 -151 3603 4023 2228 404 416 733 1882 40 1746 2250 991
300241I91K09J185l299k130M133j573k19R97j563J459q77J337j459K223l50n52
$$ 991 1200 2385 -914 -3044 1089 -484 -703 294 -1269 190 -687 650 -809 1414 1064 512
300729E12o79q42J747J758L78l936m14K294L91M10K41r52j327J005R44p55J802
$$ 512 -167 -1009 738 2496 2874 -1062 -1476 818 1209 1619 1860 908 -419 586 1530 775 2577
301248B577k128P90q49l03J856J262l658J806R62n66J050j116N10k90j589j276
$$ 2577 449 1239 390 87 1943 3205 -453 1353 2315 1749 2799 1683 2193 1903 314 -962
301736i62O74p23K333M22K96N12l174l25k84j234K736j115J556k388K80K33n45
$$ -962 -288 -1011 1322 1744 2040 2552 -622 -947 -1231 -2465 271 -844 712 -1676 -1396 -1163 -1708
302255a708r80q15O14K502k269r30L667j022o22r43J205k523J999j553K262j69
$$ -1708 -2688 -3503 -2889 -387 -2656 -3586 81 -941 -1563 -2506 -1301 -3824 -1825 -3378 -1116 -1285
302743a285N39k887M489L97k113j625L397J586o76J081M14l431J099j522j152
$$ -1285 -746 -3633 856 1253 -860 -2485 912 2498 1822 2903 3317 -114 985 -537 -1689
303201a689L433j343N40l173P98k939L429J284J262j646j270L87L40J365j563
$$ -1689 1744 401 941 -2232 -1434 -4373 -944 340 1602 -44 -1314 -927 -587 778 -785
303659g85N16P09l226L160K67j28J508j900j822R80r82J91O63J803j572j038N60
$$ -785 -269 440 -2786 374 641 513 2021 121 -1701 -721 -1703 -1512 -849 954 -618 -1656 -1096
304178a096K735J09j241K735K01j082l01j68l618M54j420J002Q62K52Q0m38R10
$$ -1096 1639 1748 507 3242 3443 2361 2060 1892 -1726 -1272 -2692 -1690 -828 -576 -496 -934 -24
304696b4o94j547K95J945m33J61J577l93J18l743P91J26K562k043J005k373K416
$$ -24 -718 -2265 -1970 -25 -458 -297 1280 887 1005 -2738 -1947 -1821 741 -1302 -297 -2670 -254
305215b54l203L116l82L879k097M08Q28j203j498K58O29j026K791j149l049K807
$$ -254 -3457 -341 -723 3156 1059 1467 2295 1092 -406 -148 481 -545 2246 1097 -1952 855
305703H55k65j719J605O8k620J337J473J126P4j019n09l32o14j377N99j464K331
$$ 855 590 -1129 476 544 -2076 -739 734 1860 1934 915 406 74 -540 -1917 -1318 -2782 -451
306222d51q83j940J783l81J351k062J277J343K465m215J258O22P88m75K023o9
$$ -451 -1334 -3274 -1491 -1872 -521 -2583 -1306 37 2502 -1713 -455 167 955 480 2503 2434
306711B434n719J924J948j403m59J874o37k670J739q52K067J07M95J875l849J931
$$ 2434 -3285 -1361 587 -816 -1275 599 -38 -2708 -969 -1821 246 353 848 2723 -1126 805
307199H05K346k21L3L904K543O302O798J6567P598j0327j4069r390j192l280j687
$$ 805 3151 2930 2963 6867 9410 15712 22510 39077 46675 36348 22279 12889 11697 8417 6730
307657F730L46Q62k450n096L237r61n04o00n40J85n76J296o35l089J422M497j386
$$ 6730 7076 7938 5488 392 3629 2668 2164 1564 1024 1209 633 1929 1294 -1795 -373 4124 2738
308176B738j529Q95k767j198M189l032J172j122J545k606J735N41J226l16k153
$$ 2738 1209 2104 -663 -1861 2328 -704 468 -654 891 -1715 20 561 1787 1471 -682
308633f82j94o41p0K84M69K927l787Q17J631O26j916o85L61J604j506J940l65
$$ -682 -876 -1517 -1587 -1303 -834 2093 -1694 -877 754 1380 -536 -1221 -860 744 -762 1178 813
309152H13m6j745J615j632Q31K344j206o73r19J287m26j742j078N737k329j869
$$ 813 767 -978 637 -995 -164 2180 974 301 -618 669 243 -1499 -2577 3160 831 -1038
309640a038K130m88n31L289R44M42K859K016o87N841J0236J3378P576j0567j3914
$$ -1038 1092 604 73 3362 4306 4748 7607 9623 8936 14777 25013 38391 45967 35400 21486
310098B1486q768j690m89m446qp50P37j185n4O28m726O82J121j961j393L047l190
$$ 21486 12718 11028 10539 6093 6085 5335 6072 4887 4833 5461 735 1417 2538 577 -816 2231 -959
310617i59j33J438m01j35M10M99J052M41J754k050j406l22J206j462k936L691
$$ -959 -1092 346 -55 -190 220 719 1771 2212 3966 1916 510 188 1394 -68 -3004 687
311105F87O99l224p20R90K282j829J296J525L04l268K231L669m789j55j87o19
$$ 687 1386 -1838 -2558 -1568 714 -1115 181 1706 2010 -1258 973 4642 -147 -302 -489 -1108
311593a108Q89p79L6N26j651K074L755j645O6J349q75l600J307R82j581n91l0
$$ -1108 -219 -998 -962 -436 -2087 -13 3742 2097 2163 3512 2637 -963 344 1326 -255 -846 -876
312112h76K098o24K049j2j91p10n92K252K275l831L757N707M107J0021R411O935
$$ -876 1222 598 2647 2635 2444 1734 1142 3394 5669 1838 5595 11302 15409 25430 34841 41776
312600D1776l991j3117p897q130o46o14m92N96l577j490K367j780l432J937L390
$$ 41776 37785 24668 16771 8641 7995 7381 6889 7485 3908 2418 4785 3005 -427 1510 4900
313059D900l420L89L83k037J750j648j024k006K540o37J273R07n41j296l46M26
$$ 4900 1480 1869 2252 215 1965 317 -707 -2713 -173 -810 463 1370 829 -467 -813 -387
313547c87M02l062K621Q09j758J388k314L203j418K10q27K27J372J655j478p36
$$ -387 15 -3047 -426 383 -1375 13 -2301 902 -516 -306 -1133 -906 466 2121 643 -93
314035i3R21J131j044K685j430J307l079M291k724n19P14k136L10l06N44J65k020
$$ -93 828 1959 915 3600 2170 3477 398 4689 1965 1446 2160 24 334 28 572 737 -1283
314554a283K59o87J968j383K509q45q26r48K71O33L042k846j023k500J316K082
$$ -1283 -1024 -1711 257 -1126 1383 538 -288 -1236 -965 -332 2710 -136 -1159 -3659 -2343 -261
315042b61J259K120k710M71l270K779j783l0J384L170k30j197j079m18l13j403
$$ -261 998 3118 408 879 -2391 388 -1395 -1425 -41 3129 2899 1702 623 205 -108 -1511
315530a511o29o22p11J513l78J458o40j73K236o44J454k21K743m21N33j605l007
$$ -1511 -2140 -2762 -3473 -1960 -2338 -880 -1520 -1693 543 -101 1353 1132 3875 3454 3987 2382 -625
316049f25O74j518L619k516p22L817k208L63L60k953L328J470J0j491r83j285
$$ -625 49 -1469 2150 -366 -1088 2729 521 884 1244 -1709 1619 3089 3099 1608 625 -660
316537f60J565l24j947J998k702J146M276l206J62k96j097q32J486J26K9k84l18
$$ -660 905 581 -1366 632 -2070 -924 3352 146 308 12 -1085 -1917 -431 -305 -276 -560 -878
317056h78k207L662p53j483o71R57K906J784q39k520j834j674J802K797j311J533
$$ -878 -3085 577 -176 -1659 -2330 -1373 1533 3317 2478 -42 -1876 -3550 -1748 1049 -262 1271
317545A271L56j301m02k556Nk99K579k347K433l14O10j309l20M39L65Q96J521
$$ 1271 1627 326 -76 -2632 -2627 -2926 -347 -2694 -261 -575 35 -1274 -1594 -1155 -790 106 1627
318064A627k147k064L109m052J698O12j213n10K427p00K110j870l430K450L45
$$ 1627 -520 -2584 525 -3527 -1829 -1217 -2430 -2940 -513 -1213 897 -973 -4403 -1953 -1608
318521a608k273K385K994r92j078J49J253P40J575l954L85J296o91Q85L25j517
$$ -1608 -3881 -1496 1498 506 -572 -423 830 1570 3145 -809 -424 872 181 1066 1391 -126
319010a26m50k218J946n32J090K35R32j490J921j14k947J281J326l292K8J663
$$ -126 -576 -2794 -848 -1380 -290 -55 877 -613 1308 1194 -1753 -472 854 -2438 -2410 -747
319498g47j67R55j730M008M27j860k165K982j417j036J932l273J682Mj120k310
$$ -747 -914 41 -1689 2319 2746 886 -1279 1703 286 -750 1182 -2091 -409 -405 -1525 -3835
319986c835K712j60M9O72o6Q55M46r7j472J020j04J258k227l040K33L428j761
$$ -3835 -1123 -1283 -1234 -562 -628 227 673 576 -896 124 20 1278 -949 -3989 -3756 -328 -2089
320505b089L7M32m1J782Q7J625l024O26l02R88l78J806k305O79R48j940r29j319
$$ -2089 -2052 -1620 -1661 121 208 1833 -1191 -565 -867 121 -257 1549 -756 -77 871 -1069 -1998 -3317
321054c317J974L836l321K12K376o63J562O78j729P40k83p27j840J789P65j874
$$ -3317 -1343 2493 -828 -616 1760 1097 2659 3337 1608 2348 2065 1338 -502 1287 2052 178
321542A78K345j534K26l186K583M75l78K70o9j74j124K180L4p5j926j335K228
$$ 178 2523 989 1215 -1971 612 1087 709 979 910 736 -388 1792 1826 1751 -175 -1510 718
322062G18m442N80r04K512R38k95j049Q61J304J049K106k266l327M005l65j831
$$ 718 -3724 -3144 -4048 -1536 -598 -893 -1942 -1081 223 1272 3378 1112 -2215 1790 1425 -406
322550d06l15l198L046j219J230N3k84J525O49m18m55l04k675R86J361Q09j070
$$ -406 -721 -3919 -873 -2092 -862 -809 -1093 432 1081 663 208 -96 -2771 -1785 -424 385 -685
323069f85O04R16O96L08j166j028k619K965O90O76p18Q34j841O23k565J048R74
$$ -685 -81 835 1531 1839 673 -355 -2974 -9 681 1357 639 1473 -368 255 -2310 -1262 -288
323587b88K286j467j590j981K231p38m77J744l447J830L510rk210r33K614m652
$$ -288 1998 531 -1059 -3040 -809 -1547 -2024 -280 -3727 -1897 1613 1604 -606 -1539 1075 -3577
324076c577J999N30K167j976K408J100k052l963J996o06J256J493k787J869M366
$$ -3577 -1578 -1048 1119 -857 1551 2651 599 -3364 -1368 -1974 -718 775 -2012 -143 4223
324533D223j689k251L117m27m44k028J634j38j585j425r43o5L236j072j659J533
$$ 4223 2534 283 3400 2973 2529 501 2135 1997 412 -1013 -1956 -2021 1215 143 -1516 17
325022A7L02j093p11R39O07J78j232m62P40J212R59L33l8q90k747K802J535k240
$$ 17 319 -774 -1485 -546 61 239 -993 -1455 -715 497 1456 1789 1751 861 -1886 916 2451 211
325571B11k059K339j057K505j755J175p03j812j441J115K882l133M61P70J019
$$ 211 -1848 491 -566 1939 184 1359 656 -1156 -2597 -1482 1400 -1733 -1272 -502 517
326029E17k61j066p75M94P0J573L29r54j845O64k196K394M02q82J215k929RK607
$$ 517 256 -810 -1585 -1091 -1021 552 881 -73 -1918 -1254 -3450 -1056 -654 -1536 -321 -3250 -3241 -634
326578f34j624J146L334k394P71q8J27q93m94O41M17J370j919J663o77j276J6
$$ -634 -2258 -1112 2222 -172 599 511 638 -255 -749 -108 309 1679 -240 1423 746 -530 -514
327097e14R42J378n34k17j849j098L185L94k416L00K718k282r67N71M55K05m69
$$ -514 428 1806 1272 1055 -794 -1892 1293 1687 -729 -429 2289 7 -960 -389 66 271 -198
327616a98q19J126R25j240K160O8k522L85P13j397K34M24J361m92j348m90J24
$$ -198 -1017 109 1034 -206 1954 2022 -500 -115 598 -799 -565 -141 1220 728 -620 -1110 -986
328135i86l7P36oJ781J261k385k293J629K429k137O03j489O33k41R20n64k80J97
$$ -986 -1023 -287 -293 1488 2749 364 -1929 -300 2129 -8 595 -894 -261 -502 418 -146 -426 -229
328684b29j40J525n0J677j609l116J411J35j205P01M77j237Q06j103R25L13j831
$$ -229 -369 1156 1106 2783 1174 -1942 -531 -396 -1601 -900 -423 -1660 -854 -1957 -1032 -719 -2550
329203b550K100J220j73M90n22k89O64j468k457L467k779n32J526K179J510m324
$$ -2550 -450 770 597 1087 565 276 940 -528 -2985 482 -2297 -2829 -1303 876 2386 -1938
329691a938j49k93m7Q09N05M215q58J813p49j758j924q60l3O78l79K83j038K21
$$ -1938 -2087 -2380 -2427 -1618 -1113 3102 2244 4057 3308 1550 -374 -1234 -1267 -589 -968 -685 -1723 -1502
330240a502K244j437p16N806k761J001O59j177N22l936J969J267l293J871m30
$$ -1502 742 -695 -1411 4395 1634 2635 3294 2117 2639 -1297 672 1939 -1354 517 87
330698H7j500N86J370J04J800o60l536J002j588j80L233M44N10n992L036j023
$$ 87 -1413 -827 543 647 2447 1787 -1749 -747 -2335 -2515 718 1162 1672 -4320 -1284 -2307
331186b307L099j220j481K650l258pK98k44J70R31L021j137j663l923O429j109
$$ -2307 792 -428 -1909 741 -2517 -2524 -2226 -2470 -2300 -1369 1652 515 -1148 -5071 1358 249
331675B49o52q41J485k69k692O64N049j712k787M036n486M74j00l091N816k051
$$ 249 -403 -1244 241 -28 -2720 -2056 2993 1281 -1506 2530 -2956 -2482 -2582 -5673 143 -1908
332163a908r95K740J703p87J863k100M42k715m29L709K064r31n787K518J427J634
$$ -1908 -2903 -163 1540 753 2616 516 958 -1757 -2186 1523 3587 2656 -3131 -613 814 2448
332651B448m96j218K15J860l657J758j631K485n70o06r45N59k559N683n110k060
$$ 2448 1952 734 949 2809 -848 910 -721 1764 1194 588 -357 202 -2357 3326 -1784 -3844
333140c844M37L954J163l599J258J486l02j189J398j306l74q7K778k138j84K5
$$ -3844 -3407 547 1710 -1889 -631 855 553 -636 762 -544 -918 -1005 1773 -365 -549 -524
333628e24j75l35J863j133J534j027J583k873N120n495L85R17j029J260K116l622
$$ -524 -699 -1034 829 -304 1230 203 1786 -1087 4033 -1462 -1077 -160 -1189 71 2187 -1435
334116a435K296m09j709L501k002j250J383k493M5k637K406J78Q78J470m21J468
$$ -1435 861 452 -1257 2244 242 -1008 375 -2118 -2073 -4710 -2304 -2126 -1248 222 -199 1269
334604A269o33O38j255K225j064p90k18Q47j718m94n69N391k344J341o49j588
$$ 1269 636 1274 19 2244 1180 390 172 1019 -699 -1193 -1762 3629 1285 2626 1977 389
335093C89J55k167k74J625k74p4m2k941J092R92Q39K108j755j140m87K228r14
$$ 389 544 -1623 -1897 -272 -546 -620 -662 -3603 -2511 -1519 -680 1428 -327 -1467 -1954 274 -640
335611f40N39l246R89R35j652K501J004N23j788J094k172L150n43N2j462J309
$$ -640 -101 -3347 -2358 -1423 -3075 -574 430 953 -835 259 -1913 1237 694 746 -716 593
336100E93J892l514p30K041N03j059k315K653j564M621l107j67q51L088k243j619
$$ 593 2485 -1029 -1759 282 785 -274 -2589 64 -1500 3121 14 -153 -1004 2084 -159 -1778
336588a778J293q10J771R3j517J854n11k24j039J328Q21k332o9P32J037k840K534
$$ -1778 -485 -1295 476 569 -948 906 395 171 -868 460 1281 -1051 -1120 -388 649 -2191 343
337107C43k018r24J251k92P43K228j425K109l043J293p71O47J406N67m175L740
$$ 343 -1675 -2599 -1348 -1640 -897 1331 -94 2015 -1028 265 -506 141 1547 2114 -2061 1679
337595A679J812l044J82o86L40O47M01l12m10k926J114j330L795j295j133o60
$$ 1679 3491 447 629 -57 283 930 1331 1019 609 -2317 -1203 -2533 1262 -33 -1166 -1826
338084a826K649L76J77k27j25k10r31k804M74K778o22R10p27j097k325K900p38
$$ -1826 823 1199 1376 1149 1024 814 -117 -2921 -2447 331 -291 619 -108 -1205 -3530 -630 -1368
338602a368J561l240J893J528m45J183j321r38M30L039n686K352l247J133k081
$$ -1368 193 -3047 -1154 374 -71 1112 -209 -1147 -717 2322 -3364 -1012 -4259 -3126 -5207
339060e207M811q28r61j785L636j198L302N83r98j645o67J236P64l149J968J94
$$ -5207 -396 -1224 -2185 -3970 -334 -1532 1770 2353 1355 -290 -957 279 1043 -2106 -138 56
339548E6l2l315L931P25J479J80k028m927K980Q8J531P21j29l559J162Q00J889
$$ 56 24 -3291 640 1365 2844 3024 996 -3931 -951 -863 668 1389 1260 -2299 -1137 -337 1552
340067A552k283L69j825L299j958j95K752n97n12j065J071l62j178q58K90J868
$$ 1552 -731 -362 -2187 1112 -846 -1041 1711 1114 602 -463 608 246 -932 -1790 -1500 368
340555C68Ql011Q27J525n16J020J296j989J01j874K552J500r83L35j077j91K29
$$ 368 376 -2635 -1808 -283 -799 221 1517 -472 -371 -2245 307 1807 824 1159 82 -109 120
341075A20J852l326K072J131n94O66j331k520Q97p44j424K674j872J38L332p20
$$ 120 1972 -1354 718 1849 1255 1921 590 -1930 -1033 -1777 -3201 -527 -2399 -2261 1071 351
341563C51K2k85l19j185l93j3L117j941J492k74k24J053j733j845L162j337K654
$$ 351 373 88 -231 -1416 -1809 -1822 1295 -646 846 572 348 1401 -332 -2177 985 -352 2302
342082B302j77l134O22j605K004P27L09K265m192P83j547L386N04k006j113r57
$$ 2302 2125 -1009 -387 -1992 12 739 1048 3313 -879 -96 -1643 1743 2247 241 -872 -1829
342570a829M21K086J307k895j170j19R81k714K127j662N57K535p70N11j218J916
$$ -1829 -1408 678 1985 -910 -2080 -2199 -1218 -3932 -1805 -3467 -2910 -375 -1145 -634 -1852 64
343058F4j829j90K431j883k65Q91Q29M01n62r67P54k32K628j041j412J172l245
$$ 64 -1765 -1955 476 -1407 -1672 -781 48 449 -113 -1080 -326 -558 2070 1029 -383 789 -2456
343577b456J443k31l78J025r65P68L444k382q91J668j719r32j037J727O64J121
$$ -2456 -1013 -1244 -1622 -597 -1562 -794 2650 268 -623 1045 -674 -1606 -2643 -916 -252 869
344065H69j225K060q99l09j032O92j690K401K1K357j141j799J38R69k070O16k980
$$ 869 -356 1704 805 496 -536 156 -1534 867 888 3245 2104 305 443 1412 -658 -42 -3022
344584c022J372J525j107N15j660P55k012P78J587J770R2l44k691r14K925M333
$$ -3022 -1650 -125 -1232 -717 -2377 -1622 -3634 -2856 -1269 501 593 249 -2442 -3356 -431 3902
345072C902k654l098J721J641r28m157K653Q7r34J866q05l4J922k127l926K031
$$ 3902 1248 -1850 -129 1512 584 -3573 -920 -833 -1767 99 -706 -740 1182 -945 -4871 -2840
345561b840K274m16J337j193N42K99q20K007R77k002K3k674P5K692k191P14J722
$$ -2840 -566 -982 355 -838 -296 3 -817 1190 2167 165 188 -2486 -2411 281 -1910 -1196 526
346080E26J1M07k775R86K573k442L973M39l934p48j281K718j025L97k59k948p48
$$ 526 537 944 -1831 -845 1728 -714 3259 3698 -236 -984 -2265 453 -572 -175 -434 -3382 -4130
346598d130L360K534j45j397j186J481O71j260j458M24Q65r71K898k289P33j421
$$ -4130 -770 1764 1619 222 -964 517 1188 -72 -1530 -1106 -241 -1212 1686 -603 130 -1291
347087a291j034K977j012q58O52P13l24J52q16J655J08K254j694j416K377k106
$$ -1291 -2325 652 -360 -1218 -566 147 -177 -25 -841 814 922 3176 1482 66 2443 337
347575C37j116L072k179j895L078J237l043j072J171R92K10j021j903J105L964
$$ 337 -779 2293 114 -1781 1297 2534 -509 -1581 -410 582 792 -229 -2132 -1027 2937
348033B937m131R55Q50J829q69k154n2Q9K058r85j815q48R73J638j25q55L81j833
$$ 2937 -1194 -239 611 2440 1571 -583 -635 -546 1512 527 -1288 -2136 -1163 475 350 -505 -124 -1957
348582a957k7K594j381K630r70k150M78J650O09j51N61J064k51j725j237P07j676
$$ -1957 -1984 610 -771 1859 889 -1261 -783 867 1476 1325 1886 2950 2699 974 -263 444 -1232
349101a232l176K528J789n02J992j422M00Q15j73J19l460j102J575J345J319L89
$$ -1232 -4408 -1880 -91 -593 1399 -23 377 1192 1019 1138 -2322 -3424 -1849 -504 815 1204
349589A204M47q20j048R9Q45N39rR02k688j41l23Q7n47j200K173l495J847K225
$$ 1204 1651 831 -217 -118 727 1266 1257 2159 -529 -670 -993 -906 -1453 -2653 -480 -3975 -2128 97
350138I7J058k57l615M508k191r32K476J263j180j108Q84Q54j272n50j92j557
$$ 97 1155 898 -2717 1791 -400 -1332 1144 2407 1227 119 1003 1857 585 35 -157 -1714
350627a714J019K733j819o23j419J572j348k45O66J919N04q75N26J5k47j812J72
$$ -1714 -695 2038 219 -404 -1823 -251 -1599 -1844 -1178 741 1245 370 896 911 664 -1148 -976
351146i76J448j754R47j724J068J608j492k667M511p14J683k921q33J735k597
$$ -976 472 -1282 -335 -2059 -991 617 -875 -3542 969 255 1938 -983 -1816 -81 -2678
351603b678R20L504l954J080K827k637P05K134k686P88j479J663j323L38J686
$$ -2678 -1758 1746 -2208 -1128 1699 -938 -233 1901 -785 3 -1476 187 -1136 -798 888
352061H88k041J441o07K094o5q5j893L90K024l698J678J058j041k017j530M852
$$ 888 -1153 288 -319 1775 1710 1625 -268 122 2146 -1552 126 1184 143 -1874 -3404 1448
352549A448k104r8r85O30J346j568P57O32j641J335j286K153j026N55j159K015
$$ 1448 -656 -754 -1739 -1109 237 -1331 -574 58 -1583 -248 -1534 619 -407 148 -1011 1004
353038A004j679J29L57j201K192r66m28P14O33o90J777l387N29J359L19k56J657
$$ 1004 -675 -546 -189 -1390 802 -164 -592 122 755 65 1842 -1545 -1016 343 662 406 2063
353556B063p30j443o32Q06M28p07j055J729O96k772K382J025M55m191K447k167
$$ 2063 1333 -110 -742 64 492 -215 -1270 459 1155 -1617 765 1790 2245 -1946 501 -1666
354045a666j037J865M3m32J688J801l24n167M249k044J46M056k543J765J156m596
$$ -1666 -2703 -838 -795 -1227 461 2262 1938 -3229 1020 -1024 -878 3178 635 2400 3556 -1040
354533a040K501J148l300n51j303J010J67o18L983k354l63J24J665j488j997J282
$$ -1040 1461 2609 -691 -1242 -2545 -1535 -1368 -1986 1997 -357 -720 -596 1069 -419 -2416 -1134
355022a134P05m72K50K192k176k03N84J857ln09j395m31j27k857K650p09K91R3
$$ -1134 -429 -901 -651 1541 -635 -838 -254 1603 1600 1091 -304 -735 -862 -3719 -1069 -1778 -1487 -1394
355571a394K080l516J299J897N18k501J962k187J548m71O23J121O20k817K510
$$ -1394 686 -2830 -1531 366 884 -1617 345 -1842 -294 -765 -142 979 1599 -1218 1292
356029A292m011L934j958O35m293J633Q0j641J732L172r53K237Q80k566j912J938
$$ 1292 -2719 1215 -743 -108 -4401 -2768 -2688 -4329 -2597 575 -378 1859 2739 173 -1739 199
356517A99j539L73K307J436j006K073k915j692q33l85J299L628Q99j549m164J30
$$ 199 -1340 -967 1340 2776 1770 3843 928 -764 -1597 -1982 -683 2945 3844 2295 -1869 -1739
357005a739K54K016j307o99Q30L502J393j632L1k219M96M84j266J78O89k99k509
$$ -1739 -1485 531 -776 -1475 -645 2857 4250 2618 2649 430 926 1410 144 322 1011 712 -1797
357524a797K864J430m625J124j78K131j27l783K892J028k024n95J902J629p1l88
$$ -1797 1067 2497 -2128 -1004 -1182 949 822 -2961 -69 959 -1065 -1660 242 1871 1800 1412
358012A412k302Q82j66K826l73k790l453J918K227k349O68J76j3L110j390j293
$$ 1412 -890 -8 -174 2652 2279 -511 -3964 -2046 181 -2168 -1500 -1324 -1337 1773 383 -910
358500i10J493j25j555m26J527J410Q04J664p32j800j197J208k588P24n35J918
$$ -910 583 458 -1097 -1523 4 1414 2218 3882 3150 1350 153 1361 -1227 -503 -1038 880
358989H80k626K189k77l34r14K282n839J618K332j442K827m20q73Q88m601K730
$$ 880 -1746 443 166 -168 -1082 1200 -4639 -3021 -689 -2131 696 276 -597 291 -4310 -1580
359477a580J207j458p8L218j654j176K8R9N19m48M17J911Q44j713N01Q4k276N98
$$ -1580 -373 -1831 -1909 1309 -345 -1521 -1493 -1394 -875 -1323 -906 1005 1849 136 637 721 -1555 -957
360027i57J251P42r78L38j487J720j730J14R0J068M643j992q71k472k49j472l44
$$ -957 294 1036 58 396 -1091 629 -1101 -987 -897 171 4814 2822 1951 -521 -770 -2242 -2586
360545b586K693K292m038j211K320J575j644K42r9k592n9K279K867k120j2r6j442
$$ -2586 107 2399 -1639 -2850 -530 1045 -599 -357 -456 -3048 -3107 -828 2039 -81 -93 -189 -1631
361064a631J677j730J746K626m75j961J04J747j020j32k312j290K41j01M5J397
$$ -1631 46 -1684 62 2688 2213 252 356 2103 1083 951 -1361 -2651 -2410 -2511 -2466 -1069
361552a069j783j976J850N33K126r96k49J366p71R55J68q30J253k6j355P5L85
$$ -1069 -2852 -4828 -2978 -2445 -319 -1315 -1564 -198 -969 -14 154 -676 577 551 -804 -729 -344
362071c44k492K421M96r08J475L26M6l74J137l023J763q28r09K282m120M229R08
$$ -344 -2836 -415 81 -827 648 974 1020 646 1783 -1240 523 -305 -1214 1068 -3052 1177 2085
362590B085j848k235L07J836j273J054j57K555k295k139L02J894J79J126k56k041
$$ 2085 237 -1998 -1691 145 -1128 -74 -231 2324 29 -2110 -1808 86 265 1391 1135 -906
363078i06J326n03J193p73o05L29j416J85n37J425K363k740j111J122O59p49K008
$$ -906 420 -83 1110 337 -268 61 -1355 -1170 -1707 -282 2081 -659 -1770 -648 11 -738 1270
363597A270j00j378O43q63j677J266m05J446j03j496oK059Q69k272J252J048o79
$$ 1270 1170 -208 435 -428 -2105 -839 -1244 202 99 -1397 -1403 656 1525 -747 505 1553 874
364116H74p24Q31K214j103J782l360k608p26M722j942J048j89j630j777o33L137
$$ 874 150 981 3195 2092 3874 514 -2094 -2820 1902 -40 1008 819 -811 -2588 -3221 -84
364604h4l164l4L320J188k763J747M01p27J615j707J812P2n06M88o24J24k659
$$ -84 -3248 -3282 38 1226 -1537 210 611 -116 1499 -208 1604 1676 1170 1658 1034 1158 -1501
365123a501K946k57J617J369k985l537J959j348L85j308k98J662j048K544K413
$$ -1501 1445 1188 2805 4174 1189 -2348 -389 -1737 -1352 -2660 -2958 -1296 -2344 200 2613
365581B613l202M754k802k610K581j38j043K773k379Q52J051N34l775M03k336
$$ 2613 -589 4165 1363 -1247 1334 1196 153 2926 547 1399 2450 2984 -791 -388 -2724
366039b724K548P84K01k20k12r60L05R36L71p1R25l485l45K026K634r09k668Q6
$$ -2724 -176 608 809 589 377 -583 -278 658 1029 958 1883 -1602 -1947 79 2713 1804 -864 -778
366588g78L114m997J117K597l800K31K012K293j488p01L39k106K74L52K555j189
$$ -778 2336 -2661 -1544 1053 -2747 -2516 -504 1789 301 -400 -61 -2167 -1893 -1541 1014 -175
367076a75N93j567k840K053l66K55O94L067L33k330j25N68j188J70J594J227J851
$$ -175 418 -1149 -3989 -1936 -2302 -2047 -1353 1714 2047 -283 -408 160 -1028 -858 736 1963 3814
367595C814l687J615j107L15n29k06N15j407l16K707j063Q41q92J390k295k127
$$ 3814 127 1742 635 950 421 215 730 -677 -993 1714 651 1492 600 1990 -305 -2432
368083b432J54K670L9l97j754j415J391O60M18J492n60q62K246n01q77J70p73
$$ -2432 -2278 392 431 34 -1720 -3135 -1744 -1084 -666 826 266 -596 1650 1149 272 442 -331
368602c31O79k495K22J179j722L28J214o09K54j212K783j267j023m3K77J472k103
$$ -331 348 -2147 -1925 -746 -2468 -2140 -926 -1535 -1281 -2493 290 -977 -2000 -2043 -1766 -294 -2397
369121b397L220Q63Jq0p34k710J541k412J023L49J322J034L17j564K008K623l640
$$ -2397 823 1686 1687 1607 873 -1837 -296 -2708 -1685 -1336 -14 1020 1337 -227 1781 4404 764
369640G64J599j62l948J326J628K25N1N85k111R80J0p12L73j050J329L64k613
$$ 764 2363 2201 -1747 -421 1207 1432 1483 2068 -43 937 947 235 608 -442 887 1251 -1362
370159a362O93L136k096k789L56L597j113r17j39P78M67l412J307K067j267q34
$$ -1362 -669 2467 371 -2418 -2062 1535 422 -495 -634 144 611 -2801 -1494 573 -694 -1528
370647a528L647m447J957J326O77j806J292J841j716j687J052l369j33J252K109
$$ -1528 2119 -2328 -371 955 1632 -174 1118 2959 1243 -444 608 -2761 -2894 -1642 467
371105D67j011q60P30m42k10k332J462K845P21k2p55J019k178M71J425m28N66
$$ 467 -544 -1404 -674 -1116 -1326 -3658 -2196 649 1370 1348 593 1612 -566 -95 1330 902 1468
371623A468j722j05M35J036j219N70Qm203K215K813l520J153O11j943m17M23K695
$$ 1468 -254 -359 76 1112 -107 463 471 -3732 -1517 1296 -2224 -1071 -460 -2403 -2820 -2397 298
372142B98J006q12k013R00j679N99l19K551p00k360L185K156m147k77L76k70R89
$$ 298 1304 492 -1521 -621 -2300 -1701 -2020 531 -169 -2529 656 2812 -1335 -1612 -1236 -1506 -517
372661e17q0N9J085J510k240J396j360K93j03j353J973L40k148P54N40J382k157
$$ -517 -597 -538 547 2057 -183 1213 -147 146 43 -1310 663 1003 -1145 -391 149 1531 -626
373180f26j055J570J035l848K644O35N29J824o20K06O70k602K054k760j803J679
$$ -626 -1681 -111 924 -2924 -280 355 884 2708 2088 2294 2964 362 2416 -344 -2147 -468
373668d68J043o97k808K123J069J827q27k148l00N56o09K190k107K518m36o08
$$ -468 575 -122 -2930 -807 262 2089 1262 -886 -1186 -630 -1239 951 -1156 1362 926 318
374157C18k615J138Q1q47K411K620j479O9K91j038k481J234L75J006p63j409k81
$$ 318 -2297 -1159 -1078 -1925 486 3106 1627 1696 1987 949 -1532 -298 77 1083 320 -1089 -1370
374675a370J95m38J360L307k58j122k659J53K009k500j516L519J563k069j497
$$ -1370 -1175 -1613 -253 3054 2796 1674 -985 -832 1177 -1323 -2839 680 2243 174 -1323
375133a323K515j795q80K896o60j571P52l41o2L59j86R70J082o97o12J011j002
$$ -1323 1192 -603 -1483 1413 753 -818 -66 -407 -469 -110 -296 674 1756 1059 447 1458 456
375652D56m81K086r00p65P94J064k026M82n76j144p75k94K002K02j149J233L66
$$ 456 -25 2061 1161 396 1190 2254 228 710 134 -1010 -1785 -2079 -77 125 -1024 209 575
376171E75J869k004K375j104k65p68l372J927R69j255R64m3n66j074J84J244J022
$$ 575 2444 440 2815 1711 1446 678 -2694 -767 202 -1053 -89 -132 -698 -1772 -1588 -344 678
376690F78Jl259M36m43J768m33J800l480P65o98K212J54K030l25K077k201r69
$$ 678 679 -2580 -2144 -2587 -819 -1252 548 -2932 -2167 -2865 -653 -499 1531 1206 3283 1082 113
377208A13j5o52L62N15o84n5O59p59l31L47Q92J463j248l44m46J802Q90j941j354
$$ 113 98 -554 -192 323 -361 -416 243 -516 -847 -500 392 1855 607 263 -183 1619 2509 568 -786
377788g86j740P43j588J785J255j181L24j40K337j422K845j067m947L770K491
$$ -786 -2526 -1783 -3371 -1586 -331 -1512 -1188 -1328 1009 -413 2432 1365 -3582 188 2679
378246B679r9m26m309J725K626l270K141R66k10j772j773J966J101l176K739K007
$$ 2679 2580 2154 -2155 -430 2196 -1074 1067 2033 1823 51 -1722 244 1345 -1831 908 2915
378734B915N68m076J041j900P19P55l122J903M52m097M026K98K606J127j931Q36
$$ 2915 3483 -593 448 -1452 -733 22 -3100 -1197 -745 -4842 -816 -518 2088 3215 1284 2120
379223B120j75J499j664r44j020r66J12R59j603J680q33j442J002j364p92K471
$$ 2120 1945 3444 1780 836 -184 -1150 -1038 -79 -1682 -2 -835 -2277 -1275 -2639 -3431 -960
379711i60j783P23j054Q4M75J205j54j096m28L062k805K431K376j525k864l577
$$ -960 -2743 -2020 -3074 -2990 -2515 -1310 -1464 -2560 -2988 74 -2731 -300 2076 551 -2313 -5890
380199e890O515k0n90j567J527J86q77o17l60L303n89r4j023m18P68j134K344
$$ -5890 625 605 15 -1552 -25 161 -716 -1333 -1693 1610 1021 927 -96 -514 254 -880 1464
380718A464j272l19J125j162j11J042n48L8j11K468l001M55J446J033p56L608
$$ 1464 192 -127 998 -164 -275 767 219 257 146 2614 -387 68 1514 2547 1791 5399
381206E399l524n82n57J43J21J390n29K472j989j233K000L93k230K092j264j862
$$ 5399 1875 1293 736 879 1000 2390 1861 4333 2344 1111 3111 3504 1274 3366 2102 240
381695B40m88j659r49J866o50J67l82J969q16J090o08J592k823L730l043j672
$$ 240 -248 -1907 -2856 -990 -1640 -1473 -1855 114 -702 388 -220 1372 -1451 2279 -764 -2436
382183b436N53Q14J005j231J633J415R75q33j968l46P52J71j235Q25n4J36R63
$$ -2436 -1883 -1069 -64 -1295 338 1753 2728 1895 -73 -419 333 504 -731 94 40 176 1139
382702A139r72l115J357O4j012J012J047l34K495q43l711J921P23o52n15Q11n13
$$ 1139 167 -2948 -1591 -1527 -2539 -1527 -480 -814 1681 838 -2873 -952 -229 -881 -1396 -585 -1098
383221a098J953J251j765J372k39K76k330L192k003M62n40J338J278m281J961
$$ -1098 855 2106 341 1713 1474 1750 -580 2612 609 1071 531 1869 3147 -1134 827
383678H27q04J600j51j074J074o05j506l04K529m11m132J039j428O27J079J407
$$ 827 23 1623 1472 398 1472 867 -639 -943 1586 1175 -2957 -1918 -3346 -2719 -1640 -233
384167b33j236r79K01L192J88L7j49l649J085j75L33J073J656k320N81j2o94j688
$$ -233 -1469 -2448 -2247 945 1133 1170 1021 -2628 -1543 -1718 -1385 -312 1344 -976 -395 -407 -1101 -2789
384716b789o77J325J375R99J763o17K4j410P20j554L7P21R88R16J487m448K800
$$ -2789 -3466 -2141 -766 233 1996 1379 1403 -7 713 -841 -804 -83 905 1821 3308 -1140 1660
385235A660K182m994L700o61k241J581m89M92O13j202j885j86J416m13j56J17
$$ 1660 3842 -1152 2548 1887 -354 1227 738 1230 1843 641 -1244 -1430 -14 -427 -583 -466
385723d66J054k297Q24K273j162j674o2K412J151j248Rl30j436M67j871L563o61
$$ -466 588 -1709 -885 1388 226 -1448 -1510 902 2053 805 814 484 -952 -485 -2356 1207 546
386242E46J556r68j030j822k67L618r11J7n67O46j167j656n60P37k63M105k604
$$ 546 2102 1134 104 -1718 -1985 1633 722 739 172 818 -349 -2005 -2565 -1828 -2091 2014 -590
386761e90j369L013Q9p79K047j955k293P19r17K53K043k802K043M71j106N53O95
$$ -590 -1959 1054 1143 364 2411 456 -1837 -1118 -2035 -1782 261 -2541 -498 -27 -1133 -580 115
387279A15j303p53J577k026R49J289K6l03j352r81j765J452K832R57r73j538k215
$$ 115 -1188 -1941 -364 -2390 -1441 -152 -126 -429 -1781 -2762 -4527 -3075 -243 714 -259 -1797 -4012
387799d012K220P96J089J3K843l813p25o43N57O14Op74J511j280J899l508J628
$$ -4012 -1792 -996 93 106 2949 -864 -1589 -2232 -1675 -1061 -1055 -1829 -318 -1598 301 -3207 -1579
388317a579J407J13K521k931k177K259K043k145J722j053J780j073m27M29m390
$$ -1579 -172 -59 2462 -469 -2646 -387 1656 -489 1233 180 1960 887 460 889 -3501
388775c501J152l782K524j12J435J757j157K305j992J019j34q23l350N937k013
$$ -3501 -2349 -6131 -3607 -3719 -2284 -527 -1684 621 -1371 -352 -486 -1309 -4659 1278 -735
389233g35O8m4M009k780J664j109l132J267k02N64J225k897L62K454n71j165j082
$$ -735 -667 -711 3298 518 2182 1073 -2059 -792 -994 -430 795 -2102 -1740 714 143 -1022 -2104
389752b104J868o61J941o93n2k162J21P8M010j488M30k283O75L234j140j003j446
$$ -2104 -236 -897 1044 351 299 -1863 -1742 -1664 2346 858 1288 -995 -320 2914 1774 771 -675
390270f75k148L013P51l831J058L412j765R89j507k577o77L625j057K750k206
$$ -675 -2823 190 941 -2890 -1832 1580 -185 804 -703 -3280 -3957 -332 -1389 1361 -845
390728h45K61m03O75J061j382j038M79L434J036m159j83Q97j940R95j790J837
$$ -845 -584 -987 -312 749 -633 -1671 -1192 2242 3278 -881 -1064 -167 -2107 -1112 -2902 -1065
391216a065O34K18j795K729k073K39M15l012L2O95K782j55j353K367j603J399
$$ -1065 -431 -213 -2008 721 -1352 -1113 -698 -3710 -3678 -2983 -201 -356 -1709 658 -945 454
391705D54J087k391m95Q16J620J265j165k032J270Q44J60k006O03M1J071N33M37
$$ 454 1541 -850 -1345 -529 1091 2356 1191 -841 429 1273 1433 -573 30 71 1142 1675 2112
392223B112k345l09j316J783j06K559j688L39k273O00J689o14j416L936l008l417
$$ 2112 -233 -542 -1858 -75 -181 2378 690 1029 -1244 -644 1045 431 -985 2951 -57 -3474
392712c474J362L55L063J585j664J99r64j036J633j226o74j009J596m7J181k074
$$ -3474 -2112 -1757 1306 2891 1227 1426 462 -574 1059 -167 -841 -1850 -254 -301 880 -1194
393200a194J976j082p69K227j306J846l105K355M18k12j943L307l674K252M23
$$ -1194 782 -300 -1069 1158 -148 1698 -1407 948 1366 1154 -789 2518 -1156 1096 1519
393658A519k206l82j295P91J84P25k02j088J389j852J55O47K680q56P83M17r75
$$ 1519 -687 -1069 -2364 -1573 -1389 -664 -866 -1954 -565 -2417 -2262 -1615 1065 209 992 1409 434
394177D34J910k314n13J952K36j221l71q07K96K40J67K27k44K72l65j001M68r27
$$ 434 2344 30 -483 1469 1705 484 113 -694 -398 -158 9 236 -8 264 -101 -1102 -634 -1561
394726a561Q64J16j635j196K205J857k98Q82r57N3l60j496K161J559J620l814
$$ -1561 -697 -581 -2216 -3412 -1207 650 352 1234 277 330 -30 -1526 635 2194 3814 0
395214@r39R11j188M750n154J087K923k08k407J203L65n05q57K833l923j464K989
$$ 0 -939 -28 -1216 3534 -1620 -533 2390 2182 -225 978 1343 838 -19 2814 -1109 -2573 416
395733D16j913K578k158o92M029j492K111j052k12r77j064L299K69k579j559k77
$$ 416 -1497 1081 -1077 -1769 2260 768 2879 1827 1615 638 -426 2873 3142 563 -996 -1273
396221a273K85k631K258P32R6r80J920J979l26j557q80j629L448j643K60K30k651
$$ -1273 -988 -3619 -1361 -629 -533 -1513 407 2386 2060 503 -377 -2006 1442 -201 59 289 -2362
396740b362K005j020j022J506O73j50k651L784k78r39k742L002j599J620Q97J09
$$ -2362 -357 -1377 -2399 -893 -220 -370 -3021 763 485 -454 -3196 -194 -1793 -173 724 833
397229H33m08j758K108j309J379N64J449j179k00K115k974j69J088O29j447J731
$$ 833 425 -1333 775 -534 845 1409 2858 1679 1479 3594 620 451 1539 2168 721 2452
397717B452k399J510O99n96k796J687Q51l10j374j666J861r08J8K201J902l426
$$ 2452 53 1563 2262 1666 -1130 557 1408 1098 -276 -1942 -81 -989 -971 1230 3132 -294
398205b94J643J506j886o91J567k204Q54Q68j288M34J19o75j368Q60J345J710
$$ -294 1349 2855 969 278 1845 -359 495 1363 75 509 628 -47 -1415 -555 790 2500
398693B500j937Q86r97j347Q20K123J98J778j981k230J163j160j254r96L341K69
$$ 2500 563 1449 452 -895 -75 2048 2246 4024 2043 -187 976 -184 -1438 -2434 907 1176
399182A176Q90j378M60k91m40O05q92m94L52J353m06m93j108P54J12K540j663
$$ 1176 2066 688 1148 857 417 1022 130 -364 -12 1341 935 442 -666 88 200 2740 1077
399701A077J778J61k786o34K064l891J488P81N66J03q72L79K364j160m82L57j770
$$ 1077 2855 3016 230 -404 1660 -2231 -743 38 604 707 -165 214 2578 1418 936 1293 -477
400219d77j12J216J367k408J054K017j293j417K221j855J275l026K990m97m96
$$ -477 -589 627 1994 -414 640 2657 1364 -53 2168 313 1588 -1438 1552 1055 559
400677E59P04P19k16r52j017p86J011r61K115k659r27J508K589j066p12K295n84
$$ 559 1263 1982 1766 814 -203 -989 22 -939 1176 -1483 -2410 -902 1687 621 -91 2204 1620
401196A620k014M02p9J639k930L127q75q46p19j720J360N56M40j811K787k849
$$ 1620 -394 8 -71 1568 -1362 1765 890 44 -675 -2395 -1035 -479 -39 -1850 937 -1912
401684a912L720J716k367k305L82M97J62k90N30J692p33p49J814j195j242J704
$$ -1912 1808 3524 1157 -1148 -766 -269 -107 -397 133 1825 1092 343 2157 962 -280 1424
402173A424k271j766K257K779l337K889l226p77K811j463M62k423J222K755j915
$$ 1424 -847 -2613 -356 2423 -914 1975 -1251 -2028 783 -680 -218 -2641 -1419 1336 -579
402630e79l36l6Q81k618J376Q83R73O16l77Ll171K221L043j384j15Q1O91k021
$$ -579 -915 -951 -70 -2688 -1312 -429 544 1160 783 786 -2385 -164 2879 1495 1380 1461 2152 131
403180A31j146J92o27K828k688j438K360j170L478j288J46J24R13m385J30J902
$$ 131 -1015 -823 -1450 1378 -1310 -2748 -388 -1558 1920 632 778 902 1815 -2570 -2440 -538
403668e38R03j68j309k42J688J093q4N1n91k28q95J487j955k11K047r29k133j149
$$ -538 365 197 -1112 -1354 334 1427 1343 1394 803 575 -320 1167 -788 -999 1048 119 -2014 -3163
404217c163R56R39l63Q74L32R91J748k841J286O38k662K53R0j580N41o9L142m394
$$ -3163 -2207 -1268 -1631 -757 -425 566 2314 -527 759 1397 -1265 -1012 -922 -2502 -1961 -2030 1112 -3282
404767c282L457K13J354j956M67l74J672j266L739k818j933J526k894K282j32
$$ -3282 175 388 1742 -214 253 -121 1551 285 4024 1206 -727 799 -2095 187 55
405224E5O41j901J67j2N23k760O82M131j079j23m39J294l056J719q04J801l36
$$ 55 696 -1205 -1038 -1050 -527 -3287 -2605 1526 447 324 -115 1179 -1877 -158 -962 839 503
405743E03l93j191m96J703m70p79K017J132o43j854o95o22K723j167J088j738
$$ 503 110 -1081 -1577 126 -344 -1123 894 2026 1383 -471 -1166 -1788 935 -232 856 -882
406231h82J872m232p32n36N943j87j085L249k807M92o88r76K134j154l8Q26K37
$$ -882 990 -3242 -3974 -4510 1433 1246 161 3410 603 1095 407 -569 1565 411 373 1199 1436
406751A436m03l124J115R49J225R25k243J161k129J817l31l81K206k885J230K91
$$ 1436 1033 -2091 -976 -27 1198 2123 -120 1041 -1088 729 398 17 2223 -662 568 859
407239H59R94k250j676J38K296j677J769K68P36j469R12j07o27J315k221P18N66
$$ 859 1853 -397 -2073 -1935 361 -1316 453 721 1457 -12 900 793 166 1481 -740 -22 544
407758E44J005k816l98K148j511L078k116p19P06N07k157K422j315K583j345J084
$$ 544 1549 -1267 -1665 483 -1028 2050 -66 -785 -79 428 -1729 693 -622 1961 616 1700
408246A700K164m784K248j71J126j226O47k101Q18K58l87K285l647j790J580M818
$$ 1700 3864 -920 1328 1157 2283 1057 1704 -397 421 679 292 2577 -1070 -2860 -1280 3538
408734C538o01l937K861k289J85p64J705K56l64j642J448K01L51j411l71R11o54
$$ 3538 2937 -1000 1861 -428 -243 -1007 698 954 590 -1052 396 597 948 -463 -834 77 -577
409253e77j310K673k513J218j923P37j689K690J317p25j754J03M783m81l51l483
$$ -577 -1887 786 -1727 -509 -2432 -1695 -3384 -694 623 -102 -1856 -1753 3030 2549 2198 -1285
409741a285n08N97J056J396j683Q74p64J584M95J345k335M23k574P65o43J845
$$ -1285 -1793 -1196 -140 1256 -427 447 -317 1267 1762 3107 772 1195 -1379 -614 -1257 588
410229E88j505J700p18k435J681J821l84j108j465J483M46J963j026q12k91J171
$$ 588 -917 783 65 -2370 -689 1132 748 -360 -1825 -342 104 2067 1041 229 -62 1109
410718A109J681k301l97j186K400J35m512K07J202r55L063j026N31K01k160J191
$$ 1109 2790 489 92 -1094 1306 1441 -3071 -2864 -1662 -2617 446 -580 -49 152 -2008 -817
411206h17k94o32j51L74J428J310o02J23j550K005K78j612J344K752l790K176
$$ -817 -1111 -1743 -1894 -1520 -92 1218 616 739 -811 1194 1472 -140 1204 3956 166 2342
411694B342k89n503O84L102O10J860n57j195k45K176N09j663O3r58k050J87j94
$$ 2342 2053 -3450 -2766 336 946 2806 2249 1054 809 2985 3494 1831 1894 936 -1114 -927 -1121
412213a121n34j22K527o77j024j91J713p4l16q82K255j204N83K123j586K175k621
$$ -1121 -1655 -1777 750 73 -951 -1142 571 497 181 -701 1554 350 933 3056 1470 3645 1024
412732A024k388J043J072k05J644N75J205l593K189k455p26j005j747N392N23
$$ 1024 -1364 -321 751 546 2190 2765 3970 377 2566 111 -615 -1620 -3367 2025 2548
413190B548k124k590R15q01L26K309j542Q10j516K212k414J860k023J848J606
$$ 2548 424 -2166 -1251 -2052 -1726 583 -959 -149 -1665 547 -1867 -7 -2030 -182 1424
413648A424j609J409j215k236K596J729k23j782n38R08K132j298j922K192j003
$$ 1424 -185 1224 9 -2227 369 2098 1875 93 -445 463 2595 1297 -625 1567 564
414105E64K668p14O56k614k215M85J63L145k634K127q2K7n82j545J612l33P25
$$ 564 3232 2518 3174 560 -1655 -1170 -1007 2138 -496 1631 1549 1576 994 -551 1061 728 1453
414624A453L5N40l277K318M56k763K23L95l455K728p59M11L510k007q12J549K654
$$ 1453 1488 2028 -1249 1069 1525 -1238 -1015 -620 -4075 -1347 -2106 -1695 1815 -192 -1004 545 3199
415143C199n51J87l028oj276J397k27J2j179J616p39Q3m55K86J604j05L46j573
$$ 3199 2648 2835 -193 -199 -1475 -78 -305 -293 -1472 144 -595 -512 -967 -681 923 818 1164 -409
415692d09j733L388J23L46l199J016J40Q3j137j467N537j248j829m34j847K887
$$ -409 -2142 1246 1369 1715 -1484 -468 -328 -245 -1382 -2849 2688 1440 -389 -823 -2670 217
416181B17m72J094l25j164K074Q75j895O75J062j764J306k111n20K695k299o95
$$ 217 -255 839 514 -650 1424 2299 404 1079 2141 377 1683 -428 -948 1747 -552 -1247
416669a247p65J675K222m43K85m74n94O48j648L648l652M127j239j820j498K698
$$ -1247 -2012 -337 1885 1442 1727 1253 659 1307 -341 3307 -345 3782 2543 723 -775 1923
417157A923m56l421J930m55j026K859j233k390p34J577J121K88j320j639P03J347
$$ 1923 1467 -1954 -24 -479 -1505 1354 121 -2269 -3003 -1426 -305 -17 -1337 -2976 -2273 -926
417645i26J161Q03j634J494K44j518J279j288o69J767N96P3O29j268j764J316
$$ -926 235 1038 -596 898 1142 -376 903 -385 -1054 713 1309 1382 2011 743 -1021 295
418134B95L34n22j166K959n50n95j348L002l10j371j324J296o56o1J235q20L38
$$ 295 629 107 -1059 1900 1350 755 -593 2409 2099 728 -596 700 44 -17 1218 398 736
418653G36j839k747K044L387k119J94J849l76N68p19j22j190J203j249J963k7
$$ 736 -1103 -3850 -1806 1581 -538 -344 1505 1129 1697 978 856 -334 869 -380 1583 1556
419141A556l92k498R89l411L864O76K919r92k220o22M4r2p07J300J74j516K400
$$ 1556 1164 -1334 -345 -3756 108 784 3703 2711 491 -131 -87 -179 -886 414 588 -928 1472
419660A472Q36k130K192k917p35K016J553p71J047L114o08p234K045j584J115
$$ 1472 2308 178 2370 -547 -1282 734 2287 1516 2563 5677 5069 -2165 -120 -1704 -589
420117e89p55K319o70J99J510j166j458K474p33J121j941P88p09k078K087Q11
$$ -589 -1344 975 305 504 2014 848 -610 1864 1131 2252 311 1099 390 -1688 399 1210
420606A210L38j554j296j409L813M66q21M87j385k6J566j616J253k788j530N90
$$ 1210 1548 -6 -1302 -2711 1102 1568 747 1234 -151 -177 1389 -227 1026 -1762 -3292 -2702
421094b702M352k20K629k193l116K565J248j286j971rm46j054K198J632K53j863
$$ -2702 1650 1430 4059 1866 -1250 1315 2563 1277 -694 -703 -1149 -2203 -5 1627 1880 17
421582A7J682l757K315K620l097K387J83j563j634R96n59J158J942R62K194m798
$$ 17 1699 -2058 257 2877 -220 2167 2350 787 -847 149 -410 748 2690 3652 5846 1048
422071A048j758m6J227J859J16j214l027J715K082N76q49M08N1q41q84M65j409
$$ 1048 -710 -756 471 2330 2446 1232 -1795 -80 2002 2578 1729 2137 2188 1347 463 928 -481
422589d81j911J238J566N65l531L98L136k151L993j671Q96k179N83p7o85j625
$$ -481 -2392 -1154 412 977 -2554 -2156 980 -1171 2822 1151 2047 -132 451 374 -311 -1936
423078a936N68J002j662J638j095K639p60m67M92l308K292K882j504j728K167
$$ -1936 -1368 -366 -2028 -390 -1485 1154 394 -73 419 -2889 -597 2285 781 -947 1220
423535A220j820K690l136J260k162J836K947r48l828K110n06l148K795J253j07
$$ 1220 -600 2090 -1046 214 -1948 -112 2835 1887 -1941 169 -337 -3485 -690 563 456
423993D56o02J125k948J479J450k82L93j12r68j505M96K015j321q16j88J054k09
$$ 456 -146 979 -1969 -490 960 678 1071 959 -9 -1514 -1018 997 -324 -1140 -1328 -274 -483
424512d83o62K812j712O05k190Q42j7J956N89M51J231p69o05J266k192k147K206
$$ -483 -1145 1667 -45 560 -1630 -788 -805 1151 1740 2191 3422 2653 2048 3314 1122 -1025 1181
425031A181j893J286j179j82j041R7M32j774K708L050j064m893J545J894O94l32
$$ 1181 -712 574 -605 -787 -1828 -1731 -1299 -3073 -365 2685 1621 -3272 -1727 167 861 529
425519E29k08o89j075m48K189q67K720j477k59k382J714o91J651q53k59J167m36
$$ 529 321 -368 -1443 -1891 298 -569 2151 674 415 -1967 -253 -944 707 -146 -405 762 326
426038C26J908l152J09J48J003k620J732L90K78k128R55K441k239j504O615n520
$$ 326 2234 -918 -809 -661 342 -2278 -546 -156 122 -2006 -1051 1390 -849 -2353 4262 -1258
426526a258Q63M465l874J036P75k918j911L166J72j935K94J122j181J267pq32
$$ -1258 -395 4070 196 1232 2007 -911 -2822 344 516 -1419 -1125 -3 -1184 83 76 -756
427015g56K024R18j170R85j024k807J764J695k383L34J188k396L78r80K460O87
$$ -756 1268 2186 1016 2001 977 -1830 -66 1629 -754 -420 768 -1628 -1250 -2230 230 917
427503I17j595j490M575j45k105k47p2m82p08J676j03k065j050j180J993K195
$$ 917 -678 -2168 2407 2262 157 -90 -162 -644 -1352 324 221 -1844 -2894 -4074 -2081 114
427991A14K564k360J203l01k175k873L101N22J270k185R1L974k250j087k17j227
$$ 114 2678 318 1521 1220 -955 -3828 -727 -205 1065 -1120 -1029 2945 695 -392 -609 -1836
428479a836M516p43l705L019N01k639K029k088K699p80j640P70J679J280M65l080
$$ -1836 2680 1937 -1768 1251 1752 -887 1142 -946 1753 973 -667 103 1782 3062 3527 447
428968D47L7k878K08L072Q7j186l505K092k91l94J758j442k53j330L615P70k707
$$ 447 484 -2394 -2186 886 973 -213 -3718 -1626 -1917 -2311 -553 -1995 -2248 -3578 37 807 -1900
429486a900p14J164j92K94R21M34Q10M11J408j388k433J869j460l512L700P74
$$ -1900 -2614 -1450 -1642 -1348 -427 7 817 1228 2636 1248 -1185 684 -776 -4288 -588 186
429975A86R73N35j673q36J785R67J25j094M93J10k105M3k899K608K964k528j080
$$ 186 1159 1694 21 -815 970 1937 2062 968 1461 1571 -534 -491 -3390 -782 2182 -346 -1426
430494a426J218J082j778j91J401Q83m59k329J999P92j228j309j660K48P06J91
$$ -1426 -208 874 -904 -1095 306 1189 730 -1599 400 1192 -36 -1345 -3005 -2757 -2051 -1860
430982a860l09j218M343O73n64k447L491k736P3O97K47K649k492l27K89J913J313
$$ -1860 -2169 -3387 956 1629 1065 -1382 2109 -627 -554 143 390 3039 547 220 509 2422 3735
431501C735l09j911q44J42l73J597j969L84p02j462O28J095Q00n34j235n93K401
$$ 3735 3426 1515 671 813 440 2037 68 452 -250 -1712 -1084 11 811 277 -958 -1551 850
432020H50J490m15j996n86J646m124K097R34K64O41K777l360n80K181j987P51
$$ 850 2340 1925 -71 -657 989 -3135 -1038 -104 160 801 3578 218 -362 1819 -168 583
432508E83K153l774Q64K276k37r33J123m18N28j030O96j620J319O38q83k261r86
$$ 583 2736 -1038 -174 2102 1865 932 2055 1637 2165 1135 1831 211 1530 2168 1285 -976 -1962
433027a962J806j908j131N101L33k142J827R04k713J345q11J008j113q24J62P40
$$ -1962 -156 -2064 -3195 1906 2239 97 1924 2828 115 1460 649 1657 544 -280 -118 622
433515F22q5j589J680J185r90p31q65j058N31K447p28J229J354j276m726K00J208
$$ 622 537 -1052 628 1813 823 92 -773 -1831 -1300 1147 419 1648 3002 1726 -3000 -2800 -1592
434034a592k473J10J692K309j373J649R74N17l130N38R70j017R91j586j41K58
$$ -1592 -4065 -3955 -2263 46 -1327 322 1296 1813 -1317 -779 191 -826 165 -1421 -1562 -1304
434522a304K378n33j418J815k068j712J1K743R13k951L97K009j827K76J791K040
$$ -1304 1074 541 -877 938 -1130 -2842 -2831 -88 825 -2126 -1729 280 -1547 -1271 520 2560
435011B560k426j895p71K97K116J388m63K489q58j508Q07k026K288j695L17j031
$$ 2560 134 -1761 -2532 -2235 -119 1269 806 3295 2437 929 1736 -290 1998 303 620 -411
435499d11P41j751J64j812L157J353o87o52M97l052q77Q49m27k22O39o40J052
$$ -411 330 -1421 -1257 -3069 88 1441 754 102 599 -2453 -3330 -2481 -2908 -3130 -2491 -3131 -2079
436018b079K737r84J004K90l02j91j470O51M74N44o23N85r65K890j734p02N1O13
$$ -2079 658 -326 678 968 666 475 -995 -344 130 674 51 636 -329 2561 827 125 176 789
436567G89j499J405r80K129l12j880j88J70K04J028j906L328m04J751k808k130
$$ 789 -710 695 -285 1844 1532 -348 -536 -366 -162 866 -1040 2288 1884 3635 827 -1303
437055a303K535K06J448k407O78L6N54k579N82J157m130K184L080p21P29r50m271
$$ -1303 1232 1438 2886 479 1157 1193 1747 -832 -250 907 -3223 -1039 2041 1320 2049 1099 -3172
437574c172J550O0O34N24m2M2J644N24j316l956K452l36K402k69q45J125j062
$$ -3172 -1622 -1562 -928 -404 -446 -404 1240 1764 448 -3508 -1056 -1392 1010 741 -104 1021 -41
438093d1K63k187Q0J781J553k57Q05K297l727J083j774k068K710K998m133j94
$$ -41 222 -1965 -1885 -104 1449 1192 1997 4294 567 1650 -124 -2192 518 3516 -617 -811
438581h11o21j443M887j443P78k42o74l90J276q13l533k73N07L506j949K492m56
$$ -811 -1432 -2875 2012 569 1347 1105 431 41 1317 504 -3029 -3302 -2795 711 -1238 1254 798
439100G98j617k832K266O41O54J249k039J779L03Q90m3r19m36J183J76l085J026
$$ 798 -819 -3651 -1385 -744 -90 1159 -880 899 1202 2092 2049 1130 694 1877 2053 -1032 -6
439619fp32P68j07m59K458l307N00K516j782J322j217O51l274O22J498K18j366
$$ -6 -738 30 -77 -536 1922 -1385 -885 1631 -151 1171 -46 605 -2669 -2047 -549 -331 -1697
440138a697j385o4K585j029J037O71j320J68K422k239O46l83Q25j511L6m98K292
$$ -1697 -3082 -3146 -561 -1590 -553 118 -1202 -1034 1388 -851 -205 -588 237 -1274 -1238 -1736 556
440656E56q91l22J892k962l68n93J092K138l08O65o98M28j498J319L27l91M17
$$ 556 -335 -657 1235 -1727 -2095 -2688 -1596 542 234 899 201 629 -869 450 777 386 803
441175H03K45k382R32O69q32K627P3l144J576J79J072j042j837j081m05j375K343
$$ 803 1048 -1334 -402 267 -565 2062 2135 -1009 567 746 1818 776 -1061 -2142 -2547 -3922 -1579
441694a579P06J812O27J42j285J840o01l03l06N12K458j914M98j942J616j719
$$ -1579 -873 939 1566 1708 423 2263 1662 1359 1053 1565 4023 2109 2607 665 2281 562
442182E62J489J011m033R59j857K980j03j281l42R03j719J255M22O27j087j146
$$ 562 2051 3062 -971 -12 -1869 1111 1008 -273 -615 288 -1431 -176 246 873 -214 -1360
442671a360K121j300j898J193K278j472K612j942P34q60j906N028k743L31j51
$$ -1360 761 -539 -2437 -1244 1034 -438 2174 232 966 106 -1800 3228 485 816 665
443128F65P5k480J261L131j946j54J823M2k313k7J439j446J044k456K016j009
$$ 665 740 -1740 -479 2652 706 552 2375 2417 104 77 1516 70 1114 -1342 674 -335
443617c35N34J167k31j499r53J978m65J467l391K040L52k735N05N24p06J416L35
$$ -335 199 1366 1135 -364 -1317 661 196 1663 -1728 312 664 -2071 -1566 -1042 -1748 -332 3
444135Cm27M50M1k929R16J28L262j219J041m17p25J655Q59k180J723k064L07J329
$$ 3 -424 26 67 -2862 -1946 -1818 1444 225 1266 849 124 1779 2638 458 2181 117 424 1753
444685A753L29j38m949K483N73M01O80l884K329P90q8k149J543n60K945q03L64
$$ 1753 2082 1944 -3005 -522 51 452 1132 -2752 -423 367 279 -1870 -327 -887 2058 1255 1619
445204A619j94m88L88r59j561J245M37J414k337j558M186j492n35l73n63q69K916
$$ 1619 1425 937 1325 366 -1195 50 487 1901 -436 -1994 2192 700 165 -208 -771 -1640 1276
445723A276m06L24j75l848K766J096K763j155j566q14K98J633j596J150j448r79
$$ 1276 870 1194 1019 -2829 -63 1033 3796 2641 1075 261 559 2192 596 1746 298 -681
446211f81J6j92M110m361J847j707j460L924k518J117k52R18K187k642j370k025
$$ -681 -665 -857 3253 -1108 739 -968 -2428 1496 -1022 95 -157 761 2948 306 -1064 -3089
446699c089K699K148K531k200k928n77J327K9N68J561O0P82j549o52L44K68Q5
$$ -3089 -390 1758 4289 2089 -839 -1416 -89 -60 508 2069 2129 2911 1362 710 1054 1322 1407
447218A407J583n79p75l095J871j990N85j0n86%j459L029j716M34K370k360K008
$$ 1407 2990 2411 1636 -1459 412 -1578 -993 -1003 -1589 -1589 -3048 -19 -1735 -1301 1069 -1291 717
447737G17k168j425r63L574L510r30L97j935l414J552Q0J92K390J552m764J191
$$ 717 -1451 -2876 -3839 -265 3245 2315 2712 777 -2637 -1085 -1005 -813 1577 3129 -1635 -444
448225d44j321J290J339k216J410K134l331K173J111j264j768n38J18J648M3K48
$$ -444 -1765 -475 864 -1352 58 2192 -1139 1034 2145 881 -887 -1425 -1307 341 384 632
448713F32J188q3r79k52j747J872l92K699k045k225J552l125K961J752k381K71
$$ 632 1820 1737 758 506 -1241 631 239 2938 893 -1332 220 -2905 56 1808 -573 -302
449202c02K700k921J370J74j88L26O13k284N04K81q1M81j114J225m81j117J051
$$ -302 2398 -523 847 1021 833 1159 1772 -512 -8 273 192 673 -441 784 303 -814 237
449721B37K682J580j693r88J431r08k953J933j850j324K36M95J322j855M69N74
$$ 237 2919 4499 2806 1818 3249 2341 -612 1321 -529 -1853 -1617 -1122 200 -1655 -1186 -612
450209f12J498j118k626K853q85N47L666Q54k959L109k362k32j691j087K124k291
$$ -612 886 -232 -2858 -5 -890 -343 3323 4177 1218 4327 1965 1733 42 -1045 1079 -1212
450697a212R68k333K11J423O51l59M12j014J906k229j500N023j997q27L01k07
$$ -1212 -244 -2577 -2366 -943 -292 -651 -239 -1253 653 -1576 -3076 1947 -50 -877 -576 -783
451185g83J214j43J058K89k730K83Q95J439p14k270K445j272m53K75j973L434
$$ -783 431 288 1346 1635 -1095 -812 83 1522 808 -1462 983 -289 -742 -467 -2440 994
451674I94l764J758o72P97J632p56M99r24K995n592L152q59J810J014k642J143
$$ 994 -2770 -1012 -1684 -887 745 -11 488 -436 2559 -3033 119 -740 1070 2084 -558 585
452162E85J173j160j410L093m17j757K039L62k336K991M10l188N38k638K423n91
$$ 585 1758 598 -812 2281 1864 107 2146 2508 172 3163 3573 385 923 -1715 708 117
452650A17k089J062m89O07N19J229J00M64m28n45P67j396l41L389j848j061l217
$$ 117 -1972 -910 -1399 -792 -273 956 1056 1520 1092 547 1314 -82 -423 2966 1118 57 -3160
453169c160K633j05K910J304m056K67m16K374J122j49j857J135k212j37j368n55
$$ -3160 -527 -632 2278 3582 -474 -207 -623 1751 2873 2724 867 2002 -210 -347 -1715 -2270
453657b270J852J242K816m024j68L001J58J205n244n74K452k626N538j357k470
$$ -2270 -418 824 3640 -384 -552 2449 2607 3812 -1432 -2006 446 -2180 3358 2001 -469
454115d69K492m402J650L268l001o74L86R04r72R63L45k353K701j486J804k484
$$ -469 2023 -2379 -729 2539 -462 -1136 -750 154 -818 145 490 -1863 838 -648 1156 -1328
454603a328P10J7j145O61J163K773m105J625J542r90k12P2O06j657j627r3M94
$$ -1328 -618 -601 -1746 -1085 78 2851 -1254 371 1913 923 711 783 1389 -268 -1895 -1988 -1494
455122a494R21j415K58K031o72o68k015L993J41k479K775p12k275J811L28R34
$$ -1494 -573 -1988 -1730 301 -371 -1039 -3054 939 1080 -1399 1376 664 -1611 200 528 1462
455611A462J047k576j537J539K261r93j86J963p3l439K115M25k690L398p11k598
$$ 1462 2509 -67 -1604 -65 2196 1203 1017 2980 2907 -532 1583 2008 -682 2716 2005 -593
456099e93l128J425O07K780q82o78K5K44J173j773j07j84J823J178n762M699K60
$$ -593 -3721 -2296 -1689 1091 209 -469 -444 -200 973 -800 -907 -1091 732 1910 -3852 847 1107
456618A107r38J799j234J055L7j412j747j770K114K86j203j63L362q1J2J205j982
$$ 1107 169 1968 734 1789 1826 414 -1333 -3103 -989 -703 -1906 -2069 1293 1212 1224 2429 447
457136D47j656k320L312K427M56n97P60m106o86N85j957J126K54o21j532K734
$$ 447 -1209 -3529 -217 2210 2666 2069 2829 -1277 -1963 -1378 -3335 -2209 -1955 -2576 -4108 -1374
457625a374K181k451j104K89Q43K73J27J590p92L147k942l10j667N77r79J839
$$ -1374 807 -1644 -2748 -2459 -1616 -1343 -1216 374 -418 2729 -213 -523 -2190 -1613 -2592 -753
458113g53j213L300j286l495L138K65l04K29q97O1j9R64K08o51j59J552O12l082
$$ -753 -1966 1334 48 -3447 -309 -44 -348 -119 -1016 -955 -974 -10 198 -453 -612 940 1552 -1530
458662a530j580K285N57q39N27J037l38k548Q68j172K586J747j669N48l68j846
$$ -1530 -3110 -825 -268 -1107 -580 457 119 -2429 -1561 -2733 -147 1600 -69 479 111 -1735
459151a735j914J410J154J463K347o56k91r80J342k722j877L156K167M8n611J986
$$ -1735 -3649 -2239 -1085 378 2725 2069 1778 798 2140 -582 -2459 697 2864 2912 -2699 -713
459639g13K235j504J554j193p13K774j017k025j354J183O10L244K892l846n54
$$ -713 1522 18 1572 379 -334 2440 1423 -602 -1956 -773 -163 3081 5973 2127 1573
460097A573K059p63l668K20L14J395j023R3k547K211k2j893J646J47j302m34j472
$$ 1573 3632 2869 -799 -579 -265 1130 107 200 -2347 -136 -158 -2051 -405 -258 -1560 -1994 -3466
460616c466R01N94j390L642j770j256J407Q29n37L004j273Q12Q3k077J863k42
$$ -3466 -2565 -1971 -3361 281 -1489 -2745 -1338 -509 -1046 1958 685 1497 1580 -497 1366 1124
461104A124k225r09M332l007K419k781k02J925N32l279J927p38K473M96K29l660
$$ 1124 -1101 -2010 2322 -685 1734 -1047 -1249 676 1208 -2071 -144 -882 1591 2087 2316 -1344
461592a344n09k051Q95L770o97J171k014K40J764k545n81J701L076k398K384m56
$$ -1344 -1853 -3904 -3009 761 64 1235 -779 -539 1225 -1320 -1901 -200 2876 478 2862 2406
462080B406j803n43k859L701N1J392o087L503K38R75J607o48p3q47m90j75k837
$$ 2406 603 60 -2799 902 953 2345 -3742 -239 -1 974 2581 1933 1860 1013 523 348 -2489
462599b489M376j191j472k969J643N96p7M89p5J403j748O86j29K039N13l775K48
$$ -2489 1887 696 -776 -3745 -2102 -1506 -1583 -1094 -1169 234 -1514 -828 -957 1082 1595 -2180 -1932
463118a932J12Q91J70J10j801M804o65q61j605J673j198L01n33K236l828K060
$$ -1932 -1820 -929 -759 -649 -2450 2354 1689 828 -777 896 -302 -1 -534 1702 -2126 -66
463606f6J025j942l066M552k19j191j861L566j677k282J484K503n17N18l939J742
$$ -66 959 -983 -4049 503 284 -907 -2768 798 -879 -3161 -1677 826 309 827 -3112 -1370
464095a370J898N61j762j102K429J641n61k101j39k567K420K24J766r18K175l535
$$ -1370 528 1089 -673 -1775 654 2295 1734 -367 -506 -3073 -653 -429 1337 419 2594 -941
464583i41L97L8k96K911j594l403L127j036J048q58j762L9J121m99R07K80J651
$$ -941 -544 -506 -802 2109 515 -2888 239 -797 251 -607 -2369 -2330 -1209 -1708 -801 -521 1130
465102A130j07j561Q76n83J97R63J575k013J95k29j876P13M04j197J620K302n20
$$ 1130 1023 -538 338 -245 -48 915 2490 477 672 443 -1433 -720 -316 -1513 107 2409 1889
465621A889r09k331M353m176K455j677J739n45j292j17N76J0j603n29j30K59N63
$$ 1889 980 -1351 3002 -1174 1281 -396 1343 798 -494 -611 -35 -25 -1628 -2157 -2287 -2028 -1465
466139a465J675q2p98j000j605L335L67p29m3L887n501r07K440K265l541M126
$$ -1465 210 128 -670 -1670 -3275 60 427 -302 -345 3542 -1959 -2866 -426 1839 -1702 2424
466628B424J9j345K746l394k899J760k543M854p84K510m622O84P98J751l61l232
$$ 2424 2443 1098 3844 450 -2449 -689 -3232 1622 838 3348 -1274 -590 208 1959 1598 -1634
467116a634K011J266l00j197J44n53K980l57R03j280P13p19K91n46l323l24N27
$$ -1634 377 1643 1343 146 290 -263 2717 2360 3263 1983 2696 1977 2268 1722 -1601 -1925 -1398
467635a398Q20K065q2J390j847k481J755l961J371J270k11K485M68m21l73n9j088
$$ -1398 -578 1487 1405 2795 948 -1533 222 -3739 -2368 -1098 -1309 1176 1644 1223 850 791 -297
468154b97P71p51N73l52L394j747k199K577p87j744K951j177l561J355n71o32
$$ -297 474 -277 296 -56 3338 1591 -608 1969 1182 -562 2389 1212 -2349 -994 -1565 -2197
468642b197L11k46L403m380K569N73n74L27P63M30r94j648J437J225k07k913k98
$$ -2197 -1886 -2132 1271 -3109 -540 33 -541 -214 549 979 -15 -1663 -226 999 792 -2121 -2419
469161b419K397L3J111J690l231J496J489j385n25j933J958J421k558j90j326
$$ -2419 -22 11 1122 2812 -419 1077 2566 1181 656 -1277 681 2102 -456 -646 -1972
469619a972m74M58P07L361j687l193L618M70Q20n06j500Q65j2P66j519q28L382
$$ -1972 -2446 -1988 -1281 2080 393 -2800 818 1288 2108 1602 102 967 955 1721 202 -626 2756
470137B756j449N77k118J370k199J36j988K362n52J225N62M78J04r06j6q51q15
$$ 2756 1307 1884 -234 1136 -1063 -927 -2915 -553 -1105 120 682 1160 1264 358 342 -509 -1324
470656a324J773j329Q26m561L260j051K269K078k82l896K904q85L21q41l6J40
$$ -1324 449 -880 -54 -4615 -1355 -2406 -137 1941 1659 -2237 667 -218 103 -738 -774 -634
471144f34M86P46k226K576J497l457q87R43k27L090j418j211L061r99l75j514
$$ -634 -148 598 -1628 948 2445 -1012 -1899 -956 -1183 1907 489 -722 2339 1340 965 -549
471633e49j392K922j414k48J319j691L15N999l817k991L771j234P76j45j756K3
$$ -549 -1941 981 -433 -681 638 -1053 -738 5261 1444 -1547 2224 990 1766 1621 -135 -112
472121a12J748J338k409J69K353j440n75L98J81m85n13q04J29m39j251N99p00
$$ -112 1636 2974 565 734 3087 1647 1072 1470 1651 1166 653 -151 -22 -461 -1712 -1113 -1813
472640a813n12M723j458J290j095j220r58L46N235k769k436P31m69K626L98m299
$$ -1813 -2325 2398 940 2230 1135 -85 -1043 -697 4538 1769 -667 64 -405 2221 2619 -1680
473128a680J784k478J803O43k05j103P43J735r39k13J557K54M96j076j577K146
$$ -1680 104 -2374 -571 72 -133 -1236 -493 1242 303 90 1647 1901 2397 1321 -256 1890
473616A890j85j035L70M50j446L039l556P03j069k080K848K09o11K094j680J66
$$ 1890 1705 670 1040 1490 44 3083 -473 230 -839 -2919 -71 138 -473 1621 -59 107
474105A07J184j147r1L702j652K612j872j543r60r24j06J719j401J48J157L13
$$ 107 1291 144 53 3755 2103 4715 2843 1300 340 -584 -690 1029 -372 -224 933 1246
474593A246R85j936p2k89r52P46k799J381j97K35J219j38J792q26k446j004L429
$$ 1246 2231 295 223 -66 -1018 -272 -3071 -1690 -1887 -1652 -433 -571 1221 395 -2051 -3055 374
475112C74j367J693k287O10l10Q98r58K535j679J381N9m36l150K763J020k76J194
$$ 374 -993 700 -1587 -977 -1287 -389 -1347 1188 -491 890 949 513 -2637 126 1146 870 2064
475631B064K139k263j740j459P78J933J097j252N12k574p08J168o7L339l972P59
$$ 2064 4203 1940 200 -1259 -481 1452 2549 1297 1809 -765 -1473 -305 -372 2967 -1005 -246
476119b46M36p86M20L85k668o7j47M114k00o39j568J793j172J442R3j599k641
$$ -246 190 -596 -176 209 -2459 -2526 -2673 1441 1241 602 -966 827 -345 1097 1190 -409 -3050
476638c050J823p93J905O46p56P31J989k169m89R52J038J392l676j220J549L593
$$ -3050 -1227 -2020 -115 531 -225 506 2495 326 -163 789 1827 3219 -457 -1677 -128 3465
477126C465k125k701l06K572J591j055l160K462m09N45l73j313J737r50O44O15
$$ 3465 1340 -1361 -1667 905 2496 1441 -1719 743 334 879 506 -807 930 -20 624 1239
477614A239P32k908J421m73j043J675j161K400P82l969j438L5K977k859K721k585
$$ 1239 1971 -937 484 11 -1032 643 -518 1882 2664 -1305 -2743 -2708 269 -2590 131 -2454
478103b454J83O12L047j435l84R18j087J270j58L558r35j269j055o76J101J989
$$ -2454 -2271 -1659 1388 -47 -431 487 -600 670 512 4070 3135 1866 811 135 1236 3225
478591C225j905K44q47r61L78k149o69N80J335J817J280j637l088K375m26m53
$$ 3225 1320 1564 717 -244 134 -2015 -2684 -2104 -769 1048 2328 691 -2397 -22 -448 -901
479079i01P6J206K875n089R17L435m95j111r91r44q2L777m240j070J814L58K630
$$ -901 -825 381 3256 -1833 -916 2519 2024 913 -78 -1022 -1104 2673 -1567 -2637 -823 -465 2165
479598B165j164k240Q71j271j183K548m31J560J232j744O23q63k815J708K851
$$ 2165 1001 -1239 -368 -1639 -2822 -274 -705 855 2087 343 966 103 -2712 -1004 1847
480056A847j743K289M10l366L683j270m18j857J49j310m14J376K077o62j055J305
$$ 1847 104 2393 2803 -563 3120 1850 1432 -425 -276 -1586 -2000 -624 1453 791 -264 1041
480544A041m66j298K52M89r16K115K387l150k040J824L08j302R90J297j494j40
$$ 1041 575 -723 -471 18 -898 1217 3604 454 -1586 238 546 -756 234 1531 37 -103
481032a03L327k05J350l007J06J195j478J65k70k771j435M753K80k446j798K019
$$ -103 3224 3019 4369 1362 1468 2663 1185 1350 1080 -1691 -3126 1627 1907 -539 -2337 -318
481521c18L89R28k800M98J224J103P17k590R45j014K003Q04J213r05R48l239k781
$$ -318 71 999 -1801 -1303 -79 1024 1741 -849 96 -918 1085 1889 3102 2197 3145 -94 -2875
482040b875K993N59j194j044J346n4p02J329J625r41k95p20q57j047O83l65j38
$$ -2875 118 677 -517 -1561 -215 -269 -971 358 1983 1042 747 27 -830 -1877 -1194 -1559 -1697
482558a697N41K613n81J470j674q69l13J141j027N72J714k335K469l65l509m9
$$ -1697 -1156 1457 876 2346 672 -197 -510 631 -396 176 1890 -445 2024 1659 -1850 -1899
483047a899Q9n73J954p32o22J904j633J211J062r89q29o17J10K52q39K629j178
$$ -1899 -1810 -2383 -429 -1161 -1783 121 -1512 -301 761 -228 -1057 -1674 -1564 -1312 -2151 478 -700
483565g00J886r65j11j969K261P08j141J446M27k204q60J730l7J046j985Q29J935
$$ -700 1186 221 110 -1859 402 1110 -31 1415 1842 -362 -1222 508 471 1517 -468 361 2296
484084B296j45J622j124r29j749J41K187l792k802L585O21J189j69j816K815j263
$$ 2296 2151 3773 2649 1720 -29 112 2299 -1493 -4295 -710 -89 1100 931 -885 1930 667
484573F67k93j063p42n76j002J556J214m09k03J57J570k075n91o25K749l88j462
$$ 667 374 -689 -1431 -2007 -3009 -1453 -239 -648 -851 -694 876 -1199 -1790 -2415 334 -54 -1516
485091a516N86O54j065J656r46L48L132k482M43m38k296J104K961j471l88k21
$$ -1516 -930 -276 -1341 315 -631 -283 2849 367 810 372 -1924 -820 2141 670 282 61
485580F1K438j509n11j918L827l96n21r54k47m19O79k717%J813J688j447K21P61
$$ 61 2499 990 479 -1439 2388 1992 1471 517 270 -149 530 -2187 -2187 -374 1314 -133 88 849
486129H49P02P33k075J127k059M87j735Q68J768k3J73k854K077O70R77q82j370
$$ 849 1551 2284 209 1336 -723 -236 -1971 -1103 665 642 815 -2039 38 708 1685 803 -567
486648e67K484j247N02j699k55j01n17J411m36N14K417k213L22J548l87q36j601
$$ -567 1917 670 1172 -527 -782 -883 -1400 11 -425 89 2506 293 615 2163 1776 940 -661
487167f61j491J176R87q42j249K278j564J32L263n66j151J65M5j148K560m34q29
$$ -661 -2152 -976 11 -831 -2080 198 -1366 -1234 2029 1463 312 477 522 -626 1934 1500 671
487686F71k363L053j431p3Q89M10m150M537k406L27N20Q10K577j063k660K020
$$ 671 -1692 1361 -70 -143 746 1156 -2994 1543 -863 -536 -16 794 3371 2308 -352 1668
488174A668j978K107j89r97r16N40M28j161j13O18j664L380k132J517j341k862
$$ 1668 -310 1797 1608 611 -305 235 663 -498 -611 7 -1657 1723 -409 1108 -233 -3095
488662c095L152K932k706o06J955k055J541j47q44r18J243N41K93J9N08J709k688
$$ -3095 57 2989 283 -323 1632 -423 1118 971 127 -791 452 993 1286 1305 1813 3522 834
489181H34O95K74j484n2Q16J416m4l317Q19J394R43j797k044q07J115K447J878
$$ 834 1529 1803 319 267 1083 2499 2455 -862 -43 1351 2294 497 -1547 -2354 -1239 1208 3086
489700C086j059L08k533J064j186R93J645J36j841j606J112J614l927K423J691
$$ 3086 2027 2335 -198 866 -320 673 2318 2454 613 -993 119 1733 -2194 229 1920
490157A920j624j050K862k7Q28k991o69K141j225o7L31L2j152j784Q10j187J608
$$ 1920 296 -754 2108 2081 2909 -82 -751 1390 165 98 429 461 -691 -2475 -1665 -2852 -1244
490676a244K877J283k691J906K42j198K010j409O62j337J576j953l90J269k119
$$ -1244 1633 2916 225 2131 2373 1175 3185 1776 2438 1101 2677 724 334 1603 -516
491134e16R99p85j097L679k820l97K4K442j553r81N70P81K088j354J007L57j771
$$ -516 483 -302 -1399 2280 -540 -937 -913 1529 -24 -1005 -435 346 2434 1080 2087 2444 673
491653F73l14J608p60K421n179M523r02j124j673J460P50p54p80j006K74N53K810
$$ 673 359 1967 1207 3628 -1551 2972 2070 946 -727 733 1483 729 -51 -1057 -783 -230 2580
492172B580j188J272k839K91R39K098r16j717l04J743k035K58Q75k7p89q68o12
$$ 2580 1392 2664 -175 116 1055 3153 2237 520 216 1959 -76 182 1057 1030 241 -627 -1239
492691a239j74J054J041o21k31J702n01j322J458k703Q2J073J024o33J467j70
$$ -1239 -1413 -359 682 61 -170 1532 1031 -291 1167 -1536 -1454 -381 643 10 1477 1307
493179A307J165j748K628k948k076K389j484J262N54J413j862o0l55P63j182M67
$$ 1307 2472 724 3352 404 -1672 717 -767 495 1049 2462 600 540 185 948 -234 233
493667B33R9K57l62J24O12j066J646L84j680j76j369Q23K51M46K638k192J393
$$ 233 332 589 227 351 963 -103 1543 1927 247 71 -1298 -475 -224 222 2860 668 2061
494186B061l206P6R61k23M498m350J705k060K348n98j480j763k34Q52L44O78r18
$$ 2061 -1145 -1069 -108 -331 4167 -183 1522 -538 1810 1212 -268 -2031 -2265 -1413 -1069 -391 -1309
494705a309P57j064J645j167N16K046l911K084K812j192j680p2M21M31p34J027
$$ -1309 -552 -1616 29 -1138 -622 1424 -2487 -403 2409 1217 -463 -535 -114 317 -417 610
495193F10J217k111Q21Q05l26J688k98l872K322L110m92k179k632K951j460J733
$$ 610 1827 -284 537 1342 1016 2704 2406 -1466 856 3966 3474 1295 -1337 1614 154 1887
495681A887j479O57K024j365j134P64j029j19K388k141j243n29K201J351J173
$$ 1887 408 1065 3089 1724 590 1354 325 206 2594 453 -790 -1319 882 2233 3406
496139C406J282n55k309J795j527R77p85k6R40j917n27N60j183O69k573J437m57
$$ 3406 4688 4133 1824 3619 2092 3069 2284 2258 3198 1281 754 1314 131 800 -1773 -336 -793
496658g93k461m96J518M231l363K22j9j829L563K435j920j630L445J032l519K120
$$ -793 -3254 -3750 -2232 1999 -1364 -1142 -1161 -2990 573 3008 1088 -542 2903 3935 416 2536
497146B536K429m566K88l8N4J647j791k8P03j010J146Q01j879m6J454k577P86
$$ 2536 4965 399 687 649 703 2350 559 531 1234 224 1370 2171 292 246 1700 -877 -91
497665i1N84J43j685J441K489l205n43N20j295K805j350J521l053K031L055j909
$$ -91 493 636 -1049 392 2881 -324 -867 -347 -1642 1163 -187 1334 -1719 312 3367 1458
498153A458j734J273n6k388l18k00J793M105j669R45m598Q36j011j433N88J903
$$ 1458 -276 997 941 -1447 -1765 -1965 -172 3933 2264 3209 -1389 -553 -1564 -2997 -2409 -506
498642e06O47l320N162j625J694l265k012J739L524Q83m582K048J27o58K3j356
$$ -506 141 -3179 1983 358 2052 -1213 -3225 -1486 2038 2921 -1661 387 514 -144 -121 -1477
499130a477M32j80J489o82J553k14l083j109J976J766j776K283j864J017N92j655
$$ -1477 -1045 -1225 264 -418 1135 921 -2162 -3271 -1295 471 -1305 978 -886 131 723 -932
499618i32R19O95N26j099J095l63J292J155j895K10O09l31j220O24Q36j374j060
$$ -932 -13 682 1208 109 1204 841 2133 3288 1393 1603 2212 1881 661 1285 2121 747 -313
500137c13M71K57J841m45j626P27J87o37j36p5r37j125P07P45j001j345Q3o09
$$ -313 158 415 2256 1811 185 912 1099 462 326 251 -686 -1811 -1104 -359 -1360 -2705 -2622 -3231
500687c231J058J760J777j262K507k222n53J871J018k402M67j460O5N77J077l21
$$ -3231 -2173 -413 1364 102 2609 387 -166 1705 2723 321 788 -672 -607 -30 1047 726
501175G26j327J285J109l506N69J295m68j167L60L130k511r02N71L106K112m327
$$ 726 -601 684 1793 -1713 -1144 151 -317 -1484 -1124 2006 -505 -1407 -836 2270 4382 55
501663E5j196O62m57M07j827K738Q40M23N95L49j689k33p31L981l048O91O16k091
$$ 55 -1141 -479 -936 -529 -2356 382 1222 1645 2240 2589 900 667 -64 3917 869 1560 2176 85
502212H5J030J74N78j340j102K494o36l44m1R49Q77j415l015j56K127n75J852
$$ 85 1115 1289 1867 527 -575 1919 1283 939 898 1847 2724 1309 -1706 -1862 265 -310 1542
502731A542j760K650M28p45j835l090K85L369k168n13J950j689J004R64k086j972
$$ 1542 -218 2432 2860 2115 280 -2810 -2525 844 -1324 -1837 113 -1576 -572 392 -1694 -3666
503219c666L022m52J395J528K64P0j876K185r18j457m61k72m44K058J762j452
$$ -3666 -644 -1096 299 1827 2091 2161 285 2470 1552 95 -366 -638 -1082 976 2738 1286
503708A286j573j466J390j017J494j090J676k424O32p51J534k25k104K567j101
$$ 1286 -287 -1753 -363 -1380 114 -976 700 -1724 -1092 -1843 -309 -534 -2638 -71 -1172
504165a172L367p87J802J257j168j885N4O1m962J014Q86K57K88L408j083o36j070
$$ -1172 2195 1408 3210 4467 3299 1414 1468 1529 -3433 -2419 -1533 -1276 -988 2420 1337 701 -369
504684c69j869K049R51M301m228l13p43N07J330j676k772J452K590l199P73q26
$$ -369 -2238 -189 762 5063 835 522 -221 286 1616 -60 -2832 -1380 1210 -1989 -1216 -2042
505172b042J361O3m37K448R39J378r0j630j503j45j844R93j146Q04K588k625M3
$$ -2042 -681 -618 -1055 1393 2332 3710 3620 1990 487 342 -1502 -509 -1655 -851 1737 -888 -845
505692h45l103M784K759O37m544n01l01J141M637l016j557l394K353K049q72j06
$$ -845 -3948 836 3595 4232 -312 -813 -1114 27 4664 1648 91 -3303 -950 1099 227 121
506180A21j322M43N11N2J778j648L94J421n21k585p10L647k566K247L85L009j570
$$ 121 -1201 -758 -247 -195 1583 -65 329 1750 1229 -1356 -2066 1581 -985 1262 1647 4656 3086
506699C086q59k584O11K144l354j914K823j811O0R6J194K783n21k383j303R47
$$ 3086 2227 -357 254 2398 -956 -2870 -47 -1858 -1798 -1702 -508 2275 1754 -629 -1932 -985
507187i85J231K119j203k97J647l163Q95m81Q49k618O95O71j332R2J712R29j633
$$ -985 246 2365 1162 865 2512 -651 244 -237 612 -2006 -1311 -640 -1972 -1880 -168 761 -872
507706h72J623k219j688J802J509J826j097r3j7j210j821J078L357o09j052l67
$$ -872 751 -1468 -3156 -1354 155 1981 884 791 774 -436 -2257 -1179 2178 1569 517 150
508194A50J485p23N01l675L147L944l089l335j501L771J86l432Q72R67J079J437
$$ 150 1635 912 1413 -2262 885 4829 1740 -1595 -3096 675 861 -2571 -1699 -732 347 1784
508682A784Q54M97k194j656k245k05K639L22j30J477M82K299l164j618J373q41
$$ 1784 2638 3135 941 -715 -2960 -3165 -526 -204 -334 1143 1625 3924 760 -858 515 -326
509170c26j18J533K13J933j916Q56m62L75j102j463K530l775J329K425k858M38
$$ -326 -444 1089 1302 3235 1319 2175 1713 2088 986 -477 2053 -1722 -393 2032 -826 -388
509659c88M4J229p31k358L1K650k703K959o25J976j931K282m906N38J500r73N37
$$ -388 -344 885 154 -2204 -2173 477 -2226 733 108 2084 153 2435 -2471 -1933 -433 -1406 -869
510177h69K155m963k169M316j71j797N169p15N76k387K158j0j649L80k328k910
$$ -869 1286 -3677 -5846 -1530 -1701 -3498 1671 956 1532 -855 1303 1293 -356 24 -2304 -5214
510666e214L564R52j345K791j833J833N34l760K608J07j824j178L319jp59j360
$$ -5214 -1650 -698 -2043 748 -1085 748 1282 -2478 130 237 -1587 -2765 554 553 -206 -1566
511154a566J401L769m823J197J390m595K815j583J367J827n28l547J556n98O04
$$ -1566 -165 3604 -1219 -22 1368 -3227 -412 -1995 -628 1199 671 -2876 -1320 -1918 -1314
511612a314n90K819j722q81j313J317k46K313l079J595j155N67L533j651j618
$$ -1314 -1904 915 -807 -1688 -3001 -1684 -1930 383 -2696 -1101 -2256 -1689 1844 193 -1425
512070a425L351j51k869j442K912j735m29J475j098N81K139J764k87P18k755k249
$$ -1425 1926 1775 -1094 -2536 376 -1359 -1788 -313 -1411 -830 1309 3073 2786 3504 749 -1500
512558a500K29lL222l522J623K789J029l357k713K08J00J283o48L01k067R16J100
$$ -1500 -1271 -1274 1948 -1574 49 2838 3867 510 -2203 -1995 -1895 -612 -1260 -959 -3026 -2110 -1010
513077a010j380J367j081j202L512m04q63o12n0j804P16o70K695N20l13L096J36
$$ -1010 -2390 -1023 -2104 -3306 206 -198 -1061 -1673 -1723 -3527 -2811 -3481 -786 -266 -579 2517 2653
513596B653l741K57K172j100J079L246k968k844P75K374j47l281K835J533k211
$$ 2653 -1088 -831 1341 241 1320 4566 1598 -1246 -471 1903 1756 -1525 1310 2843 632
514053F32j66K304j476J548k857O91J566l407M632j420K13k406Q25j381L10L714
$$ 632 466 2770 1294 2842 -15 676 2242 -1165 3467 2047 2260 -146 679 -702 -392 3322
514542C322j471j188K269j857l40k796O81j95K636J885N301J2191J2613L7739
$$ 3322 1851 663 2932 1075 735 -2061 -1380 -1575 1061 2946 8247 20438 33051 70790
514969G0790K42550O79857o65056j86186n3818k9887j8978j2871m503L379o320
$$ 70790 313340 993197 328141 141955 88137 58250 39272 26401 21898 25277 18957
515305A8957m685q39p52K156L234p029m20K426L412p998m484J252K110P89k39
$$ 18957 14272 13433 12681 14837 18071 11042 10622 13048 16460 8462 3978 5230 7340 8129 7890
515763G890j868K309k21L865Q47R45M090O065Q335L1430J16835P50554m07147
$$ 7890 6022 8331 8110 11975 12822 13767 17857 23922 32257 63687 180522 931076 523929
516159E23929l27224q6785l7649j7842j4370j1023n817n63n403j983p16k941N39
$$ 523929 196705 109920 72271 54429 40059 29036 23219 22656 17253 15270 14554 11613 12152
516556A2152j219j014k898j084K105l976M70N144j740k475k828M826k291j595
$$ 12152 10933 9919 7021 5937 8042 4066 4536 9680 7940 5465 2637 7463 5172 3577
516983C577j272L282K27R51J786l987P41q54j672l419M137J777j367j120r1q62
$$ 3577 2305 5587 5814 6765 8551 4564 5305 4451 2779 -640 3497 5274 3907 2787 2696 1834
517471A834p5K477N4j448M036k360J424N87q06q49j903P85k208L210p27n08J26
$$ 1834 1759 4236 4290 2842 6878 4518 5942 6529 5723 4874 2971 3756 1548 4758 4031 3523 3649
517990C649M594k500k255O65p05n18k559J3L36m99J063N16m36q6J10j627O05r12
$$ 3649 8243 5743 3488 4153 3448 2930 371 384 720 221 1284 1800 1364 1278 1388 -239 366 -546
518540e46K782r21m64o36J355j399K149j662N70j691J104N46l63J698q25l02J581
$$ -546 2236 1315 851 215 1570 171 2320 658 1228 -463 641 1187 824 2522 1697 1395 2976
519058B976k170j53Q31K908m599L57J254l559J926o82k733K411q71J927K107R42
$$ 2976 806 653 1484 4392 -207 150 1404 -2155 -229 -911 -3644 -1233 -2104 -177 1930 2872
519547B872p85j965l28J565K06J056l210L103K388k937J700o02K50m22j485j460
$$ 2872 2087 122 -206 1359 1565 2621 -589 2514 4902 1965 3665 3063 3313 2891 1406 -54
520035e4r80J093j38L11P27p1j207J843j229n77J009j90J475l224j365L542P51
$$ -54 -1034 59 -79 232 959 888 -319 1524 295 -282 727 537 2012 -1212 -2577 965 1716
520554A716k013o36J18J674k886L028m77K026K108l157m537J830J288K080k726
$$ 1716 -297 -933 -815 859 -2027 1001 524 2550 4658 1501 -3036 -1206 82 2162 -564
521012e64O35K529l43j077j25L19l726J032l182N669P91k073j100J879J289j874
$$ -564 71 2600 2257 1180 1055 1374 -2352 -1320 -4502 1167 1958 -115 -1215 664 1953 79
521500G9M20r36r69Q93k26P08O24j17o20m22J754k190R72K012N52q81j40J374
$$ 79 499 -437 -1406 -513 -739 -31 593 476 -144 -566 1188 -1002 -30 1982 2534 1653 1513 2887
522049B887L54j960j483J010P69j552M67K071J226j975K61j186k150L05J498R73
$$ 2887 3241 1281 -202 808 1577 25 492 2563 3789 1814 2075 889 -1261 -956 542 1515
522538A515J849j868j226l81K271l343K471l122L275o98r82q30o80j883o5J523
$$ 1515 3364 1496 270 -111 2160 -1183 1288 -1834 1441 743 -239 -1069 -1749 -3632 -3697 -2174
523026b174N81K084j102l21J690L48k78k422J032j887J224J74J884j526J058J735
$$ -2174 -1593 491 -611 -932 758 1106 828 -1594 -562 -2449 -1225 -1051 833 -693 365 2100
523514B100J211j774kQ47Q97j634m023K386Q38l398M339m79L089m057k347J528
$$ 2100 3311 1537 1535 2382 3279 1645 -2378 8 846 -2552 1787 1308 4397 340 -2007 -479
524002d79L54q24q87J730p68K148R14P86l20k002k076l32j38K997o14J127j980
$$ -479 -125 -949 -1836 -106 -874 1274 2188 2974 2654 652 -1424 -1756 -1894 1103 489 1616 -364
524521c64j344o28M47j554K490k515L447m393J140P99K46K381N8K55k187J083
$$ -364 -1708 -2336 -1889 -3443 -953 -3468 -21 -4414 -3274 -2475 -2229 152 210 465 -1722 -639
525010f39j191j829M48K046K744L84L57k641k960K534K269q37J068j895K457k140
$$ -639 -1830 -3659 -3211 -1165 1579 1963 2320 -321 -3281 -747 1522 685 1753 -142 2315 175
525498A75j337j741m98K744j58L49j444k099J961Q39K166k411J076J796r51J25
$$ 175 -1162 -2903 -3401 -657 -815 -466 -1910 -4009 -2048 -1209 957 -1454 -378 1418 467 592
525986E92j020N11j119L89j953K394K463p07l247P36l442J9K937K239L28k119
$$ 592 -428 83 -1036 -647 -2600 -206 2257 1550 -1697 -961 -4403 -4384 -1447 792 1120 -999
526474i99Q86j66k933K122J367m099K890r39J10j103k042M08M325N79k381J726
$$ -999 -113 -279 -3212 -1090 277 -3822 -932 -1871 -1761 -2864 -4906 -4498 -173 406 -1975 -249
526963b49P17k767p69J398R9J696N25R40l361j320L465j840K49Q02R99J300m425
$$ -249 468 -2299 -3068 -1670 -1571 125 650 1590 -1771 -3091 374 -1466 -1217 -415 584 1884 -2541
527481b541K979j472R63j787K512J407K53j901J748j184j90J443l955L709k437
$$ -2541 438 -1034 -71 -1858 654 2061 2314 413 2161 977 787 2230 -1725 1984 -453
527939d53J068k356J832p5j693J966k129K606p08k350Q77o74K520k285J402M68
$$ -453 615 -1741 91 16 -1677 289 -1840 766 58 -2292 -1415 -2089 431 -1854 -452 16
528427A6j851Q80j985L257j238K26K61K0o39N38j351k03K689l74j884J596q0k48
$$ 16 -1835 -955 -2940 317 -921 -695 -434 -414 -1053 -515 -1866 -2069 620 246 -1638 -42 -122 -370
528977c70K301n70K8n99j068J395n88R69k940L658l070k193L170M61m02Q91l47
$$ -370 1931 1361 1389 790 -278 1117 529 1498 -1442 2216 -854 -3047 123 584 182 1073 726
529496G26j883J252J370j462R41J532n61k286k64J59R35p83j285J547j462K396
$$ 726 -1157 95 1465 3 944 2476 1915 -371 -635 -476 459 -324 -1609 -62 -1524 872
529984H72l907L447l36k404j151L037R11m32N87K925n622p31K321k048R35J57
$$ 872 -3035 412 76 -2328 -3479 -442 469 37 624 3549 -2073 -2804 -483 -2531 -1596 -1439
530472a439K968r27k462J244j022J140R46j272K71j851N83K826j005j263j487
$$ -1439 1529 602 -1860 -616 -1638 -498 448 -824 -553 -2404 -1821 1005 0 -1263 -2750
530930b750j272J864n4J160k689O50R65J160M19r38J788J388l278K050k093J004
$$ -2750 -4022 -2158 -2212 -1052 -3741 -3091 -2126 -966 -547 -1485 303 1691 -1587 463 -1630 -626
531418f26r39j290J013n62M28M05J812k128j016K555J39J344l303K316m6j524
$$ -626 -1565 -2855 -1842 -2404 -1976 -1571 241 -1887 -2903 -348 -209 1135 -2168 148 102 -1422
531907a422k250J510J877j082K851r93J559K223k402k308J979j910M970j914j893
$$ -1422 -3672 -2162 -285 -1367 1484 491 2050 4273 1871 -437 1542 -368 4602 2688 795
532364G95j65j704J476k4j209r34K35L207j985K411K15o34j438k502K272r16j009
$$ 795 630 -1074 402 378 -831 -1765 -1530 1677 -308 2103 2318 1684 246 -2256 16 -900 -1909
532883a909J71J330K449q36p40J055j775j414M86j722J696M09j426J947n83L25
$$ -1909 -1738 -408 2041 1205 465 1520 -255 -1669 -1183 -2905 -1209 -800 -2226 -279 -862 -537
533371e37j069O07j211o0L594j415J1q83J086p39K534k826p75k0j34o87K722K336
$$ -537 -1606 -999 -2210 -2270 1324 -91 -80 -963 123 -616 1918 -908 -1683 -1703 -1837 -2524 198 2534
533921B534l053N162p44k401L22J556j636J610K752L785J6957L9300K41285J18115
$$ 2534 -519 4643 3899 1498 1820 3376 1740 3350 6102 9887 26844 66144 307429 425544
534348D25544k79138p1939k0884j9560j1279n613l066k741n82j779L625m515p24
$$ 425544 146406 74467 53583 34023 22744 17131 14065 11324 10742 8963 12588 8073 7349
534745G349k7k705N26l106R39j181L36k944L090k89r70J180J61m0l836J324O92
$$ 7349 7322 4617 5143 2037 2976 1795 2131 -813 2277 1988 1018 2198 2359 2319 -1517 -193 499
535264D99m31M1J304N71j374q73J310o0K384k093l95l1j852J926P44Pj781J502
$$ 499 68 109 1413 1984 610 -263 1047 987 3371 1278 883 852 -1000 926 1670 1677 -104 1398
535813A398K83k197j889L367l24L84j605j289L753Q58j191P81J520l055J270k683
$$ 1398 1681 -516 -2405 962 638 1022 -583 -1872 1881 2739 1548 2329 3849 794 2064 -619
536301f19k476J232J542j126K931j260J78J813j800J039l605J638j710L352K368
$$ -619 -3095 -1863 -321 -1447 1484 224 402 2215 415 1454 -2151 -513 -2223 1129 3497
536759C497l267l31K551o27O81K186j587o117J071K431r72l44O88j963J012j366
$$ 3497 230 -101 2450 1823 2504 4690 3103 -3014 -1943 488 -484 -828 -140 -2103 -1091 -2457
537247b457J076K18M21m01m47J1J26K284J78k208K190j772k60j027K867j453j50
$$ -2457 -1381 -1163 -742 -1143 -1590 -1579 -1453 831 1009 -1199 991 -781 -1041 -2068 799 -654 -804
537766h04k76K959j859n83P21N35k430L030J002k122j504K159l41l9K77N99j420
$$ -804 -1080 1879 20 -563 158 693 -1737 1293 2295 173 -1331 828 487 448 725 1324 -96
538285i6r13Ok97J238r46N42M42J441J030j544n69k031n69J649j63j030R29p66
$$ -96 -1009 -1003 -1300 -62 -1008 -466 -24 1417 2447 903 334 -1697 -2266 -617 -780 -1810 -881 -1647
538835a647L599k88l240K003L23k140Q39M38j325K145l22M23P51m229j309K540
$$ -1647 1952 1664 -1576 427 750 -1390 -551 -113 -1438 707 385 808 1559 -2670 -3979 -1439
539323a439L68m46K20O07J648J128k876J016M009p00q11J21l475r23K353k71k589
$$ -1439 -1071 -1517 -1297 -690 958 2086 -790 226 4235 3535 2724 2845 -630 -1553 800 529 -2060
539842b060K633j353J681j047k896L340j17j53k982K018J81M91j771O5R87J029
$$ -2060 573 -780 901 -146 -3042 298 181 28 -2954 -936 -755 -264 -2035 -1970 -983 46
540330D6k076J889P57N00k226R87l869O65K4K994P88m13r13K341k993K388m114
$$ 46 -2030 -141 616 1116 -1110 -123 -3992 -3327 -3303 -309 479 66 -847 1494 -1499 889 -3225
540849c225j99Q61L863P02k019K768r00k873m48L395J15q34o79J438k162q05J556
$$ -3225 -3424 -2563 1300 2002 -17 2751 1851 -1022 -1470 1925 2040 1206 527 1965 -197 -1002 554
541367E54J123m643J601K853J091m829J135K155k219k530J758J425j280p00J33
$$ 554 1677 -2966 -1365 1488 2579 -2250 -1115 1040 -1179 -3709 -1951 -526 -1806 -2506 -2373
541825b373K779k459o02m148L322K317n0k805K601r16K849m29J038l758M82J314
$$ -2373 406 -2053 -2655 -6803 -3481 -1164 -1214 -4019 -1418 -2334 515 86 1124 -2634 -2152 -838
542313h38K511k176L81M19N43n46k994R63K222j447J93j238L789J925j302J235
$$ -838 1673 -503 -122 297 840 294 -2700 -1737 485 -962 -769 -2007 1782 3707 2405 3640
542802C640l770k264L860j460L42k59k96K04j077J261J00k72O60j170k19N71j758
$$ 3640 -130 -2394 1466 6 348 89 -207 -3 -1080 181 281 9 669 -501 -720 -149 -1907
543321a907L026k246N4O67r07k25J586k082j309J267k29K165k859o57J122K181
$$ -1907 1119 -1127 -1073 -406 -1313 -1538 48 -2034 -3343 -2076 -2305 -140 -2999 -3656 -2534 -353
543809c53Q92j66l075n19J753j485K197j25j74l119K011R12j36p44J318q65M89
$$ -353 539 373 -2702 -3221 -1468 -2953 -756 -881 -1055 -4174 -2163 -1251 -1387 -2131 -813 -1678 -1189
544328a189j8K207k767q26K564R06k990j720P74P54J32r2J675J502r12K96K88
$$ -1189 -1207 1000 -1767 -2593 -29 877 -2113 -3833 -3059 -2305 -2173 -2265 -590 912 0 296 584
544847E84j776p8J840l057j475L69j212Q65M226k575K237n79j56j479K447j261
$$ 584 -1192 -1270 570 -2487 -3962 -3593 -4805 -3940 286 -2289 -52 -631 -787 -2266 181 -1080
545335a080J083k051N37R40j77l251o53K656N7R20j55M99qJ70j911j619M271m48
$$ -1080 3 -2048 -1511 -571 -748 -3999 -4652 -1996 -1939 -1019 -1174 -675 -683 -513 -2424 -4043 228 -220
545884b20Q25K135l414J207p32k93L621j002j737j66k215K88K429k71m79j56J561
$$ -220 605 2740 -674 533 -199 -492 3129 2127 390 224 -1991 -1703 726 455 -24 -180 1381
546403A381J673l690k79K012m69o35j8l196p46N314k776j480J428n94J669P99
$$ 1381 3054 -636 -915 1097 628 -7 -25 -3221 -3967 1347 -1429 -2909 -1481 -2075 -406 393
546891C93Q66j196j243O20R85R51L61O9O2j500P58j207j165J4n80K304R30p21
$$ 393 1259 63 -1180 -560 425 1376 1737 1806 1868 368 1126 -81 -1246 -1232 -1812 492 1422 701
547441G01j898J539j312R44j538j232o18J514j134J525o94K747k453K174K19k040
$$ 701 -1197 342 -970 -26 -1564 -2796 -3414 -1900 -3034 -1509 -2203 544 -1909 265 484 -1556
547929a556L821j330j519J237R28P59l246l92r49j867N665o20j483m41J661n40
$$ -1556 2265 935 -584 653 1581 2340 -906 -1298 -2247 -4114 1551 931 -552 -993 668 128
548417A28P06N43j947p89P53N24q5R20k68M83n29m4j159j043L502R9j348j516
$$ 128 834 1377 -570 -1359 -606 -82 -167 753 485 968 439 395 -764 -1807 1695 1794 446 -1070
548967a070L890m66p32j213J742j847l380K945l35J805k077q66m27K911j891R3
$$ -1070 2820 2354 1622 409 2151 304 -3076 -131 -466 1339 -738 -1604 -2031 880 -1011 -918
549455i18j577K170j059j509K780M6j174R85l219J550K099M47j620r77J174J10
$$ -918 -2495 -325 -1384 -2893 -113 -67 -1241 -256 -3475 -1925 174 621 -999 -1976 -802 -692
549943f92j905K351j788J904q5j874R25K934m48J156M190K2761M9784m4897j9481
$$ -692 -2597 -246 -2034 -130 -215 -2089 -1164 1770 1322 2478 6668 29429 79213 34316 14835
550401A4835o032k694l316J278l117O79K04r24j395J134K616j434j996P07j348
$$ 14835 8803 6109 2793 4071 954 1633 1837 913 -482 652 3268 1834 -162 545 -803
550859h03o1j88N70K514l480J448O4K57q00j390p63J801J13M022n038M147j512
$$ -803 -864 -1052 -482 2032 -1448 0 64 321 -479 -1869 -2632 -831 -718 3304 -1734 2413 901
551377I01J07J607k566k69k600L236O80j892q22K068k685O97L684M69l437k134
$$ 901 1008 2615 49 -220 -2820 416 1096 -796 -1618 450 -2235 -1538 2146 2615 -822 -2956
551866b956L363R00m664j860L078K183J145K56K69l431O87l95J358Q87j981L735
$$ -2956 407 1307 -3357 -5217 -2139 44 1189 1445 1714 -1717 -1030 -1425 -67 820 -1161 2574
552354B574n57j987Q09J940l415J417k906M499j288l66l10j52j201k959J284N93
$$ 2574 2017 30 839 2779 -636 781 -2125 2374 1086 720 410 258 -943 -3902 -2618 -2025
552843b025m62J364L0J43k247j21L01J348L75l854L216l633J937K557K40j16J94
$$ -2025 -2487 -1123 -1093 -950 -3197 -3318 -3017 -1669 -1294 -5148 -1932 -5565 -3628 -1071 -831 -947 -753
553361g53j124Q2r32L27J281j651K291k424j716L193J103P7O84J675k560j66k373
$$ -753 -1877 -1795 -2727 -2400 -1119 -2770 -479 -2903 -4619 -1426 -323 -246 438 2113 -447 -613 -2986
553880b986J558j272M61J562K583m625l9K105K753l581P31m4J877J196j170K730
$$ -2986 -1428 -2700 -2239 -677 1906 -2719 -2758 -653 2100 -1481 -750 -794 1083 2279 1109 3839
554368C839k833j213p02J7j613K457J015j442j332M275l946J270n25J099K506
$$ 3839 1006 -207 -909 -892 -2505 -48 967 -475 -1807 2468 -1478 -208 -733 366 2872
554826B872k891j266K985l71k489K938k957p15K01j969j52J774K375J24J112l307
$$ 2872 -19 -1285 1700 1329 -1160 1778 -1179 -1894 -1693 -3662 -3814 -2040 335 459 1571 -1736
555314a736p17p76L156j473j695L064J919q9j234r95p42K009M01j268j311l2L97
$$ -1736 -2453 -3229 -73 -1546 -3241 -177 1742 1653 419 -576 -1318 691 1092 -176 -1487 -1519 -1122
555833a122j801K107j440k806M216Q58n63j03j263J498O81l86l114M354p65p52
$$ -1122 -2923 -816 -2256 -5062 -846 12 -551 -654 -1917 -419 262 -124 -3238 1116 351 -401
556321d01J063q87K36J049J211p83O65O66N63k417M72n30k566J854j894j958K232
$$ -401 662 -225 11 1060 2271 1488 2153 2819 3382 965 1437 907 -1659 195 -1699 -3657 -1425
556840a425n2K885k559J091M44k792J560M124k509j942L470j183k999M81r65l54
$$ -1425 -1477 1408 -1151 -60 384 -2408 -848 3276 767 -1175 2295 1112 -1887 -1406 -2371 -2725
557329b725K708j528J917L56m10l59j435K09J048k375J557n23L242l528L92L241
$$ -2725 -17 -1545 372 728 318 -41 -1476 -1267 -219 -2594 -1037 -1560 1682 -1846 -1454 1787
557817A787l076M082m053j371J925K867o70k177J3p19O4j255j063N933k216k910
$$ 1787 -1289 2793 -1260 -2631 -706 2161 1491 -686 -673 -1392 -1328 -2583 -3646 2287 71 -2839
558305b839M687j208j104K063l68q32R48r54o76N07L1P5l241J789j808K779J096
$$ -2839 1848 640 -464 1599 1231 399 1347 393 -283 224 255 330 -2911 -1122 -2930 -151 945
558824I45l040q72J38L386j74K346n005q75j938J186M427l203J93k47k175J949
$$ 945 -2095 -2967 -2829 557 383 2729 -2276 -3151 -5089 -3903 524 -2679 -2486 -2733 -4908 -2959
559312b959P37j249L317j096K04l133K006L57m4m26K774j028L91j036J164j453
$$ -2959 -2222 -3471 -154 -1250 -1046 -4179 -2173 -1816 -1860 -2286 488 -540 -149 -1185 -21 -1474
559801a474k20j85J418K29N55k98r37L377k548k995J338L280k582J407o82j806
$$ -1474 -1694 -1879 -461 -232 323 25 -912 2465 -83 -3078 -1740 1540 -1042 365 -317 -2123
560289b123J510o45j503K251o59N78p5r79J28J026J540j328l64k0k12M7n52O45
$$ -2123 -613 -1258 -2761 -510 -1169 -591 -666 -1645 -1517 -491 1049 -279 -643 -663 -875 -828 -1380 -735
560838g35j660O07l09K2L31K113K7k000J761J715P19j079l283K932j404o15K198
$$ -735 -2395 -1788 -2097 -2075 -1744 369 396 -1604 157 1872 2591 1512 -1771 1161 -243 -858 1340
561357A340j582j941R02K283M77N35n61J366k779r31p83O07n42N46O20L61O29
$$ 1340 -242 -2183 -1281 1002 1479 2014 1453 2819 40 -891 -1674 -1067 -1609 -1063 -443 -82 547
561876E47J50k016J184r21j412k56K35M370K23N59l041J652j193k462o97j4L91
$$ 547 697 -1319 -135 -1056 -2468 -2724 -2489 1881 2104 2663 -378 1274 81 -2381 -3078 -3092 -2701
562395b701R7m13p61M250k021J440n18o51L759l029m27K648p31j814O02K825j100
$$ -2701 -2604 -3017 -3778 472 -1549 -109 -627 -1278 2481 -548 -975 1673 942 -872 -270 2555 1455
562914A455n037J373K404j172j866K71M086k273j13n8L11K161k784R32j367k019
$$ 1455 -3582 -2209 195 -977 -2843 -2572 1514 -759 -872 -930 -619 1542 -1242 -310 -1677 -3696
563402c696K543J048r45M73L25k175L844n727K768L21m26m5K532P33k970p44L659
$$ -3696 -1153 -105 -1050 -577 -252 -2427 1417 -4310 -1542 -1221 -1647 -1692 840 1573 -1397 -2141 1518
563921A518j196j452k95L115o31N05n56j95m07j085j243K227j685l64J052K150
$$ 1518 322 -1130 -1425 1690 1059 1564 1008 813 406 -679 -1922 305 -1380 -1744 -692 1458
564409A458M51r54J77J177j699o4R39q62k330L533k499j767N222m315P99J73q86
$$ 1458 1909 955 1132 2309 610 546 1485 623 -1707 1826 -673 -2440 2782 -1533 -734 -561 -1447
564928a447L096l537J200q92p47N62L009l538K070k241P02k408L140J323K091
$$ -1447 1649 -1888 -688 -1580 -2327 -1765 1244 -2294 -224 -2465 -1763 -4171 -1031 292 2383
565385B383l951J760j074k180R00J425J702m22j741J195O92r14r71r97J997j042
$$ 2383 -1568 192 -882 -3062 -2162 -737 965 543 -1198 -3 689 -225 -1196 -2193 -196 -1238
565874a238r6J113r40L475k117K780j275l508r0N87L8k247K620K74Q92k570J566
$$ -1238 -1334 -221 -1161 2314 197 2977 1702 -1806 -1896 -1309 -1271 -3518 -898 -624 268 -2302 -736
566392g36J385j452M35J02R84j112j438l27l9K617k045J228M71K92K139j885O08
$$ -736 649 -803 -368 -266 718 -394 -1832 -2159 -2198 419 -1626 -398 73 365 2504 619 1227
566912A227j686j168K300k349L564K99k328l021K180q83J895j187j88n22p93l84
$$ 1227 -459 -1627 673 -1676 1888 2187 -141 -3162 -982 -1865 30 -1157 -1345 -1867 -2660 -3044
567400c044j701K854N24J388L08J55J36P31o76j342J589L99k824j67o69Q2K382
$$ -3044 -4745 -1891 -1367 21 329 484 620 1351 675 -667 922 1321 -1503 -1670 -2339 -2257 125
567919A25r46Q42J87k210M90R1K297j916N67j49j389L285j313j606J703M72J199
$$ 125 -821 21 208 -2002 -1512 -1421 876 -1040 -473 -622 -2011 1274 -39 -1645 58 530 1729
568437A729j831J472j222P94j232j312K251R10p07M94k019q4k324L64J782K772
$$ 1729 -102 1370 148 942 -290 -1602 649 1559 852 1346 -673 -757 -3081 -2717 -935 1837
568926A837k288k80J163J420p86l106Q03J677m63J156m067m53K508o96n82O43
$$ 1837 -451 -731 432 1852 1066 -2040 -1237 440 -23 1133 -2934 -3387 -879 -1575 -2157 -1514
569414a514J082l452L027k83K452Q67l801J263N80r40Q96j387k197J606J70j907
$$ -1514 -432 -3884 -857 -1140 1312 2179 -1622 -359 221 -719 177 -1210 -3407 -1801 -1631 -3538
569902c538K497K96n35J376j160K515j250q87n18j374K467j610j764K852p05j102
$$ -3538 -1041 -745 -1280 96 -1064 1451 201 -686 -1204 -2578 -111 -1721 -3485 -633 -1338 -2440
570390b440K838k340n16L183k363J669M39j552R16m09K77q73N57j717J997K83
$$ -2440 398 -1942 -2458 725 -1638 31 470 -1082 -166 -575 -298 -1171 -614 -2331 -334 -51
570879e1l276J706n39K715k867J509K26M35j992q03j81K509J64o90k32P23p15
$$ -51 -3327 -1621 -2160 555 -2312 -803 -577 -142 -2134 -2937 -3118 -609 -445 -1135 -1367 -644 -1359
571397a359O47j107J590J287n81J703k324J6l21J382L94j470r43J441L54j303
$$ -1359 -712 -1819 -229 1058 477 2180 -144 -128 -449 933 1327 -143 -1086 355 709 -594
571886e94j892j002k87J095J977j199J187K428M69j924M79r35K448n641L432Q22
$$ -594 -2486 -3488 -3775 -2680 -703 -1902 -715 1713 2182 258 737 -198 2250 -3391 41 863
572374H63J496k118N21k060j012J860J313j453J329N67k209Jj570K589j018k43
$$ 863 2359 241 762 -1298 -2310 -450 863 -590 739 1306 -903 -902 -2472 117 -901 -1144
572863a144R66j584k247k33J724M167P56k08j555M88j272l63K167j768L86j291
$$ -1144 -178 -1762 -4009 -4242 -2518 1649 2405 2197 642 1130 -142 -505 1662 -106 280 -1011
573351a011r96J786O17j00o51L02j990P0J541J076J673k951j586K605R15j607
$$ -1011 -2007 -221 396 296 -355 -53 -2043 -1973 -432 644 2317 -634 -2220 385 1300 -307
573839c07j874J725l049j291M281O26j29l7K88l213J467K204n18J784j200j200
$$ -307 -2181 -456 -3505 -4796 -515 111 -18 -55 233 -2980 -1513 691 173 1957 757 -443
574327d43n49o66L77j72k353K584J480M51J087j646J272j276q18j20q68j876K132
$$ -443 -992 -1658 -1281 -1453 -3806 -1222 258 709 1796 150 1422 146 -672 -792 -1660 -3536 -1404
574846a404J682k78j576K416r49K44j061k344R33K483k203n1l43M45L582k232
$$ -1404 278 0 -1576 840 -109 135 -926 -3270 -2337 146 -2057 -2108 -2451 -2006 1576 -656
575334f56J377j379J777j149J399j683Q0r10J404O69j42j028o97m257J055L636
$$ -656 721 -658 1119 -30 1369 -314 -234 -1144 260 929 787 -241 -938 -5195 -4140 -504
575823e04K511j581j065N7j851J644J668k647j402K519K119j42j280k507K226
$$ -504 2007 426 -639 -582 -2433 -789 879 -1768 -3170 -651 1468 1326 46 -2461 -235
576280b35o76j658J213k982M786j245K210J17k972K395M23p23k872n47L022j253
$$ -235 -911 -2569 -1356 -4338 448 -797 1413 1530 -1442 953 1376 653 -2219 -2766 256 -997
576769i97K536N26j878J278m368J645J02j142J25j410L841J597l357l36p89j956
$$ -997 1539 2065 187 1465 -2903 -1258 -1156 -2298 -2173 -3583 258 1855 -1502 -1838 -2627 -4583
577257d583J583J918o69O10o11l12K290J99m05o6J832J152l506M64K201p10k440
$$ -4583 -3000 -1082 -1751 -1141 -1752 -2064 226 425 20 -46 1786 2938 -568 -104 2097 1387 -1053
577776a053r09J195m59m02p83K204j629J587J371k951L30Q30o02p90O01J086L32
$$ -1053 -1962 -767 -1226 -1628 -2411 -207 -1836 -249 1122 -1829 -1499 -669 -1271 -2061 -1460 -374 -42
578295d2j75j552J335j773J046Q95N95k146K22K52J099j571P90n47l209L285L62
$$ -42 -217 -1769 -434 -2207 -1161 -266 329 -1817 -1595 -1343 -244 -1815 -1025 -1572 -4781 -1496 -1134
578814a134o31J006J532j377l189K094L531k139j481M63j128P92J340n19j945
$$ -1134 -1765 -759 773 -604 -3793 -1699 1832 -307 -1788 -1325 -2453 -1661 -321 -840 -2785
579271b785L86J620r59o50P22J699j771L08M9k363L849j406j268K073j691o81
$$ -2785 -2399 -779 -1738 -2388 -1666 33 -1738 -1430 -1381 -3744 105 -1301 -2569 -496 -2187 -2868
579760b868O64K400N51p46l108L739J202j342Q56k845p87J622L626k953n048K331
$$ -2868 -2204 196 747 1 -3107 632 1834 492 1348 -1497 -2284 -662 2964 11 -5037 -2706
580248b706o4n86J808j151J717k21j261J25J413J68q56K688L72m129K395p46J359
$$ -2706 -2770 -3356 -1548 -2699 -982 -1203 -2464 -2339 -926 -758 -1614 1074 1446 -2683 -288 -1034 325
580767C25k771J832P21k614M016k364j586K104j763J056p6q04K019o88R87P63
$$ 325 -2446 -614 107 -2507 1509 -855 -2441 -337 -2100 -1044 -1120 -1924 95 -593 394 1157
581255A157m58P38R10l875J287K08K432j936j081O31m9j736J348o98R6k364L624
$$ 1157 699 1437 2347 -1528 -241 -33 2399 463 -618 13 -36 -1772 -424 -1122 -1026 -3390 234
581774B34J764m83k424j005J151J204l089J993J66m76N14j706q36K919M67k764
$$ 234 1998 1515 -909 -1914 -763 441 -2648 -655 -489 -965 -451 -2157 -2993 -74 393 -2371
582262b371J64K275j861M27m89J13L70n11J316J047r06j557J040P66j094P47j51
$$ -2371 -2207 68 -1793 -1366 -1855 -1742 -1372 -1883 -567 480 -426 -1983 -943 -177 -1271 -524 -675
582781f75k551M328k162O07R86K98n7m85n08j643J75k730L105M86M01J96j078
$$ -675 -3226 1102 -1060 -453 533 831 774 289 -219 -1862 -1687 -4417 -1312 -826 -425 -229 -1307
583300a307L25k54P50N70k186K889j542k44O68k148K304L57M50p96k26K009j513
$$ -1307 -982 -1236 -486 84 -2102 787 -755 -999 -331 -2479 -175 182 632 -164 -390 1619 106
583819A06J579k95Q22m272j25m55K175l20R86k623K844j550k844J787r93K431
$$ 106 1685 1390 2212 -2060 -2185 -2640 -465 -785 201 -2422 422 -1128 -3972 -2185 -3178 -747
584307g47n49K574j779p12O21k181o83K600q7Q63M36k03n98j388J052j124M59
$$ -747 -1296 1278 -501 -1213 -592 -2773 -3456 -856 -943 -80 356 153 -445 -1833 -781 -1905 -1446
584826a446j452m4J103r09o63L059J477k88j913j402J444m57M87k434L122j91
$$ -1446 -2898 -2942 -1839 -2748 -3411 -352 1125 837 -1076 -2478 -1034 -1491 -1004 -3438 -316 -507
585314e07j175N66K196p42m039M088Q09l427L47L16j055k14K647K017j963l064
$$ -507 -1682 -1116 1080 338 -3701 387 1196 -2231 -1884 -1568 -2623 -2837 -190 1827 -136 -3200
585803c200R46L64J027J78J487P53q80R44j88m447L566j230J005k213m717N526
$$ -3200 -2254 -1890 -863 -685 802 1555 675 1619 1431 -3016 550 -680 325 -1888 -6605 -1079
586291a079n07K94N22M28k046K851j894J91J189K091l859L960j387o77j54K82
$$ -1079 -1586 -1292 -770 -342 -2388 463 -1431 -1240 -51 2040 -1819 2141 754 77 -77 205
586779B05k87r96j435p98J313K506r29k04k57L26l13p16J696l071K82j97K388
$$ 205 -82 -1078 -2513 -3311 -1998 508 -421 -625 -882 -556 -869 -1585 111 -2960 -2678 -2875 -487
587298d87R00k884j75k7J871J720l167J325Q93q72R76o15K032q59j543m77r9q4
$$ -487 413 -2471 -2646 -2673 -802 918 -2249 -924 -31 -903 73 -542 1490 631 -912 -1389 -1488 -1572
587847a572q46J901p74J182K87j545K471j217q61K683j485J170l716n02K92R83
$$ -1572 -2418 -517 -1291 -109 178 -1367 1104 -113 -974 1709 224 1394 -2322 -2824 -2532 -1549
588335a549J284O28J17N17N10n06j458l156J667K761L54k522J725n84K000j908
$$ -1549 -265 363 480 997 1507 1001 -457 -3613 -1946 815 1169 -1353 372 -212 1788 -120
588824a20j773l16L580l033J4J203P6J025P88n62j784K179q50j704r74K207K226
$$ -120 -1893 -2209 1371 -1662 -1648 -445 -369 656 1444 882 -902 1277 427 -1277 -2251 -44 2182
589342B182p3l785k04L809Mj852j81j34k824P6j200J828m4Q91K17K633m93k717
$$ 2182 2109 -1676 -1880 1929 1933 81 -100 -234 -3058 -2982 -4182 -2354 -2398 -1507 -1290 1343 850 -1867
589892a867k019M042p7m156J293L950k297M76j810J781j082J588j98k38K790j774
$$ -1867 -3886 156 79 -4077 -2784 1166 -1131 -655 -2465 -684 -1766 -178 -376 -614 2176 402
590380D02k275J205o92J223n5K019o66n14j05l738L518J740N58l605M39j002o1
$$ 402 -1873 -668 -1360 -137 -192 1827 1161 647 542 -3196 322 2062 2620 -985 -546 -1548 -1609
590899a609l14p59J652J460j666O87P72O46N8j555j016k21K029j138J755L98R59
$$ -1609 -1923 -2682 -1030 430 -1236 -549 223 869 927 -628 -1644 -1865 164 -974 781 1179 2138
591418B138l676p35P84K460j128q68J595p69J823q76n03k27N47R19l055K644k510
$$ 2138 -1538 -2273 -1489 971 -157 -1025 570 -199 1624 748 245 18 565 1484 -1571 1073 -1437
591937a437J403k36l55K594k203K30j464K144j505m77K41J6O6r08K198j629mJ541
$$ -1437 -34 -270 -625 1969 -234 -4 -1468 676 -829 -1306 -1065 -1049 -983 -1891 307 -1322 -1326 215
592486B15L11j825P24J157m006L83J83J553J744j685R32l258l210P345l135O67
$$ 215 526 -1299 -575 582 -3424 -3041 -2858 -1305 439 -1246 -314 -3572 -6782 563 -2572 -1905
592974a905N67L425j251k281J231l902J289L176j377K043j111Q09l275J068J285
$$ -1905 -1338 2087 836 -1445 -214 -4116 -2827 349 -1028 1015 -96 713 -2562 -1494 -209
593432b09N5M93n7k153J006K182l91j085k270m04K750N4Q67k003K29j519M302
$$ -209 -154 339 282 -1871 -865 1317 926 -159 -2429 -2833 -83 -29 838 -1165 -936 -2455 1847
593951A847j196j065K61J450J328o575J038L426j24R32m546M086K817k647J33
$$ 1847 651 -414 -153 1297 2625 -3950 -2912 514 390 1322 -3224 862 3679 1032 1165
594409A165l15K150n189J062L08Q06j358L713R43k343m46j179j44J850p51l264
$$ 1165 850 3000 -2189 -1127 -819 -13 -1371 2342 3285 942 496 -683 -827 1023 272 -2992
594897b992L62K283K77M21R91j15k762R62J189O21k980q87J834J65J215j519o47
$$ -2992 -2630 -347 -70 351 1342 1227 -1535 -573 616 1237 -1743 -2630 -796 -631 584 -935 -1582
595416a582k104K10J206j091J626j259K410j77k511L895j62j532O55k45L952j874
$$ -1582 -3686 -3476 -2270 -3361 -1735 -2994 -584 -761 -3272 623 461 -1071 -416 -661 3291 1417
595904A417k369N19K22k16j198L061K3k952Q53j554j224K471M45m116L733q5k038
$$ 1417 -952 -433 -211 -427 -1625 1436 1459 -1493 -640 -2194 -3418 -947 -502 -4618 -885 -970 -3008
596423c008J019L68j816K551p71J617M42k00j656L211o76j7K26j014m29q31j2
$$ -3008 -1989 -1621 -3437 -886 -1657 -40 402 202 -1454 1757 1081 1064 1290 276 -153 -984 -996
596942i96K264j150Q91j152k054L625k955K018j215l386L000L145J179K34n402
$$ -996 1268 118 1009 -143 -2197 1428 -1527 491 -724 -4110 -1110 2035 3214 3448 -1954
597399a954j782K274q8P1N08k37j160j006Q57R44p19J504J796J403j298k93k45
$$ -1954 -3736 -1462 -1550 -1479 -971 -1208 -2368 -3374 -2517 -1573 -2292 -788 1008 2411 1113 820 575
597918E75j290J638j020k666Q41K64K992k97J389j903J366l126K91K92q22P2K297
$$ 575 -715 923 -97 -2763 -1922 -1658 1334 1037 2426 523 1889 -1237 -946 -654 -1476 -1404 893
598437H93k441K979j106J603k687j68K252L27j911j078n86O43L2R99o6O39Q03
$$ 893 -1548 1431 325 1928 -759 -927 1325 1652 -259 -1337 -1923 -1280 -1248 -249 -315 324 1127
598956A127j774k401K160J24K41l57K382k126j105J849j918R25j766K530k856
$$ 1127 -647 -3048 -888 -764 -523 -880 1502 -624 -1729 120 -1798 -873 -2639 -109 -2965
599414b965L599j220K570J366k418n79j252J995R57j849J88j872k116K286J793
$$ -2965 634 -586 1984 3350 932 353 -899 1096 2053 204 392 -1480 -3596 -1310 483
599872D83k005J590k47J961m043J190j091k620O53J511R14K849l071K79m27J197
$$ 483 -1522 68 -179 1782 -2261 -1071 -2162 -4782 -4129 -2618 -1704 1145 -1926 -1647 -2074 -877
600360h77J623n52o95l354J596J432Mq42J252p20M32L88l814J778J774q33n80
$$ -877 746 194 -501 -3855 -2259 -827 -823 -1665 -413 -1133 -701 -313 -4127 -2349 -575 -1408 -1988
600879a988l145J387J356j26L237L74N7o04j473K22j098K160K330k945k965J752
$$ -1988 -5133 -3746 -2390 -2516 721 1095 1152 548 -925 -703 -1801 359 2689 -256 -3221 -1469
601367a469J326M9Q27j577j754J988k07P69J564k325J061j027j110o1J280JK71
$$ -1469 -143 -94 733 -844 -2598 -610 -817 -48 1516 -809 252 -775 -1885 -1946 -666 -665 -394
601886c94j296K670j892j156J915r43K167n91j241n57J334K659m016o75J365m81
$$ -394 -1690 980 -912 -2068 -153 -1096 1071 480 -761 -1318 16 2675 -1341 -2016 -651 -1132
602374a132J330n4R79K7J123k088o40j525l95M347l552J638l012K178L229k04
$$ -1132 198 144 1123 1150 2273 185 -455 -1980 -2375 1972 -1580 58 -2954 -776 2453 2249
602862B249l562L53q34l56R93N45J67N01j219L43J207K131j925J768m431K015
$$ 2249 -1313 -960 -1794 -2150 -1157 -612 -445 56 -1163 -820 387 2518 593 2361 -2070 -55
603350e5J853J4p13K068k064l095l32J281K317j380j958L835r00k8P63r42j330
$$ -55 1798 1812 1099 3167 1103 -1992 -2324 -1043 1274 -106 -2064 1771 871 843 1606 664 -666
603869f66k138N606k259k42j157P48O81j539K988Q82j867k036P45J151K325j269
$$ -666 -2804 2802 543 301 -856 -108 573 -966 2022 2904 1037 -999 -254 897 3222 1953
604358A953r10j85Q24o67j889L61P78k9L65j061n01J530K73j113Q61J555k599
$$ 1953 1043 858 1682 1015 -874 -513 265 236 601 -460 -961 569 842 -271 590 2145 -454
604877d54K686j460R2n79j370L482m416J195q9l60K32O4J432J6j574J909J892
$$ -454 2232 772 864 285 -1085 2397 -2019 -824 -913 -1273 -1041 -977 455 471 -1103 806 2698
605395B698k047J351j996j858L83L82L279j495l575J59O84j189J084J424k772
$$ 2698 651 2002 6 -1852 -1469 -1087 2192 697 -2878 -2719 -2035 -3224 -2140 -716 -3488
605853c488K065K42o55j93J541n08j493M34o44J62J599M203l339K443l576J498
$$ -3488 -1423 -1181 -1836 -2029 -488 -996 -2489 -2055 -2699 -2537 -938 3265 -74 2369 -1207 291
606341B91R19p50j360N72j302P87J609n42j108k273Q39K656j490P60J663K18j24
$$ 291 1210 460 -900 -328 -1630 -843 766 224 -884 -3157 -2318 338 -1152 -392 1271 1489 1365
606860A365q05J537k072j480j217J037K20J658R18J571j681j654J118m949N123
$$ 1365 560 2097 25 -1455 -2672 -1635 -1415 243 1161 2732 1051 -603 515 -4434 689
607318F89J772K26o86j419K134j4m692M7N86K331m14R16k545L02L430o39j002
$$ 689 2461 2687 2001 582 2716 2702 -1990 -1943 -1357 974 560 1476 -1069 -767 2663 2024 1022
607837A022l97k601r50M76Q92j6J286R0j337l97j53J677J163R88K33j069P01l134
$$ 1022 625 -1976 -2926 -2450 -1558 -1574 -288 -198 -1535 -1932 -2085 -408 755 1743 1976 907 1608 -1526
608386a526J716o64m33l843J621J168J545M91j261j145N21j647K284k410K441
$$ -1526 190 -474 -907 -4750 -3129 -1961 -416 75 -1186 -2331 -1810 -3457 -1173 -3583 -1142
608844a142n44k357J769K685k200L83J360l43O87j75O06R63k328j64J242j384
$$ -1142 -1686 -4043 -2274 411 -1789 -1406 -46 -389 298 123 729 1692 -636 -800 442 -942
609332i42J653l656K5J550j155J83j590J869K017J08K50K25O95q96m36j460L59
$$ -942 711 -2945 -2920 -1370 -2525 -2342 -3932 -2063 -46 62 312 537 1232 336 -100 -1560 -1201
609851a201L359p59k760P10R53k154r81K952l30N24O83K275j919n65k84Q54k08
$$ -1201 2158 1399 -1361 -651 302 -1852 -2833 119 -211 313 996 3271 1352 787 503 1357 1149
610370A149j709K99k004Q68j473J743P61j914J819J368q43j121n87J170J177K038
$$ 1149 -560 -261 -2265 -1397 -2870 -1127 -366 -2280 -461 907 64 -1057 -1644 -474 703 2741
610858B741j437k06m077L816J093n610M91J017l07j969J640NJ621K571J316k648
$$ 2741 1304 1098 -2979 837 1930 -3680 -3189 -2172 -2479 -4448 -2808 -2803 -1182 1389 2705 57
611346E7M148j736k485L7k050J050K944k27k322K192R15l087l67M13j252L313
$$ 57 4205 2469 -16 21 -2029 -979 1965 1738 -584 1608 2523 -564 -931 -518 -1770 1543
611835A543j604k62K889j421O64L59k615K735j456R14j021l185L299j984j979
$$ 1543 -61 -323 2566 1145 1809 2168 -447 2288 832 1746 725 -2460 839 -1145 -3124
612292c124K472K337m56l499M495j083O1K17j33k617J68k14r26L240N67r9o84
$$ -3124 -652 1685 1229 -2270 2225 1142 1203 1420 1287 -1330 -1162 -1376 -2302 938 1505 1406 722
612811G22m59k8j208J933j094l158J157M41J907J702l160j054J116j008Q82l080
$$ 722 263 235 -973 960 -134 -3292 -2135 -1694 213 1915 -1245 -2299 -1183 -2191 -1309 -4389
613299d389K875j838J228J370O07k493L611J020M37k339j991R55j264Q45p96J537
$$ -4389 -1514 -3352 -2124 -754 -147 -2640 971 1991 2428 89 -1902 -947 -2211 -1366 -2162 -625
613788f25L050k744k188P89n47J429p18j076N439n549O52L595l184J774L69j546
$$ -625 2425 -319 -2507 -1718 -2265 -836 -1554 -2630 2809 -2740 -2088 1507 -1677 97 466 -1080
614276a080O12k022K326l679M70N33K953j974J550J356j117j214K93J051j522
$$ -1080 -468 -2490 -164 -3843 -3373 -2840 113 -1861 -311 1045 -72 -1286 -993 58 -1464
614734a464K160l363J302M97j903K108L846k513J735o89j788J259O43M92k114
$$ -1464 696 -2667 -1365 -868 -2771 -663 3183 670 2405 1716 -72 1187 1830 2322 208
615192B08J880j194R41J067L05k298P39q74L16j93j743J423Q52J918j976J946
$$ 208 2088 894 1835 2902 3207 909 1648 774 1090 897 -846 577 1429 3347 1371 3317
615680C317p44J230k981k154L159j780j172j7j852L319l580K431p30j118K078
$$ 3317 2573 3803 822 -1332 1827 47 -1125 -1142 -2994 325 -3255 -824 -1554 -2672 -594
616138e94n43R04k68K393n84M22m742q05M946M94l631P03R05J220k16K59j697
$$ -594 -1137 -233 -501 1892 1308 1730 -3012 -3817 1129 1623 -2008 -1305 -400 820 604 863 -834
616657h34L20j357j274K73k456O546Q33p40k101J222J442o92O84k212J270m2j371
$$ -834 -514 -1871 -3145 -2872 -5328 1218 2051 1311 -790 432 1874 1182 1866 -346 924 882 -489
617175d89k26P36J103j814K813q17j271J335j098K23m95j205R93l315K563j723
$$ -489 -715 21 1124 -690 2123 1306 35 1370 272 495 0 -1205 -212 -3527 -964 -2687
617664b687K80L465J066r99m73J46q51K17j164j353o61M695M40K645k416k558
$$ -2687 -2407 1058 2124 1125 652 798 -53 164 -1000 -2353 -3014 1681 2121 4766 2350 -208
618152b08P54j523P10K235l210O49J570Q34l753r23n40J429J006N74K58K653k770
$$ -208 546 -977 -267 1968 -1242 -593 977 1811 -1942 -2865 -3405 -1976 -970 -396 -138 2515 -255
618671b55L51j804K828k730J1L42k41J024j754L192N42k253j915J890K596l127
$$ -255 96 -1708 1120 -1610 -1599 -1257 -1498 -474 -2228 964 1506 -747 -2662 -772 1824 -1303
619159a303M31M834o337M510k451R10j79J34J676j675r88j235K23K707K03m53
$$ -1303 -872 3962 -2375 2135 -316 594 415 549 2225 550 -438 -1673 -1450 1257 1460 1007
619648A007p66j309k500K841N85j997R28M7k760J908m31n37L628p16o89J470Q41
$$ 1007 241 -1068 -3568 -727 -142 -2139 -1211 -1164 -3924 -2016 -2447 -2984 644 -72 -761 709 1550
620166A550j531k550K880q73M39j62m46J456P76k474j094k71L494j526m85M172
$$ 1550 19 -2531 349 -524 -85 -247 -693 763 1539 -935 -2029 -2300 1194 -332 -817 3355
620655C355k644j889j20j294K045P71j302J045j209l95q84L618k059j138Q77P95
$$ 3355 711 -1178 -1298 -2592 -547 224 -1078 -33 -1242 -1637 -2521 1097 -962 -2100 -1223 -428
621143d28P86Q14J252j570k17r10J802q36j135J35k377J56Q9K497M51o71l695
$$ -428 358 1172 2424 854 637 -273 1529 693 -442 -307 -2684 -2528 -2439 58 509 -162 -3857
621662c857J029Q01j49o02J157L45J625j900K527p16p57M99o01k287J901J858
$$ -3857 -2828 -2027 -2176 -2778 -1621 -1276 349 -1551 976 260 -497 2 -599 -2886 -985 873
622150H73O52j604k20j370N44J894j313r35J519N95J225q27N4j430n37K354k056
$$ 873 1525 -79 -299 -1669 -1125 769 -544 -1479 40 635 1860 1033 1087 -343 -880 1474 -582
622669e82r95n89K689L48k30n047K937K709r73k33j175k09o34O59J586J231l463
$$ -582 -1577 -2166 523 871 641 -4406 -1469 1240 267 34 -1141 -1350 -1984 -1325 261 1492 -1971
623188a971K690J066j587n7J45k609j5K795N0l64R59j593j761M38J454P55q54
$$ -1971 719 1785 198 141 286 -2323 -2338 457 507 143 1102 -491 -2252 -1814 -360 395 -459
623707d59N04m49O83J126k205P63J633k250m55o89J047j427j161N508l082K79
$$ -459 45 -404 279 1405 -800 -37 1596 -654 -1109 -1798 -751 -2178 -3339 2169 -913 -634
624195f34J293J726k799J249K38j80N67J666k683K957l441k030J730J485q65k359
$$ -634 659 2385 -414 835 1073 893 1460 3126 443 3400 -41 -2071 -341 1144 279 -2080
624683b080J609k102J846k9J180j640j031O98Q07p44K882q76O55l454j318J579
$$ -2080 -471 -2573 -727 -756 424 -1216 -2247 -1549 -742 -1486 1396 520 1175 -2279 -3597 -2018
625171b018l49K566P0n25J677r8j724j241J404P79r95q03J226j297J591J697j944
$$ -2018 -2367 199 269 -256 1421 1323 -401 -1642 -238 541 -454 -1257 -31 -1328 263 1960 16
625690A6k199M334m004P86J043K160r49K024k474O87j782R5J508p94k884r71L224
$$ 16 -2183 2151 -1853 -1067 -24 2136 1187 3211 737 1424 -358 -263 1245 451 -2433 -3404 -180
626209a80L298j638k432L990j884k320j413K548R38l20j89R92k448l14L79p68
$$ -180 3118 1480 -952 3038 1154 -1166 -2579 -31 907 587 398 1390 -1058 -1372 -993 -1761
626697a761L649q37K48j058J218j373l032L799l732P23K943K16k000o88K002J632
$$ -1761 1888 1051 1299 241 1459 86 -2946 853 -2879 -2156 787 1003 -997 -1685 317 1949
627185A949k890Q58p54n13M7P92J588k7q56J281k522K96J68j141R60J243M67j915
$$ 1949 -941 -83 -837 -1350 -1303 -511 1077 1050 194 1475 -1047 -751 -583 -1724 -764 479 946 -969
627735i69j40j398K526O74q74j342L14k668k78Q03J271J628J182j172O99l30K059
$$ -969 -1109 -2507 19 693 -181 -1523 -1209 -3877 -4155 -3352 -2081 -453 729 -443 256 -74 1985
628254A985l132R79n62L85j915J56J689J246k727J746q39M48j48J854l812L993
$$ 1985 -1147 -168 -730 -345 -2260 -2104 -415 831 -1896 -150 -989 -541 -689 1165 -2647 1346
628742A346k008J36K23J563k210J463L078k844mO41j692J180Q29j248l738L205
$$ 1346 -662 -526 -303 1260 -950 513 3591 747 743 1384 -308 872 1701 453 -3285 -80
629230h0K76q48J758j680P48R56k757o24L834k278q49J408j521o88Q38J865M41
$$ -80 196 -652 1106 -574 174 1130 -1627 -2251 1583 -695 -1544 -136 -1657 -2345 -1507 358 799
629749G99j303P98k016k28m96K895J290J195k238j7k941K789o44L7j21k187J275
$$ 799 -504 294 -1722 -1950 -2446 449 1739 2934 696 679 -2262 527 -117 -80 -201 -2388 -1113
630268a113J151M015k204k907K345j580j465J877J445r20o59j205k153J404J589
$$ -1113 38 4053 1849 -1058 1287 -293 -1758 119 1564 644 -15 -1220 -3373 -1969 -380
630726c80k538J031K980l857K902m305N158j257L483j281q29O36K34j444J517
$$ -380 -2918 -1887 1093 -2764 138 -4167 991 -266 3217 1936 1107 1743 1977 533 2050
631183B050k537l44o41K449k442J090l39N78N1r1l09J066r01N64j033j456K894
$$ 2050 -487 -831 -1472 977 -1465 -375 -714 -136 -85 -176 -485 581 -320 244 -789 -2245 649
631702F49P53Q4l824J733K424l887K090P0L1J77k847K279K346j519j917J314K767
$$ 649 1402 1486 -2338 -605 1819 -2068 22 92 123 300 -2547 -268 2078 559 -1358 -44 2723
632221B723j026J504L39m210o46m70N20j719M039j130k845J883Q12L18j58j24
$$ 2723 1697 3201 3540 -670 -1316 -1786 -1266 -2985 1054 -76 -2921 -1038 -226 92 -66 -190
632710a90k80J136K099k638R50j106r51k07K140k8k769K782J046m713p19O68q32
$$ -190 -470 666 2765 127 1077 -29 -980 -1187 953 925 -1844 938 1984 -2729 -3448 -2780 -3612
633228c612J698K704l39j99R34k02l27J139j147m2L2j907k59n61N84n85J882k
$$ -3612 -1914 790 451 252 1186 984 657 1796 649 607 639 -1268 -1527 -2088 -1504 -2089 -207 -209
633778b09j801o06J342k73M88j390J262P44K968j432J856q07l588K655k474M28
$$ -209 -2010 -2616 -1274 -1547 -1059 -2449 -1187 -443 2525 1093 2949 2142 -1446 1209 -1265 -837
634266h37J211j663O54N14q51k57r82Q70l088O484k901k0n24J736N60Q76j070
$$ -837 374 -1289 -635 -121 -972 -1229 -2211 -1341 -4429 2055 -846 -866 -1390 346 906 1782 712
634785G12o00O21j201K221k821m87j10q51L14L90J071p40Q21m33j171J985P75
$$ 712 112 733 -468 1753 -1068 -1555 -1665 -2516 -2202 -1812 -741 -1481 -660 -1093 -2264 -279 496
635303D96L09J250K19q84j518k198K880j215M62j634J185l101L165k854O83K669
$$ 496 805 2055 2274 1390 -128 -2326 554 -661 -199 -1833 -648 -3749 -584 -3438 -2755 -86
635792h6j178K695k42J512k868j339p43P89K064j371j44J225O64k364J941j701
$$ -86 -1264 1431 1189 2701 -167 -1506 -2249 -1460 604 -767 -911 314 978 -1386 555 -1146
636280a146l43Q47n5K65k151J634K354k046o58j489j85J752K070j662n03l56q05
$$ -1146 -1489 -642 -697 -432 -2583 -949 1405 -641 -1299 -2788 -2973 -1221 849 -813 -1316 -1672 -2477
636799b477L338R45j509m99K720m478r0P20j661K921J383l097q17K767j668J824
$$ -2477 861 1806 297 -202 2518 -1960 -2050 -1330 -2991 -70 1313 -1784 -2601 166 -1502 322
637287C22o91j480J254j077J656k6M70r53J477J375j677k3m21k91J658j029J130
$$ 322 -369 -1849 -595 -1672 -16 -42 428 -525 952 2327 650 627 206 -85 1573 544 1674
637806A674J107j45l249R17R29q81m13j238j881j863N237k68L52M77k676J629
$$ 1674 2781 2636 -613 304 1233 352 -61 -1299 -3180 -5043 194 -74 278 755 -1921 -292
638294b92p0j74J486k238J199n92L14j339j625J619j870J241K469j546o90K10
$$ -292 -362 -536 950 -1288 -89 -681 -367 -1706 -3331 -1712 -3582 -2341 128 -1418 -2108 -1898
638783a898J22L521j490j411O20R48k10o52J31m1o78j008L856j806l99j627K210
$$ -1898 -1776 1745 255 -1156 -536 412 202 -450 -319 -360 -1038 -2046 1810 4 -395 -2022 188
639301A88k088L927l099o61l37r64lN12O34J64j364L301J275r36j334J65J742
$$ 188 -1900 2027 -1072 -1733 -2070 -3034 -3037 -2525 -1891 -1727 -3091 210 1485 549 -785 -620 1122
639820A122p54k97j443L042q16m69k761k034O80J738N36Q29K440J070j093n111
$$ 1122 368 71 -1372 1670 854 385 -2376 -4410 -3730 -1992 -1456 -627 1813 2883 1790 -3321
640308c321J691L630m365K288J71N24j827P47p23J454J138j834P56n68j29l69
$$ -3321 -1630 2000 -2365 -77 94 618 -1209 -462 -1185 269 1407 -427 329 -239 -368 -737
640797g37L27J296k397K115k169j021K351K225j401j172m31J074p78J76k16L85
$$ -737 -410 886 -1511 604 -1565 -2586 -235 1990 589 -583 -1014 60 -718 -542 -758 -373
641285c73p6j605r22R41L97n64J491O79M59R96k315p86J793k392J573l49k92M359
$$ -373 -449 -2054 -2976 -2035 -1638 -2202 -711 -32 427 1423 -892 -1678 115 -2277 -704 -1053 -1345 3014
641834C014J89j833k249r63J057K826L66j303j634k983J545Q38L927l178K10J718
$$ 3014 3203 1370 -879 -1842 -785 2041 2407 1104 -530 -3513 -1968 -1130 2797 -381 -171 1547
642323A547j630L89J8j579K555O58k430o50k13N80k47j323J060N55q95o35L15
$$ 1547 -83 306 324 -1255 1300 1958 -472 -1122 -1335 -755 -1002 -2325 -1265 -710 -1605 -2240 -1925
642842a925l262M178K986K03l441l73K08J046J929j824P37K57j009N12l18J82
$$ -1925 -5187 -1009 1977 2180 -1261 -1634 -1426 -380 1549 -275 462 719 -290 222 -96 86
643330H6k007K223o43J296L6k485J616O58p6j712O6j845L897k528K052k950P6
$$ 86 -1921 302 -341 955 991 -1494 122 780 704 -1008 -942 -2787 1110 -1418 634 -2316 -2240
643849b240L9M90K395m43j479K26R29M141m441O05J30j750K572k748J115m8k8
$$ -2240 -2201 -1711 684 241 -1238 -1012 -83 4058 -383 222 352 -1398 1174 -1574 -459 -507 -535
644367e35j553L196l30k906j75K967O97K027k043j934J081k375L236l033M083
$$ -535 -2088 1108 778 -2128 -2303 664 1361 3388 1345 -589 492 -1883 1353 -1680 2403
644825B403j050n39j261M33q33J765J438n62j355l82J003M80K159k913j522K448
$$ 2403 1353 814 -447 -14 -847 918 2356 1794 439 57 1060 1540 3699 786 -736 1712
645313A712j502o67J788m428J242r2RJ351K856q61l267J859P19o4l199M147j193
$$ 1712 210 -457 1331 -3097 -1855 -1947 -1938 -587 2269 1408 -1859 0 719 655 -2544 1603 410
645832D10m85o1k712J689K510j438k692j618L102j90P81p41l9p25k56J872L184
$$ 410 -75 -136 -2848 -1159 1351 -87 -2779 -4397 -1295 -1485 -704 -1445 -1484 -2209 -2465 -593 2591
646351B591M02J30l309j39J56J425j62j966j500J813L887k599j416J085j771L29
$$ 2591 2993 3123 -186 -325 -169 1256 1094 -872 -2372 -559 3328 729 -687 398 -1373 -1044
646840a044k40O25L24k27l83K569k169R41m00j008l52j043j221K903j914P59k953
$$ -1044 -1284 -659 -335 -562 -945 1624 -545 396 -4 -1012 -1364 -2407 -3628 -725 -2639 -1880 -4833
647358d833L643L14P7N120j767j578l23l346k83m23J412K208J01L44l452K596
$$ -4833 -1190 -876 -799 4321 2554 976 653 -2693 -2976 -3399 -1987 221 322 666 -2786 -190
647847a90M238m96j467j060k649K782L188n028p9j835K888o61m26J777o95j453
$$ -190 4048 3552 2085 1025 -1624 1158 4346 -682 -761 -2596 292 -369 -795 982 287 -1166
648335a166K837M13l303J770j066p16L01R89O38l27J132q60q20J358j013k020
$$ -1166 1671 2084 -1219 551 -515 -1231 -930 59 697 370 1502 642 -178 1180 167 -1853
648823a853M47P35l805K376J152J932Q37J589l645K273j392l800j390K595J952
$$ -1853 -1406 -671 -4476 -2100 -948 984 1821 3410 -235 2038 646 -3154 -4544 -1949 3
649281CK199l70l141J334Q0R28K80J689l479R60j315N69j624M81m19L64K94m42
$$ 3 2202 1832 -1309 25 105 1033 1313 3002 -477 483 -832 -263 -1887 -1406 -1825 -1461 -1167 -1609
649830a609q39M154J05j384J136j308j428J435O65k628M05L40j320J929L265q59
$$ -1609 -2448 1706 1811 427 1563 255 -1173 262 927 -1701 -1296 -956 -2276 -347 2918 2059
650318B059K1l75j120n50N0j656K385k85M71L66l24NK9p06j67p87n89J991j373
$$ 2059 2080 1705 585 35 85 -1571 814 529 1000 1366 1042 1047 1076 370 203 -584 -1173 818 -555
650898e55j83Q89j645p6J784j407N38l493M65O13J949l635N433j268L69k253J014
$$ -555 -738 151 -1494 -1570 214 -1193 -655 -4148 -3683 -3070 -1121 -4756 677 -591 -222 -2475 -1461
651417a461L531M20o733J963M457J561l918J03J712j048L44j62K34k530K180j597
$$ -1461 2070 2490 -4243 -2280 2177 3738 -180 -77 1635 587 931 769 1003 -1527 653 -944
651906i44K12k76O26p1J446k023l50J53J146J678L05j938K800j635r34J873j904
$$ -944 -732 -1008 -382 -453 993 -1030 -1380 -1227 -81 1597 1902 -36 2764 1129 195 2068 164
652424A64K50j764K044n82r9J101k799j002K403M90p00J958j267N66j276L359
$$ 164 414 -1350 694 112 13 1114 -1685 -2687 -284 206 -494 1464 197 763 -513 2846
652913B846j28j143j965M38L1M52o12j022K391J490l1k117j030m78j2k65j501
$$ 2846 2718 1575 -390 48 79 531 -81 -1103 1288 2778 2747 630 -400 -878 -890 -1155 -2656
653431b656L830k491j614j55n25M45L17O07K489j187j219K276J64l431K225k419
$$ -2656 1174 -1317 -2931 -3086 -3611 -3166 -2849 -2242 247 -940 -2159 117 281 -3150 -925 -3344
653920c344M06j654L014K373k567N74j400J342k552M600L36r80r86L417k850o9
$$ -3344 -2938 -4592 -1578 795 -1772 -1198 -2598 -1256 -3808 792 1128 148 -838 2579 -271 -340
654408c40j863M4L343o13j739l1L83L673n82K869l451k580J360J056k46l799J900
$$ -340 -2203 -2159 1184 571 -1168 -1199 -816 2857 2275 5144 1693 -887 473 1529 1283 -2516 -616
654927f16j501K137J269j365m6m18j236R02K477l23q9l400p55L999k114K182l622
$$ -616 -2117 20 1289 -76 -122 -540 -1776 -874 1603 1280 1191 -2209 -2964 1035 -1079 1103 -2519
655446b519j184K281R53K579q02j113K421n04K54l398J202m29J45K390L6j148
$$ -2519 -3703 -1422 -469 2110 1308 195 2616 2112 2366 -1032 170 -259 -114 2276 2312 1164
655934A164k830J160j733J96j060L088P4k021K675q71j045P5J632m372J778J459
$$ 1164 -1666 -506 -2239 -2043 -3103 -15 59 -1962 713 -158 -1203 -1128 504 -3868 -2090 -631
656422f31J240j818L249j142k049M3K474j317O99M27K439o455L160J895j481j353
$$ -631 609 -1209 2040 898 -1151 -1108 1366 49 748 1175 3614 -2841 319 2214 733 -620
656911f20j802O56K085L20L6K14r36n60J276k854K623k719K707r80J557m8k390
$$ -620 -2422 -1766 319 639 675 889 -47 -607 669 -2185 438 -2281 426 -554 1003 955 -1435
657429a435J843l217J802k713J821p70J503L608l21k476J12Q01m85R14p96P15
$$ -1435 408 -2809 -1007 -3720 -1899 -2669 -1166 2442 2121 -355 -243 558 73 987 191 906
657918I06j392M85J136L9k174j217P15K535j363J552J138l882K900l220K002O98
$$ 906 -486 -1 1135 1174 -1000 -2217 -1502 1033 -330 1222 2360 -1522 1378 -1842 160 858
658406H58l995o9L166k877J327j533J259K206j952R91k183j229L131j79q12J367
$$ 858 -3137 -3206 -40 -2917 -1590 -3123 -1864 342 -1610 -619 -2802 -4031 -900 -1079 -1891 -524
658894e24K149k594Q17j455N26K448j542j263P8J406N32J63O34k22K308l116r93
$$ -524 1625 -969 -152 -1607 -1081 1367 -175 -1438 -1360 46 578 741 1375 1153 3461 345 -648
659413f48J630k169M34l7P97j447J458J017n64J57k870K024k653j819L061j086
$$ -648 982 -1187 -753 -790 7 -1440 18 1035 471 628 -2242 -218 -2871 -4690 -1629 -2715
659901b715J006j661j287K634j047R20J443M48M78M961l430L04k020o3R48j573
$$ -2715 -1709 -3370 -4657 -2023 -3070 -2150 -707 -259 219 5180 1750 2054 34 -29 919 -654
660390f54K442j650J76Q77J274j539j182J924n17j072R47Q41m42j132k794L455
$$ -654 1788 138 314 1191 2465 926 -256 1668 1151 79 1026 1867 1425 293 -2501 954
660878I54L430m169N37k165P03l11q62L706K581n549K279n87K86k509j564J165
$$ 954 4384 215 752 -1413 -710 -1021 -1883 1823 4404 -1145 1134 547 833 -1676 -3240 -2075
661366b075J013K09M32o0J710K790k725j704m58L30J28P67j67j006l38J513J384
$$ -2075 -1062 -853 -421 -481 1229 4019 1294 -410 -868 -538 -410 357 190 -816 -1154 359 1743
661885A743r81n57J548j813R00l873L330j683J645n26r83Q14r44K010j65j010
$$ 1743 762 205 1753 -60 840 -3033 297 -1386 259 -267 -1250 -436 -1380 630 465 -545
662373e45N32OP22k203L762j82k842j188J846P24j61r30l25J64Q29K1N3q68J991
$$ -545 -13 -7 715 -1488 2274 2092 -750 -1938 -92 632 471 -459 -784 -620 209 230 283 -585 1406
662953A406K510k138k541n15J620K677q24j625k1p01o93K871j810rJ661J21J81
$$ 1406 3916 1778 -763 -1278 342 3019 2195 570 549 -152 -845 2026 216 207 1868 1989 2170
663472B170l193J378J60o06l58K75M92R05n28l76j257J111J958k114M18L32j473
$$ 2170 -1023 355 515 -91 -449 -174 318 1223 695 319 -938 173 2131 17 435 767 -706
663991g06j854L884J220j823k864J141L71k476J425J797j620L86L2N90J066r72
$$ -706 -2560 1324 2544 721 -2143 -1002 -631 -3107 -1682 115 -1505 -1119 -1087 -497 569 -403
664479d03l22j508N36L929l254p27p7Q69M551j125k397K054j067J325k356j744
$$ -403 -725 -2233 -1697 2232 -1022 -1749 -1826 -957 3594 2469 72 2126 1059 2384 28 -1716
664967a716N41J369J702l208K112K169j985J768o60j098k068j58k011J033J375
$$ -1716 -1175 194 1896 -1312 800 2969 984 2752 2092 994 -1074 -1232 -3243 -2210 -835
665425h35N3O5O31P17k69j233l0K223j663K292j843NJ08J879O88l860l01r72q2
$$ -835 -782 -717 -86 631 362 -871 -901 1322 -341 1951 108 113 221 2100 2788 -1072 -1373 -2345 -2427
666005b427J944M64J615j01j775k923K605M175j683q89k708L7J728p38J857k637
$$ -2427 -483 -19 1596 1495 -280 -3203 -598 3577 1894 1005 -1703 -1666 62 -676 1181 -1456
666494a456R78r09J038M45J45Q49j790L84Q5l68L54j004m56n39J787J809k863
$$ -1456 -478 -1387 -349 96 241 1090 -700 -316 -231 -599 -245 -1249 -1705 -2244 -457 1352 -1511
667012a511R21L33N20L465l649J042j516j356J561k35J724k253n21K08J914q29
$$ -1511 -590 -257 263 3728 79 1121 -395 -1751 -190 -425 1299 -954 -1475 -1267 647 -182
667501a82M88j309N8p30J898j490J612j687N56O14M11j099n52K792k559N51J074
$$ -182 306 -1003 -945 -1675 223 -1267 345 -1342 -786 -172 239 -860 -1412 1380 -1179 -628 446
668019D46R9J95q50o03K106m378L453j745K043J723l905j088M90k78J115K70k270
$$ 446 545 740 -110 -713 1393 -2985 468 -1277 766 2489 -1416 -2504 -2014 -2292 -1177 -907 -3177
668538c177J114Q86J014k16l178K776r54K71N94L238o42l793K628j367J797o87
$$ -3177 -2063 -1177 -163 -379 -3557 -781 -1735 -1464 -870 2368 1726 -2067 561 -806 991 304
669026C04j824k807J992K588k117J689J360j490L271n32j84l609J172J631J034
$$ 304 -1520 -4327 -2335 253 -1864 -175 1185 -305 2966 2434 2250 -1359 -187 1444 2478
669484B478j635J37j256j898J611L776m001j299K85p95J453N55j214J485kL45
$$ 2478 843 980 -276 -2174 -563 3213 -788 -2087 -1802 -2597 -1144 -589 -1803 -318 -320 25
669972B5k07J450j738J522p44j168O88r20M05j35k5J590j772r77K557l062m23
$$ 25 -182 1268 -470 1052 308 -860 -172 -1092 -687 -822 -847 743 -1029 -2006 551 -2511 -2934
670492b934K242K136K843l916J411k071p09j286K593l35L90p11q72J113M45j104
$$ -2934 -692 1444 4287 371 1782 -289 -998 -2284 309 -26 364 -347 -1219 -106 339 -765
670980g65J298j253J016Q64K827j881j583K9n67J932k718Q39l09J138l9Q87J671
$$ -765 533 -720 296 1160 3987 2106 523 552 -15 1917 -801 38 -271 867 828 1715 3386
671499C386m214m43N73L11J146k665j094R17J915r35J848k8m413K170K815J155
$$ 3386 -828 -1271 -698 -387 759 -1906 -3000 -2083 -168 -1103 745 717 -3696 -1526 1289 2444
671987B444k180K616l364j137j15K204P32J244j798k279P68j374K849j454K339
$$ 2444 264 2880 -484 -1621 -1736 468 1200 2444 646 -1633 -865 -2239 610 -844 1495
672445A495l203r60K425L497j590j579k64J364j138J418R5k871L444j525J061
$$ 1495 -1708 -2668 -243 3254 1664 85 -179 1185 47 1465 1560 -1311 2133 608 1669
672902A669j704j270L87R3j240K634k720l60R53J490j367o89J775L158m134j137
$$ 1669 -35 -1305 -918 -825 -2065 569 -2151 -2511 -1558 -68 -1435 -2124 -349 2809 -1325 -2462
673391b462J105n55l19K854J211R37k200n29J089O74q21r93O3J518q58q43j671
$$ -2462 -1357 -1912 -2231 623 1834 2771 571 42 1131 1805 984 -9 54 1572 714 -129 -1800
673909a800J813J366j543J878j43o30k152K156o20k035M028k148J306J48m684
$$ -1800 13 1379 -164 1714 1571 941 -1211 945 325 -1710 2318 170 1476 1624 -3060
674367c060J704p2l03J353k407j552p2L970l653l89K829K281q53l36p49J795k364
$$ -3060 -1356 -1428 -1731 -378 -2785 -4337 -4409 -439 -4092 -4481 -1652 629 -224 -560 -1309 486 -1878
674886a878N2L285N84l492M63K759P90m149M05m49p28p72M86oL258n78k67L01
$$ -1878 -1826 1459 2043 -1449 -986 1773 2563 -1586 -1181 -1630 -2358 -3130 -2644 -2650 608 30 -237 64
675435F4q53P9K779l029K068o36j22Q71j756j02J523p32l63j470j253J568L230
$$ 64 -789 -710 2069 -960 1108 472 350 1221 -535 -637 886 154 -209 -1679 -2932 -1364 1866
675954A866k969j46j121J354L653l084J6K008p92K20K27M92n29j695M41l109J541
$$ 1866 -1103 -1249 -2370 -1016 2637 -447 -431 1577 785 1005 1232 1724 1195 -500 -59 -3168 -1627
676473a627n89O23J569k42j026j49O2L358l401q5K380n86j256n77K123k53m018
$$ -1627 -2216 -1593 -24 -266 -1292 -1441 -1379 1979 -1422 -1507 873 287 -969 -1546 577 324 -3694
676992c694L608J433j782m3K197J001j25o94J99k077j372m22L205J390k565L294
$$ -3694 -86 1347 -435 -478 1719 2720 2595 1901 2100 23 -1349 -1771 1434 2824 259 3553
677480C553p82L93k602j468j549Q21k438K984J395K818l800k919J567r02R61l62
$$ 3553 2771 3164 562 -906 -2455 -1634 -4072 -1088 307 3125 -675 -3594 -2027 -2929 -1968 -2330
677968b330J993J204J63k718j69K838j610J890P94j633J287j257j042r1J076n87
$$ -2330 -337 867 1030 -1688 -1857 981 -629 1261 2055 422 1709 452 -590 -681 395 -192
678457a92K23m34K90j628Q15q56j878L968p76J103j282R84l1O20o67oj530q0J592
$$ -192 31 -403 -113 -1741 -926 -1782 -3660 308 -468 635 -647 337 306 926 259 253 -1277 -1357 235
679036B35m519K952o37K81J585k76k08Q97j039j168k442J610K613K568k570k004
$$ 235 -4284 -1332 -1969 -1688 -103 -379 -587 310 -729 -1897 -4339 -2729 -116 2452 -118 -2122
679525b122r22K067p30K564K559k470R13k379L287j711j180q52p88K737J636j610
$$ -2122 -3044 -977 -1707 857 3416 946 1859 -520 2767 1056 -124 -976 -1764 973 2609 999
680013I99K78J909k523l070L675N4n65n25r00l78J267K706j541j417j851O04J548
$$ 999 1277 3186 663 -2407 1268 1322 757 232 -668 -1046 221 2927 1386 -31 -1882 -1278 270
680532B70k316J864k4J08j29J55k840K831j703k510M712M46P63j189k26J291j94
$$ 270 -2046 -182 -206 -98 -227 -72 -2912 -81 -1784 -4294 418 864 1627 438 212 1503 1309
681051A309J645l681K634k144J523j663j315J348R77K318j762J819k657K440l259
$$ 1309 2954 -727 1907 -237 1286 -377 -1692 -344 633 2951 1189 3008 351 2791 -468
681509d68R36k27P67J223j686j433J08M399j013J43k070k902J244k088N298pk914
$$ -468 468 241 1008 2231 545 -888 -780 3619 2606 2749 679 -2223 -979 -3067 2231 2224 -690
682027f90L392j367P83l321p1J322p21K217j557p81J261j65j674N60n50j075K010
$$ -690 2702 1335 2118 -1203 -1274 48 -673 1544 -13 -794 467 302 -1372 -812 -1362 -2437 -427
682546d27k11j468L699k033J165j391k733L859k169o93L349j451O76J222l670
$$ -427 -638 -2106 1593 -440 725 -666 -3399 460 -1709 -2402 947 -504 172 1394 -2276
683004b276L108j463p50n7j625J336N14j268j237L458k870K394J17P02r98R48
$$ -2276 832 -631 -1381 -1438 -3063 -1727 -1213 -2481 -3718 -260 -3130 -736 -619 83 -915 33
683492C3K9J084J882o25K18j040r82j751j652O45L004L263m60l363O31O16j466
$$ 33 62 1146 3028 2403 2621 1581 599 -1152 -2804 -2159 845 4108 3648 285 916 1532 66
684011F6j888n73P93J538n30j964o30K713k56L7l92J83K769j85J35q5j6l311J712
$$ 66 -1822 -2395 -1602 -64 -594 -2558 -3188 -475 -731 -694 -1086 -903 1866 1681 1816 1731 1715 -1596 116
684591A16j071K536l310O81K83P50J356j028k03j561J579M88j502M95j425K854
$$ 116 -955 1581 -1729 -1048 -765 -15 1341 313 110 -1451 128 616 -886 -391 -1816 1038
685079A038n30l76l05j375L978j196l041J442J751O37J730m001j576k498J947
$$ 1038 508 132 -173 -1548 2430 1234 -1807 -365 1386 2023 3753 -248 -1824 -4322 -2375
685537b375L53K796j508o30j69J795J041o08m78j909K850j210R57J226m983R89
$$ -2375 -2022 774 -734 -1364 -1533 262 1303 695 217 -1692 1158 -52 905 2131 -2852 -1863
686025a863L155m327J253L670k384K867m085R02l80o43Q87J390m411J394O42K786
$$ -1863 1292 -3035 -1782 1888 -496 2371 -1714 -812 -1192 -1835 -948 442 -3969 -2575 -1933 853
686514H53k138K714q03J129m280J172J539J037m04j901o8Q34L225l725J184J105
$$ 853 -1285 1429 626 1755 -2525 -1353 186 1223 819 -1082 -1150 -316 2909 -816 368 1473
687002A473K595j522j025J99k017l10K30O55j720L009M49k416K251k47j989L624
$$ 1473 4068 2546 1521 1720 -297 -607 -377 278 -1442 1567 2016 -400 1851 1604 -385 3239
687490C239n1m163J276o12J851j30j805q31M27J001J94k230r22K152M61k162l94
$$ 3239 3188 -975 301 -311 1540 1410 -395 -1226 -799 202 396 -1834 -2756 -604 -143 -2305 -2699
688009b699Q81j921K057K740j804J802k509L35J813J389m26j766j805O93J58K127
$$ -2699 -1818 -3739 -1682 1058 -746 1056 -1453 -1118 695 2084 1658 -108 -1913 -1220 -1062 1065
688497A065k268J547J419l265J92r20L120k450J240j17K366J961k843r81J953
$$ 1065 -1203 344 1763 -1502 -1310 -2230 890 -1560 -320 -437 1929 3890 1047 66 2019
688955B019l354P22J390j448J930o60N04K0k443J146j094J169j45J385k242m48
$$ 2019 -1335 -613 777 -671 1259 599 1103 1123 -1320 -174 -1268 -99 -244 1141 -1101 -1549
689443a549m4L0N27J694P74j695p63k184M265j293J068j021J067k005m310J984
$$ -1549 -1593 -1563 -1036 658 1432 -263 -1026 -3210 1055 -238 830 -191 876 -1129 -5439 -3455
689932c455K359q02P6P5p27L299o70R29q82N23k082K80r92J452L90J390K97n52
$$ -3455 -1096 -1898 -1822 -1747 -2474 825 155 1084 202 725 -1357 -1077 -2069 -617 -227 1163 1460 908
690481I08l76o44j258J196p61K543n86P70j509K21K772k574l813P40K018J994
$$ 908 532 -112 -1370 -174 -935 1608 1022 1792 283 504 3276 702 -3111 -2371 -353 1641
690969A641J476k536j526J430n42K70J17j88k15k009M3l75j486J034L36K838j554
$$ 1641 3117 581 -945 485 -57 213 330 142 -73 -2082 -2039 -2414 -3900 -2866 -2530 308 -1246
691488a246p72O48K10j885J21M685j017k039j448K003l27J619J930j243p37n61
$$ -1246 -2018 -1370 -1160 -3045 -2924 1761 744 -1295 -2743 -740 -1067 552 2482 1239 502 -59
691976e9J177l860J569J670M77K606j859k520M28J932j615k864j066K496Q85r80
$$ -59 1118 -2742 -1173 497 974 3580 1721 -799 -371 1561 -54 -2918 -3984 -1488 -603 -1583
692465a583K333L32l051R78K356k187k999K241M375J099l386k621Q30N81k034
$$ -1583 750 1082 -1969 -991 1365 -822 -3821 -1580 2795 3894 508 -2113 -1283 -702 -2736
692922b736K281J130l0r77n9r31k71r84J856J022k11J915R23l269L29k40p64K32
$$ -2736 -455 675 645 -332 -391 -1322 -1593 -2577 -721 301 90 2005 2928 -341 -12 -252 -1016 -784
693472g84K385k393M82k4J320n00J275j986j242K039j228O43K512k907j759l67
$$ -784 1601 -792 -310 -334 986 486 1761 -225 -1467 572 -656 -13 2499 -408 -2167 -2534
693960b534K022J166l177J85J981j646J353L00o66J080n84P71j5j88L007n64k831
$$ -2534 -512 654 -2523 -2338 -357 -2003 -650 -350 -1016 64 -520 251 236 48 3055 2491 -340
694479c40J500R66j132m60j004J12O31o14p97K035q12j826Q38J372j995j036K947
$$ -340 1160 2126 994 534 -470 -358 273 -341 -1138 897 85 -1741 -903 469 -1526 -2562 385
694998C85j589J744k295Q07k524P67N10k88J227K548r18O49j221k500J710L02
$$ 385 -1204 540 -1755 -948 -3472 -2705 -2195 -2483 -1256 1292 374 1023 -198 -2698 -988 -686
695486f86L183j257j689r17j482L543j906m73L658j594J623l278N04k032L678
$$ -686 2497 1240 -449 -1366 -2848 695 -1211 -1684 1974 380 2003 -1275 -771 -2803 875
695944H75K104k159J883r8j001j611j346K457m23J699o38O68k070j240j660K643
$$ 875 2979 820 2703 2605 1604 -7 -1353 1104 681 2380 1742 2410 340 -900 -2560 83
696432H3R21j96p88k223j066R70R79K65P94j690j01M88q27J599N42k402P66o32
$$ 83 1004 808 20 -2203 -3269 -2299 -1320 -1055 -261 -1951 -2052 -1564 -2391 -792 -250 -2652 -1886 -2518
696981b518j013N187j072L71j917m71J040J298q14k49J681k400J542P86J147j412
$$ -2518 -3531 1656 584 955 -962 -1433 -393 905 91 -158 1523 -877 665 1451 2598 1186
697470A186k055J190J32pj094k145J726N93M91j711K312m48O58j244j059n47N7
$$ 1186 -869 321 453 446 -648 -2793 -1067 -474 17 -1694 618 170 828 -416 -1475 -2022 -1965
697988a965j089L305r77k250K356J500J77j451J447j487P33j104n65Q50n93J920
$$ -1965 -3054 251 -726 -2976 -620 880 1057 -394 1053 -434 299 -805 -1370 -520 -1113 807
698477H07j686J470r50J966m61P28k058J618j983m21m75P50J102o18Q34l78J15
$$ 807 -879 591 -359 1607 1146 1874 -184 1434 -549 -970 -1445 -695 407 -211 623 245 360
698996C60j77o36j169J664m36Q27k10K15l412Q01q08P93K061L387j678R44j320
$$ 360 183 -453 -1622 42 -394 433 223 438 -2974 -2173 -2981 -2188 -127 3260 1582 2526 1206
699515A206j539j947J496K82j068K879L7n33j019J032k825l56p51k28K805l591
$$ 1206 -333 -2280 -784 -502 -1570 1309 1346 813 -206 826 -1999 -2355 -3106 -3334 -529 -4120
700003d120L997p46P20J700k518K740j140k887L031K038l477K079m054R34L921
$$ -4120 -123 -869 -149 1551 -967 1773 633 -2254 777 2815 -662 1417 -2637 -1703 2218
700461B218l104J974R48n59m99q69L187m000J16j001r73J313L498k975k887J756
$$ 2218 -886 1088 2036 1477 978 109 3296 -704 -588 -1589 -2562 -1249 2249 -726 -3613 -1857
700949a857L369j533J322k137R78M78p85N0j87k280O33R83L019k618J37k149K45
$$ -1857 1512 -21 1301 -836 142 620 -165 -115 -302 -2582 -1949 -966 2053 -565 -428 -2577 -2332
701468b332o14L818K60m52k145M59K587k027K4J109j219R33J096k89L11l96N29
$$ -2332 -2946 872 1132 680 -1465 -1006 1581 -446 -422 687 -532 401 1497 1208 1519 1123 1652
701986A652k426m77o09m30K283k334p11K548j301j922J007J074j36M31M78L031
$$ 1652 -774 -1251 -1860 -2290 -7 -2341 -3052 -504 -1805 -3727 -2720 -1646 -1782 -1351 -873 2158
702475B158j514r25j030J342J86o67K98k273P22K34J298L36K93O91k407lJ196
$$ 2158 644 -281 -1311 31 217 -450 -152 -2425 -1703 -1469 -171 165 458 1149 -1258 -1261 -65
702994f5K81J150J39J255n757M24R10J476J269j625J503L146k985L31l749J430
$$ -65 216 1366 1505 2760 -2997 -2573 -1663 -187 1082 -543 960 4106 1121 1452 -2297 -867
703482h67J145j440j043J379l736K767N65L145k904j451J368K102M7k489M4J014
$$ -867 278 -1162 -2205 -826 -4562 -1795 -1230 1915 -989 -2440 -1072 1030 1077 -1412 -1368 -354
703970c54K86j73j930K308M81o2j048K060J14q34M26j355j742J218N27J354n6
$$ -354 -68 -241 -2171 137 618 556 -492 1568 1682 848 1274 -81 -1823 -605 -78 1276 1220
704489A220N08r89k326j070M783l107j788J408J227J827j643J280n42k640K80
$$ 1220 1728 739 -1587 -2657 2126 -981 -2769 -1361 -134 1693 50 1330 788 -1852 -1572
704947a572J507N29l042J303L140n929L574K234L8j081l86j38r8j97o50j081j464
$$ -1572 -65 464 -2578 -1275 1865 -4064 -490 1744 1782 701 315 177 79 -118 -768 -1849 -3313
705466c313L169j188j231J128j253q00m00L196n35N3Q54P5r45J660j481P26n18
$$ -3313 -144 -1332 -2563 -1435 -2688 -3488 -3888 -692 -1227 -1174 -320 -245 -1190 470 -1011 -285 -803
705984h03o11n70J447j161J74J393K410l106J787J96o93j284Q39k536J795J843
$$ -803 -1414 -1984 -537 -1698 -1524 -131 2279 -827 960 1156 463 -821 18 -2518 -723 1120
706473A120j3j393k946N03J664K083K101m750L557j578K459K64l674J660j054
$$ 1120 1107 -286 -3232 -2729 -1065 1018 3119 -1631 1926 348 2807 3071 -603 1057 3
706930Cr57J18J918k142j135J735J454l09k882j435J367L592L16k128J728q17
$$ 3 -954 -836 1082 -1060 -2195 -460 994 685 -2197 -3632 -2265 1327 1643 -485 1243 426
707419D26k83J643j090j797k532L103J221J338l874J991J974j538l95M84j280
$$ 426 143 1786 696 -1101 -3633 -530 691 2029 -1845 146 2120 582 187 671 -609
707877f09J86M51n64j028L81R06L07r03J60J68l29J108o49j87j449p22J656r44
$$ -609 -423 28 -536 -1564 -1183 -277 30 -873 -713 -545 -874 234 -415 -602 -2051 -2773 -1117 -2061
708426b061P67k399j014L359K407M58j259O93L37L60K072j406r2j130r46K902
$$ -2061 -1294 -3693 -4707 -1348 1059 1517 258 951 1288 1648 3720 2314 2222 1092 146 3048
708914C048r09k299j766K040k60J930m634L168j10l779O88J292K475n00J343j877
$$ 3048 2139 -160 -1926 114 -146 1784 -2850 318 208 -3571 -2883 -1591 884 384 1727 -150
709403a50J802j06l181J498p1l43n08J697k295l78J204r2K35j419M058L08r53
$$ -150 1652 1546 -1635 -137 -208 -551 -1059 638 -1657 -2035 -831 -923 -688 -2107 1951 2259 1306
709921A306o84j73k89J299k809J84J650J71O67r17l6k260K51K803k471R47j290
$$ 1306 622 449 160 1459 -1350 -1166 484 655 1322 405 369 -1891 -1640 1163 -1308 -361 -1651
710440a651K91k148N154l694R90J211p81J981j616k52k75P12m98K17n79K279p61
$$ -1651 -1360 -3508 1646 -2048 -1058 153 -628 1353 -263 -515 -790 -78 -576 -359 -938 1341 580
710959E80j013q02J897r05r55J952M9j705L55K671n952M059n65L01l10j074N35
$$ 580 -433 -1235 662 -243 -1198 754 803 -902 -547 2124 -3828 231 -334 -33 -343 -1417 -882
711478h82J264m97N90k666Q18K534J303o78l363K351l753J291J343m15J59J874
$$ -882 382 -115 475 -2191 -1373 1161 2464 1786 -1577 774 -2979 -1688 -345 -760 -601 1273
711966A273j23l009j568R09J437m52R31J880k506J188J459k296L489L69P8j330
$$ 1273 1150 -1859 -3427 -2518 -1081 -1533 -602 1278 -1228 -40 1419 -877 2612 2981 3059 1729
712454A729j857N72J159j641q08n83J83K116N39l056j994K589J583k950L547l300
$$ 1729 -128 444 1603 -38 -846 -1429 -1246 870 1409 -1647 -3641 -1052 531 -2419 1128 -2172
712943b172J653Q60n06K023o55j834j844K950r45J08N01j837J578j285m38K273
$$ -2172 -519 341 -165 1858 1203 -631 -2475 475 -470 -362 139 -1698 -120 -1405 -1843 430
713431D30o91J225J440J060k002k755K158n40O80q95p13M31J106o05N38j792L66
$$ 430 -261 964 2404 3464 1462 -1293 865 325 1005 110 -603 -172 934 329 867 -925 -559
713950e59Q65o75q28K781j760j770J092K823m11k75P61M16j998L93j098j401L224
$$ -559 306 -369 -1197 1584 -176 -1946 -854 1969 1558 1283 2044 2460 462 855 -243 -1644 1580
714469A580p69l245J498J236k015j120M74K05K820o5j28j412J939l0j831j429
$$ 1580 811 -2434 -936 300 -1715 -2835 -2361 -2156 664 599 471 -941 998 968 -863 -2292
714957b292M015J986m587K627r06j83o51J238M70o82M85l444J659O49K051l810
$$ -2292 1723 3709 -878 1749 843 660 9 1247 1717 1035 1520 -1924 -265 384 2435 -1375
715445a375K445k21O14j78j307k187J499m36Nk079L27K152p51J556m59o13N62
$$ -1375 1070 849 1463 1285 -22 -2209 -710 -1146 -1141 -3220 -2893 -741 -1492 64 -395 -1008 -446
715964d46K90k013J280r19J536L094l983K290m70N71o87j325q75j80K770j661
$$ -446 -156 -2169 -889 -1808 -272 2822 -1161 1129 659 1230 543 -782 -1657 -1837 933 -728
716452g28j552J861Q72j677K811n0k811J726j595Q67N82j131j132j037P05j011
$$ -728 -2280 -419 453 -1224 1587 1537 -1274 452 -1143 -276 306 -825 -1957 -2994 -2289 -3300
716940c300J676K694p82p49o29Q61j127j251r19L38J002J879K13k525L140m0l019
$$ -3300 -1624 1070 288 -461 -1090 -229 -1356 -2607 -3526 -3188 -2186 -307 -94 -2619 521 481 -2538
717460b538J5K768P8j058J048R88J164k876J77J528J163Q03k693r91O93L92j96
$$ -2538 -2523 245 323 -735 313 1301 2465 -411 -234 1294 2457 3260 567 -424 269 661 465
717978D65K198m5k430L37j892J236L098l744K14L179k802J962j816K50k417R31
$$ 465 2663 2618 188 525 -1367 -131 2967 -777 -563 2616 -186 1776 -40 210 -2207 -1276
718467a276Q85J968o53j740N02K795k610j431L529m28j190j71M74r44j108j902
$$ -1276 -391 1577 924 -816 -314 2481 -129 -1560 1969 1541 351 180 654 -290 -1398 -3300
718955c300L467L94J994n94l22n08q98j36k156l74L090j101J080K34O86j666l577
$$ -3300 167 561 2555 1961 1639 1131 233 97 -2059 -2433 657 -444 636 870 1556 -110 -3687
719474c687L825j413O1o83L92L548O20k609m48P58J359L03j718q22J639k920p96
$$ -3687 138 -1275 -1214 -1897 -1505 2043 2663 54 -394 364 1723 2026 308 -514 1125 -1795 -2591
719992b591K603j398j92l27Q80n17N83O72j649J148J080l44j583J391q77J184
$$ -2591 12 -1386 -1578 -1905 -1025 -1542 -959 -287 -1936 -788 292 -52 -1635 -244 -1121 63
720481F3K213l395O83k865O465m11j952J025K07j305j137q85O90o41J171Qq83
$$ 63 2276 -1119 -436 -3301 3164 2753 801 1826 2033 728 -409 -1294 -604 -1245 -74 -66 -949
720999i49L670p70j101k639J704j964q92J556O36J57r76l2J82K965L530l703m10
$$ -949 2721 1951 850 -1789 -85 -2049 -2941 -1385 -749 -592 -1568 -1600 -1418 1547 5077 1374 964
721519I64n27K05k428K3M85m81J699J993k086j782N13J654J215J48j841k064M80
$$ 964 437 642 -1786 -1763 -1278 -1759 -60 1933 -153 -1935 -1422 232 1447 1595 -246 -2310 -1830
722037a830k61J777j089J056j703K776r61J549j95j403L13k464M75k69M90K633
$$ -1830 -2091 -314 -1403 -347 -2050 726 -235 1314 1119 -284 29 -2435 -1960 -2229 -1739 894
722526H94j618K224l643q21J359K230o20j793p19K955k622J069K792N03l557K227
$$ 894 -724 1500 -2143 -2964 -1605 625 5 -1788 -2507 448 -2174 -1105 1687 2190 -1367 860
723014H60J013j912K62J682j973o07M32l206O30R7R3o60OJ716j092K027j180k70
$$ 860 1873 -39 223 1905 -68 -675 -243 -3449 -2819 -2722 -2629 -3289 -3283 -1567 -2659 -632 -1812 -2082
723563b082J890K798k860p03p70K289q51m80j820J038L014N55j155O45o77J509
$$ -2082 -192 2606 -254 -957 -1727 562 -289 -769 -2589 -1551 1463 2018 863 1508 831 2340
724051B340k633K68k96q78J967k055J806P2n98n39K768J027k077j036k15k53j80
$$ 2340 -293 -25 -321 -1199 768 -1287 519 591 -7 -546 2222 3249 1172 136 -79 -332 -512
724570e12m73j708M95L05J720o04J215N29j885J346k789R26J82L249m292N81J325
$$ -512 -985 -2693 -2198 -1893 -173 -777 438 967 -918 428 -2361 -1435 -1253 1996 -2296 -1715 -390
725089c90r95J643j048Q37L349l444K444m45l71m522L304L00J381j562j149n76
$$ -390 -1385 258 -790 47 3396 -48 2396 1951 1580 -2942 362 662 2043 481 -668 -1244
725577a244Q97o10q18J819J23J548k141q38L76O33j16k044J660j296K318K074
$$ -1244 -347 -957 -1775 44 167 1715 -426 -1264 -888 -255 -371 -2415 -755 -2051 267 2341
726065B341k129J117N60o12k053K665r84k837L941l313j997J462K517J079k547
$$ 2341 212 1329 1889 1277 -776 1889 905 -1932 2009 -1304 -3301 -1839 678 1757 -790
726524g90j012J036J844l52o72Q18j005J736k502j849%J418J321j704p90J420
$$ -790 -1802 -766 1078 726 54 872 -133 1603 -899 -2748 -2748 -1330 -9 -1713 -2503 -1083
727012a083k49p16j144R86J317J830j77n58j329O69J149q99k354m88L94M255J36
$$ -1083 -1332 -2048 -3192 -2206 -889 941 764 206 -1123 -454 695 -204 -2558 -3046 -2652 1603 1739
727531A739j531o93J262j496p10M451J36k622o20m16K828j69o72l504K346Q83
$$ 1739 208 -485 777 -719 -1429 3022 3158 536 -84 -500 2328 2159 1487 -2017 329 1212
728019A212N0N72j441j477K38J641q76Q10J270j564q77P92o67J308k049j417j30
$$ 1212 1262 1834 393 -1084 -846 795 -81 729 1999 435 -442 350 -317 991 -1058 -2475 -2605
728538b605J345K097r92M94j539k044J551o38O79M76K629l922J307k12k840K941
$$ -2605 -1260 837 -155 339 -1200 -3244 -1693 -2331 -1652 -1176 1453 -2469 -1162 -1374 -4214 -1273
729026a273J541k148L382J743k752K03k1m415K690o70K565j581l64J087J47K425
$$ -1273 268 -1880 1502 3245 493 696 675 -3740 -1050 -1720 845 -736 -1100 -13 134 2559
729514B559k337k793j550K762l06J252J291L22r65p14K814j5p26j933q57J16n67
$$ 2559 222 -2571 -4121 -1359 -1665 -413 878 1200 235 -479 2335 2320 1594 -339 -1196 -1080 -1647
730033a647m47J801j924q18K062R18j061K619m1k09k494J556J478m16J18j757
$$ -1647 -2094 -293 -2217 -3035 -973 -55 -1116 1503 1462 1253 -1241 315 1793 1377 1495 -262
730521b62J393l351J233M16P37l616L015L30j10j11k878q5J979J852O77o01J011
$$ -262 1131 -2220 -987 -571 166 -3450 -435 -105 -215 -326 -3204 -3289 -1310 542 1219 618 1629
731040A629j060j08M61M10k23J16J724p36k08j529J300P77q16M1l39j825L58k16
$$ 1629 569 461 922 1332 1109 1225 2949 2213 2005 476 1776 2553 1737 1778 1439 -386 -28 -244
731590b44J616k951J356O56K240l469J201k119K709r69P39k72j679K863l022j308
$$ -244 1372 -1579 -223 433 2673 -796 405 -1714 995 26 765 493 -1186 1677 -1345 -2653
732078b653L982K198j619j374Q47k642O54J769k218N8J921r70n78J165q33L21
$$ -2653 1329 3527 1908 534 1381 -1261 -607 1162 -1056 -998 923 -47 -625 540 -293 28
732566B8K188l743j044O14K739l249j985M241J232j087q44O66p95L391k082K35
$$ 28 2216 -1527 -2571 -1957 782 -2467 -4452 -211 1021 -66 -910 -244 -1039 2352 270 505
733054E05J489k119M24J711m672J089J388M76P68l183m34K832k694J237J66J53
$$ 505 1994 -125 299 2010 -2662 -1573 -185 291 1059 -2124 -2558 274 -2420 -1183 -1017 -864
733543h64N45K432p9k616K30n87J287j633l465J619K910m76q31J655J43K92J807
$$ -864 -319 2113 2034 -582 -352 -939 348 -1285 -4750 -3131 -221 -697 -1528 127 270 562 2369
734061B369k599R61k76R2l415L915Q8P97k640j177L174P03j351J281n05j190k245
$$ 2369 -230 731 455 547 -2868 1047 1135 1932 -708 -1885 1289 1992 641 1922 1417 227 -2018
734580b018J806J342O43j55q75k806J70N98l350J875K449L12k631P90J504j374
$$ -2018 -212 1130 1773 1618 743 -2063 -1893 -1295 -4645 -2770 -321 -9 -2640 -1850 -346 -1720
735068a720J890K421j94j621p88l71J98P95r99q70O78k211N33K118j660J05o07
$$ -1720 170 2591 2397 776 -12 -383 -185 610 -389 -1259 -581 -2792 -2259 -141 -1801 -1696 -2303
735587b303K740q94K122l044Q83p4r4j535J187N085m643J730r04k907l12K045
$$ -2303 437 -457 1665 -1379 -496 -570 -664 -2199 -1012 4073 -570 1160 256 -2651 -2963 -918
736076i18m66m36K565p67p04l55k20K356n89o58J306k710N37P14P45K60K634k870
$$ -918 -1384 -1820 745 -22 -726 -1081 -1301 1055 466 -192 1114 -1596 -1059 -345 400 660 3294 424
736625D24L53J364j506j25o37J426l118k18M270j490j277K544q33K239l770Q0
$$ 424 777 2141 635 510 -127 1299 -1819 -2037 2233 743 -534 2010 1177 3416 -354 -274
737113b74K78k375K631p05J673j341j568j018K366L5M90J76J537k687j313m1L286
$$ -274 4 -2371 260 -445 1228 -113 -1681 -2699 -333 -298 192 368 1905 -782 -2095 -2136 1150
737632A150J6J067l209k203M221J219r12j182J224k833j769L097J338k069j789
$$ 1150 1166 2233 -976 -3179 1042 2261 1349 167 1391 -1442 -3211 -114 1224 -845 -2634
738090b634J648j334L31q02K778j409K061j912O76o93P34l809K641K144J81J250
$$ -2634 -986 -2320 -1989 -2791 -13 -1422 639 -1273 -597 -1290 -556 -4365 -1724 420 601 1851
738578A851l063K627L00J266j995o14N51K857l675R70Q3k195k90j08J717L409
$$ 1851 -1212 1415 1715 2981 986 372 923 3780 105 1075 1158 -1037 -1327 -1435 282 3691
739066C691k969K93r68j733L534k044J179j244Q90J232k846J84j217L400k238
$$ 3691 722 1015 47 -1686 1848 -196 983 -261 629 1861 -985 -801 -2018 1382 -856
739524h56O87J122L23q69q52j36R69o49J252k056J883K273k184k301J952K51k42
$$ -856 -169 953 1276 407 -445 -581 388 -261 991 -1065 818 3091 907 -1394 558 809 567
740043E67m7o07K312j030j527K032l67L173k743k703j99R58O92j688j267l3j158
$$ 567 520 -87 2225 1195 -332 1700 1333 4506 1763 -940 -1139 -181 511 -1177 -2444 -2477 -3635
740562c635L357K535l809J812j894J839j748n07J182n07J186M748j320j734p6
$$ -3635 -278 2257 -1552 260 -1634 205 -1543 -2050 -868 -1375 -189 4559 3239 1505 1429
741020A429J796k409J073r26j203J09L74J25r90m78j872J475L11J591J43K695
$$ 1429 3225 816 1889 963 -240 -131 243 368 -622 -1100 -2972 -1497 -1186 405 548 3243
741508C243l087J904Mo22K13J777k407k352j283L042o07J648j880j637M68O52
$$ 3243 156 2060 2064 1442 1655 3432 1025 -1327 -2610 432 -175 1473 -407 -2044 -1576 -924
741996i24k85K106k293K037O58K348n601J888o32m04J216r93j369L184N00k384
$$ -924 -1209 897 -1396 641 1299 3647 -1954 -66 -698 -1102 114 -879 -2248 936 1436 -948
742485i48j989J001j9P47j64k52K927l93J970l667K51K30K115l037l17j60j256
$$ -948 -2937 -1936 -1955 -1208 -1372 -1624 1303 910 2880 -787 -536 -306 1809 -1228 -1545 -1705 -2961
743003b961K765j043k147M067k17J577q44K432k126j610l801J017K265j84n16
$$ -2961 -196 -1239 -3386 681 464 2041 1197 3629 1503 -107 -3908 -2891 -626 -810 -1326
$$ [...]
##END=
##TITLE= Acetophenone
##JCAMP-DX= 4.24  $$ home made
##DATA TYPE= MASS SPECTRUM
##ORIGIN= UWI, Mona, JAMAICA
##OWNER= public domain
##BLOCK_ID=4
##$URL= http://wwwchem.uwimona.edu.jm/spectra
##SPECTROMETER/DATA SYSTEM= Finnigan
##.INSTRUMENT PARAMETERS= LOW RESOLUTION
##.SPECTROMETER TYPE= TRAP
##.INLET= GC
##.IONIZATION MODE= EI+
##MOLFORM= C 8 H 8 O
##$MODELS=
<Models>
<ModelData id="acetophenone" type="MOL">
acetophenone
  DSViewer          3D                             0

 17 17  0  0  0  0  0  0  0  0999 V2000
   -1.6931    0.0078    0.0000 C   0  0  0  0  0  0  0  0  0  1
   -0.2141    0.0078    0.0000 C   0  0  0  0  0  0  0  0  0  2
    2.5839    0.0872    0.0000 C   0  0  0  0  0  0  0  0  0  3
    0.4615    1.2373   -0.0005 C   0  0  0  0  0  0  0  0  0  4
    0.5257   -1.1809    0.0001 C   0  0  0  0  0  0  0  0  0  5
    1.9188   -1.1393    0.0005 C   0  0  0  0  0  0  0  0  0  6
    1.8539    1.2756   -0.0001 C   0  0  0  0  0  0  0  0  0  7
   -0.1262    2.1703   -0.0009 H   0  0  0  0  0  0  0  0  0  8
    0.0144   -2.1556    0.0002 H   0  0  0  0  0  0  0  0  0  9
    2.4947   -2.0764    0.0009 H   0  0  0  0  0  0  0  0  0 10
    2.3756    2.2439   -0.0001 H   0  0  0  0  0  0  0  0  0 11
    3.6838    0.1161    0.0003 H   0  0  0  0  0  0  0  0  0 12
   -2.3403    1.0639    0.0008 O   0  0  0  0  0  0  0  0  0 13
   -2.3832   -1.3197   -0.0010 C   0  0  0  0  0  0  0  0  0 14
   -2.0973   -1.8988    0.9105 H   0  0  0  0  0  0  0  0  0 15
   -2.0899   -1.9018   -0.9082 H   0  0  0  0  0  0  0  0  0 16
   -3.4920   -1.1799   -0.0059 H   0  0  0  0  0  0  0  0  0 17
  1  2  1  0  0  0
  2  5  4  0  0  0
  2  4  4  0  0  0
  3 12  1  0  0  0
  4  7  4  0  0  0
  5  6  4  0  0  0
  6 10  1  0  0  0
  6  3  4  0  0  0
  7  3  4  0  0  0
  7 11  1  0  0  0
  8  4  1  0  0  0
  9  5  1  0  0  0
 13  1  2  0  0  0
 14 16  1  0  0  0
 14  1  1  0  0  0
 14 15  1  0  0  0
 17 14  1  0  0  0
M  END
</ModelData>
<ModelData id="2" type="MOL" baseModel="acetophenone">
acetophenone m/z 120
  DSViewer          3D                             0

 17 17  0  0  0  0  0  0  0  0999 V2000
   -1.6931    0.0078    0.0000 C   0  0  0  0  0  0  0  0  0  1
   -0.2141    0.0078    0.0000 C   0  0  0  0  0  0  0  0  0  2
    2.5839    0.0872    0.0000 C   0  0  0  0  0  0  0  0  0  3
    0.4615    1.2373   -0.0005 C   0  0  0  0  0  0  0  0  0  4
    0.5257   -1.1809    0.0001 C   0  0  0  0  0  0  0  0  0  5
    1.9188   -1.1393    0.0005 C   0  0  0  0  0  0  0  0  0  6
    1.8539    1.2756   -0.0001 C   0  0  0  0  0  0  0  0  0  7
   -0.1262    2.1703   -0.0009 H   0  0  0  0  0  0  0  0  0  8
    0.0144   -2.1556    0.0002 H   0  0  0  0  0  0  0  0  0  9
    2.4947   -2.0764    0.0009 H   0  0  0  0  0  0  0  0  0 10
    2.3756    2.2439   -0.0001 H   0  0  0  0  0  0  0  0  0 11
    3.6838    0.1161    0.0003 H   0  0  0  0  0  0  0  0  0 12
   -2.3403    1.0639    0.0008 O   0  0  0  0  0  0  0  0  0 13
$$ [...]
    2.5839    0.0872    0.0000 C   0  0  0  0  0  0  0  0  0  0  0  0
    0.4615    1.2373   -0.0005 C   0  0  0  0  0  0  0  0  0  0  0  0
    0.5257   -1.1809    0.0001 C   0  0  0  0  0  0  0  0  0  0  0  0
    1.9188   -1.1393    0.0005 C   0  0  0  0  0  0  0  0  0  0  0  0
    1.8539    1.2756   -0.0001 C   0  0  0  0  0  0  0  0  0  0  0  0
   -2.3403    1.0639    0.0008 O   0  0  0  0  0  0  0  0  0  0  0  0
   -0.1262    2.1703   -0.0009 H   0  0  0  0  0  0  0  0  0  0  0  0
    0.0144   -2.1556    0.0002 H   0  0  0  0  0  0  0  0  0  0  0  0
    2.4947   -2.0764    0.0009 H   0  0  0  0  0  0  0  0  0  0  0  0
    2.3756    2.2439   -0.0001 H   0  0  0  0  0  0  0  0  0  0  0  0
    3.6838    0.1161    0.0003 H   0  0  0  0  0  0  0  0  0  0  0  0
  1  2  1  0  0  0  0
  1  8  2  0  0  0  0
  2  4  4  0  0  0  0
  2  5  4  0  0  0  0
  3  6  4  0  0  0  0
  3  7  4  0  0  0  0
  3 13  1  0  0  0  0
  4  7  4  0  0  0  0
  4  9  1  0  0  0  0
  5  6  4  0  0  0  0
  5 10  1  0  0  0  0
  6 11  1  0  0  0  0
  7 12  1  0  0  0  0
M  END
$$$$
acetophenone m/z 77

  created with ArgusLab version 4.0.1
 11 11  0  0  0  0  0  0  0  0  0 V2000
   -0.2141    0.0078    0.0000 C   0  0  0  0  0  0  0  0  0  0  0  0
    2.5839    0.0872    0.0000 C   0  0  0  0  0  0  0  0  0  0  0  0
    0.4615    1.2373   -0.0005 C   0  0  0  0  0  0  0  0  0  0  0  0
    0.5257   -1.1809    0.0001 C   0  0  0  0  0  0  0  0  0  0  0  0
    1.9188   -1.1393    0.0005 C   0  0  0  0  0  0  0  0  0  0  0  0
    1.8539    1.2756   -0.0001 C   0  0  0  0  0  0  0  0  0  0  0  0
   -0.1262    2.1703   -0.0009 H   0  0  0  0  0  0  0  0  0  0  0  0
    0.0144   -2.1556    0.0002 H   0  0  0  0  0  0  0  0  0  0  0  0
    2.4947   -2.0764    0.0009 H   0  0  0  0  0  0  0  0  0  0  0  0
    2.3756    2.2439   -0.0001 H   0  0  0  0  0  0  0  0  0  0  0  0
    3.6838    0.1161    0.0003 H   0  0  0  0  0  0  0  0  0  0  0  0
  1  3  4  0  0  0  0
  1  4  4  0  0  0  0
  2  5  4  0  0  0  0
  2  6  4  0  0  0  0
  2 11  1  0  0  0  0
  3  6  4  0  0  0  0
  3  7  1  0  0  0  0
  4  5  4  0  0  0  0
  4  8  1  0  0  0  0
  5  9  1  0  0  0  0
  6 10  1  0  0  0  0
M  END
</ModelData>
</Models>
##$PEAKS=
<Peaks type="MS" xUnits="M/Z" yUnits="RELATIVE ABUNDANCE" >
<PeakData id="1" title="molecular ion (~120)" peakShape="sharp" model="2.1"  xMax="121" xMin="119"  yMax="100" yMin="0" />
<PeakData id="2" title="fragment 1 (~105)" peakShape="sharp" model="2.2"  xMax="106" xMin="104"  yMax="100" yMin="0" />
<PeakData id="3" title="fragment 2 (~77)" peakShape="sharp" model="2.3"  xMax="78" xMin="76"  yMax="100" yMin="0" />
</Peaks>
##XUNITS= M/Z
##YUNITS= RELATIVE ABUNDANCE
##XFACTOR= 1
##YFACTOR= 1
##FIRSTX= 0
##LASTX= 121
##NPOINTS= 19
##FIRSTY= 0
##PEAK TABLE= (XY..XY)
0,0
38,52 39,80 43,219 50,202 51,419 52,40 63,38 74,66 75,37 76,46 77,1000 78,104
89,10 91,10 105,808 106,60 120,231 121,20
##END=
##END=$$ END of FILE