##TITLE=$$ Begin of the link block
##JCAMP-DX=5.00 $$ ACD/Spectrus 2012 v 14.01
##ORIGIN=
##OWNER=
##DATA TYPE=LINK
##BLOCKS=3
##TITLE=$$ Begin of the structure block
##JCAMP-CS=3.7 $$ ACD/Spectrus 2012 v 14.01
##ORIGIN=
##OWNER=
##BLOCK_ID=1
##ATOMLIST=
$$        AN        AS        NH
          1         C 
          2         C 
          3         C 
          4         C 
          5         C 
          6         C 
          7         C 
          8         O 
          9         C 
          10        C 
          11        C 
          12        H 
          13        H 
          14        H 
          15        H 
          16        H 
          17        H 
          18        H 
          19        H 
          20        H 
          21        H 
          22        H 
          23        H 
          24        H 
          25        H 
##BONDLIST=
$$        AN1       AN2       BT
          1         2         S
          1         3         D
          1         13        S
          2         4         S
          2         14        S
          2         15        S
          3         5         S
          3         7         S
          4         6         S
          4         9         S
          4         12        S
          5         6         S
          5         8         D
          6         16        S
          6         17        S
          7         18        S
          7         19        S
          7         20        S
          9         10        D
          9         11        S
          10        21        S
          10        22        S
          11        23        S
          11        24        S
          11        25        S
##XY_RASTER=
$$        AN        X         Y         Z
          1         111       96
          2         111       135
          3         78        77
          4         78        154
          5         45        96
          6         45        135
          7         78        39
          8         11        77
          9         60        191
          10        22        195
          11        82        223
          12        93        191
          13        145       77
          14        136       171
          15        149       128
          16        7         128
          17        20        160
          18        117       39
          19        78        0
          20        39        39
          21        0         163
          22        5         229
          23        51        245
          24        104       255
          25        114       201
##STEREOCENTER=
$$        AN        SD
          4         M
##STEREOPAIR=
$$        AN1       AN2       SD
          9         10        P
##$MOLFILE=  $$ Empty String
  ACD/Labs03061411352D
  $$ Empty String
 25 25  0  0  1  0  0  0  0  0 26 V2000
  111.4254  -96.4413    0.0000 C   0  0  0  0  0  0  0  0  0  0  0  0
  111.4254 -135.0177    0.0000 C   0  0  0  0  0  0  0  0  0  0  0  0
$$ [...]
    6.6168 -128.3187    0.0000 H   0  0  0  0  0  0  0  0  0  0  0  0
   20.2582 -160.1131    0.0000 H   0  0  0  0  0  0  0  0  0  0  0  0
  116.5902  -38.5758    0.0000 H   0  0  0  0  0  0  0  0  0  0  0  0
   78.0130    0.0000    0.0000 H   0  0  0  0  0  0  0  0  0  0  0  0
   39.4372  -38.5772    0.0000 H   0  0  0  0  0  0  0  0  0  0  0  0
    0.0000 -162.8224    0.0000 H   0  0  0  0  0  0  0  0  0  0  0  0
    5.3520 -229.4242    0.0000 H   0  0  0  0  0  0  0  0  0  0  0  0
   50.5013 -245.1464    0.0000 H   0  0  0  0  0  0  0  0  0  0  0  0
  104.1594 -255.0000    0.0000 H   0  0  0  0  0  0  0  0  0  0  0  0
  114.0131 -201.3419    0.0000 H   0  0  0  0  0  0  0  0  0  0  0  0
  1  2  1  0  0  0  0
  1  3  2  0  0  0  0
  1 13  1  0  0  0  0
  2  4  1  0  0  0  0
  2 14  1  0  0  0  0
  2 15  1  0  0  0  0
  3  5  1  0  0  0  0
  3  7  1  0  0  0  0
  4  6  1  0  0  0  0
  4  9  1  1  0  0  0
  4 12  1  6  0  0  0
  5  6  1  0  0  0  0
  5  8  2  0  0  0  0
  6 16  1  0  0  0  0
  6 17  1  0  0  0  0
  7 18  1  0  0  0  0
  7 19  1  0  0  0  0
  7 20  1  0  0  0  0
  9 10  2  0  0  0  0
  9 11  1  0  0  0  0
 10 21  1  0  0  0  0
 10 22  1  0  0  0  0
 11 23  1  0  0  0  0
 11 24  1  0  0  0  0
 11 25  1  0  0  0  0
M  ZZC   1 3
M  ZZC   2 2
M  ZZC   3 4
M  ZZC   4 1
M  ZZC   5 5
M  ZZC   6 6
M  ZZC   7 9
M  ZZC   8 10
M  ZZC   9 7
M  ZZC  10 11
M  ZZC  11 8
M  ZZC  12 1a
M  ZZC  13 3a
M  ZZC  14 2a
M  ZZC  15 2b
M  ZZC  16 6a
M  ZZC  17 6b
M  ZZC  18 9a
M  ZZC  19 9b
M  ZZC  20 9c
M  ZZC  21 11a
M  ZZC  22 11b
M  ZZC  23 8a
M  ZZC  24 8b
M  ZZC  25 8c
M  END
$$$$

##END=$$ End of the structure block
##TITLE=$$ Begin of the peaks block
##JCAMP-DX=5.00 $$ ACD/Spectrus 2012 v 14.01
##ORIGIN=
##OWNER=
##BLOCK_ID=2
##DATA TYPE=INFRARED SPECTRUM
##DATA CLASS=PEAK TABLE
##NPOINTS=19
##FIRSTX=802.39404297
##LASTX=3086.13085938
##MAXX=82.11556244
##MINX=0.87196600
##MAXY=0.00000000
##MINY=0.00000000
##XFACTOR=1.0000000000
##YFACTOR=1.000000000000000
##FIRSTY=70.33013153
##XUNITS=1/CM
##YUNITS=TRANSMITTANCE
##PEAK TABLE=(XY..XY)
802.39404, 70.3301
900.28223, 27.1702
1057.96423, 55.5555
1111.00708, 34.6821
1142.83276, 62.8926
1247.47192, 50.4163
1367.05945, 29.3496
1434.5686, 31.1354
1450.96362, 34.3923
1645.29346, 33.1941
1676.15479, 0.872
2171.8645, 82.1156
2854.6709, 56.5426
2886.97876, 42.8044
2923.62671, 32.2641
2953.04126, 40.82
2970.88306, 38.0867
3022.96143, 65.476
3086.13086, 62.4927
##END=$$ End of the peaks block
##TITLE=$$ Begin of the data block
##JCAMP-DX=5.00 $$ ACD/Spectrus 2012 v 14.01
##BLOCK_ID=3
##DATE=14 May 2012 17:07:54
##DATA TYPE=INFRARED SPECTRUM
##DATA CLASS=XYDATA
##ORIGIN=
##OWNER=
##NPOINTS=7053
##FIRSTX=599.86669922
##LASTX=4000.39697266
##MAXX=4000.39697266
##MINX=599.86669922
##MAXY=86.17054749
##MINY=0.87196600
##XFACTOR=1.0000000000
##YFACTOR=0.000000100000000
##FIRSTY=45.63120651
##DELTAX=0.48220792
##XUNITS=1/CM
##YUNITS=TRANSMITTANCE
##XYDATA=(X++(Y..Y))
599.9D56312065Q594475j696167l831558J1495437Q442993j474647O456146K121659
$$ 456312065 464906540 463210373 459378815 470874252 479317245 477842598 484298744 486420403
603.7D86420403j824036n463028N89065P941857K35252Q469925Q512154k120018M551315
$$ 486420403 484596367 479133339 479722404 487664261 487899513 496369438 504881592 502761574 507312889
608.1E07312889N369263k970352r206581O179771J0149689M868965K836342O75811
$$ 507312889 512682152 509711800 500505219 506684990 516834679 521703644 524539986 525215797
611.9E25215797J705246l026504n335961K799912J1199493J0627861R41697l083382
$$ 525215797 526921043 523894539 518558578 521358490 532557983 543185844 544127541 541044159
615.8E41044159N533829L463211O97593M904671N261841M901276M412613m62838l565941
$$ 541044159 546577988 550041199 550738792 555643463 560905304 565806580 570219193 569756355 566190414
620.1E66190414J977158o333504l967247M747277P106590J695709k104950m809074
$$ 566190414 568167572 561834068 557866821 562614098 569720688 571416397 569311447 564502373
624E64502373L453788J2127190Q447266k753334j278458j714973J823082J943397r02405
$$ 564502373 567956161 580083351 588530617 585777283 584498825 582783852 584606934 586550331 585647926
628.3E85647926L307572O144485O049309j815491N617867J868400o018028L434181
$$ 585647926 588955498 595099983 601149292 599333801 604951668 606820068 600802040 604236221
632.2F04236221L966828K698211j774978j590538L681106P398987Q980560K186699
$$ 604236221 608203049 610901260 609126282 607535744 611216850 618615837 627596397 629783096
636F29783096j139564Q57429K041741l11775J976394N260925L3684n725288J467285
$$ 629783096 628643532 629500961 631542702 631230927 633207321 638468246 638501930 632776642 634243927
640.4F34243927O230011J0288696J990891k785187J488266J895065J39618k809295
$$ 634243927 640473938 650762634 652753525 649968338 651456604 653351669 653491287 650681992
644.2F50681992k808075N804519J0495453Q482361N721741j565705n940628k783966
$$ 650681992 647873917 653678436 664173889 672656250 678377991 676812286 670871658 668087692
648.1F68087692l757553P649613L450088j644287L289566N073929k849121m480667
$$ 668087692 664330139 671979752 675429840 673785553 677075119 682149048 679299927 674819260
651.9F74819260R906234Q039551P92465m044036l327027q138428O813431J1165161
$$ 674819260 684725494 692765045 693557510 689513474 686186447 678048019 684861450 696026611
655.8F96026611K432480j441574J949234L62702l987809k744598L534393L033066L863907
$$ 696026611 698459091 697017517 698966751 699329453 695341644 692597046 696131439 699164505 703028412
660.1G03028412l151779J377411K235031L661194O535491J30005l94744Q22296n695877
$$ 703028412 699876633 701254044 703489075 707150269 713685760 713815765 713421021 714243317 708547440
664.5G08547440l38440K333603Q852920L097153j4420090k6061325q3870659L0677643
$$ 708547440 708209000 710542603 719395523 722492676 708072586 682011261 598140602 628818245
668.3F28818245L8431663K8725205J3454971K285080N404053K240448m94080N629120
$$ 628818245 667249908 695975113 709430084 711715164 717119217 719359665 718865585 724494705
672.2G24494705p806778j2468719k572785o05697O578140N044098o639099p626496
$$ 724494705 716687927 704219208 701646423 701040726 707618866 712662964 706023865 698397369
676.1F98397369K943039m767685p099990M393920m10385j3535614L76892J2335511
$$ 698397369 701340408 696572723 689472733 693866653 693456268 679920654 680297546 692633057
679.9F92633057L121261L62244J458740l057403n613251R189758R533615K267533R127578
$$ 692633057 695754318 696116562 697575302 694517899 688904648 698094406 707628021 709895554 719023132
684.3G19023132R074250M521408j521149M97360m353332K886123P161332L595047J910171
$$ 719023132 728097382 732618790 731097641 731595001 727241669 730127792 737289124 740884171 742794342
688.6G42794342k281189J376343n513992K678146o24008m561081J766281R7122m791870
$$ 742794342 740513153 741889496 736375504 739053650 738429642 733868561 735634842 735731964 730940094
692.9G30940094m065323N040894O976700M06799k996979J433487q479004j4612732
$$ 730940094 726874771 731915665 738892365 739299164 736302185 737735672 729256668 714643936
696.8G14643936K199173Q892517k613449n607300n996017o42471k695084j0074005
$$ 714643936 716843109 725735626 723122177 717514877 711518860 710876389 708181305 698107300
700.6F98107300K167434J359864l953324m726181n587158Q26645Q106766L869629M636306
$$ 698107300 700274734 701634598 697681274 692955093 687367935 688194580 696301346 700170975 704807281
705G04807281l432464j6785N359497N813752K067184J415863Q147278M083023j971588
$$ 704807281 701374817 701358032 706717529 712531281 714598465 716014328 724161606 728244629 726273041
709.3G26273041Q642044P873535M189911J950455K627792L757706M616241r079M575806
$$ 726273041 734915085 742788620 746978531 748928986 751556778 755314484 759930725 759921646 764497452
713.7G64497452J2249603R93805l674850L650207M512024R74960l561706l384400M753113
$$ 764497452 776747055 777740860 774066010 777716217 782228241 783203201 779641495 776257095 781010208
718G81010208O815567k873154k218856j29700P02591P480469M614792p57676n000610
$$ 781010208 787825775 784952621 782733765 782604065 783306656 790787125 795401917 794644241 789643631
722.3G89643631k62146P54242K485351j203765k893219L778534R194564N72892l760453
$$ 789643631 789381485 790135727 792621078 791417313 788524094 792302628 801497192 802070084 798309631
726.7G98309631L903275N77545p33490M74701J355667L186417M25949J104278P824021
$$ 798309631 802212906 802790451 802056961 802531662 803887329 807073746 807499695 808603973 816427994
731H16427994O213608k218476k39639k867203m000015N273590O817551M011535R66034
$$ 816427994 822641602 820423126 820183487 817316284 813316269 818589859 825407410 829418945 830384979
735.4H30384979K079468J764221n254440j0864182q74633K452774p64008P421417M665985
$$ 830384979 832464447 834228668 828974228 818110046 817235413 819688187 818924179 826345596 831011581
739.7H31011581j386718k04926Q85697m116440l91617M862137O626358N774536L375931
$$ 831011581 829624863 829419937 830305634 826189194 825797577 830659714 837286072 843060608 846436539
744H46436539m821396q040009j462860J121979o62232L827286Q990555K75803o306610
$$ 846436539 841615143 833575134 832112274 833234253 832572021 836399307 845389862 845665665 839359055
748.4H39359055M292755L980484J249923J556168p270813q657761l41720N386734L652572
$$ 839359055 843651810 847632294 848882217 850438385 843167572 834509811 834168091 839554825 843207397
752.7H43207397L345108r625244k451553P685318M137650K477417j281968k051773
$$ 843207397 846552505 836927261 834475708 842161026 846298676 848776093 847494125 845442352
756.6H45442352O21338k982635O5994M163742J762161m343872l303375J62811P570420
$$ 845442352 846063690 843081055 843147049 847310791 849072952 844729080 841425705 841588516 849158936
760.9H49158936J965332J109848J759262J158752N668793Q84552j0625458j242218
$$ 849158936 851124268 852234116 853993378 855152130 860820923 861705475 851080017 849837799
764.8H49837799M666824k49099j328430j308518j028824k51770M785309k636871m501801
$$ 849837799 854504623 854255524 852927094 851618576 850589752 850337982 855123291 852486420 847984619
769.1H47984619j170578j834640L048477L313751m678345q22372M613724K960205m060898
$$ 847984619 846814041 844979401 848027878 851341629 846663284 845840912 850454636 853414841 849353943
773.5H49353943m963837P96280J252442P826843K566604o687164n64346M784851K027130
$$ 849353943 844390106 845186386 846438828 854265671 856832275 850145111 849580765 854365616 856392746
777.8H56392746j088562o768875l747025N413285j766739k051544O690826J200561
$$ 856392746 855304184 848535309 844788284 850201569 848434830 846383286 853074112 854274673
781.7H54274673l200531k834320j945419k456055M50287P318268l06473L789444J206513
$$ 854274673 851074142 848239822 846294403 843838348 844288635 851606903 851300430 855089874 856296387
786H56296387o131592K014465m950027n449906M259644K210770o080704k239075O36826
$$ 856296387 850164795 852179260 847229233 841779327 846038971 848249741 842169037 839929962 840566788
790.3H40566788m592819m150239j362228O090851l387146r002152m753646o995850
$$ 840566788 835973969 831823730 830461502 836552353 833165207 824163055 819409409 812413559
794.2H12413559j060104l394089n492401j0718613j0814743J014709q037796j4594726
$$ 812413559 811353455 807959366 802466965 791748352 780933609 781948318 773910522 759315796
798.1G59315796j8191834o107788k384338r549942j5131378j1264344L331681L40805
$$ 759315796 741123962 735016174 732631836 723081894 707950516 696686172 700017853 700358658
801.9G00358658K942657J696930k214584P506637J1247406P536698P517624O609726
$$ 700358658 703301315 704998245 702783661 710290298 721537704 729074402 736592026 743201752
805.8G43201752k13318k475891P809219J3745957P403564K68021O937332K089996m70047
$$ 743201752 742988434 740512543 748321762 762067719 769471283 769739304 776676636 778766632 778296585
810.1G78296585J4229508J0380783K270584P224426N394058K907410J347885m1046
$$ 778296585 792526093 802906876 805177460 812401886 817795944 820703354 822051239 822010193
814H22010193l156052J205750O188278K234726P638321R296951m071655p61185K668305
$$ 822010193 818854141 820059891 826248169 828482895 836121216 845418167 841346512 840585327 843253632
818.3H43253632L23791o57043J980362J227951k476426K56501M566650j493301M14200
$$ 843253632 843577423 842920380 844900742 846128693 843652267 843908768 848475418 846982117 847396317
822.6H47396317M430236K756958k279434p165451Q69675Q043136r37500j471176K490082
$$ 847396317 851826553 854583511 852304077 845138626 846008301 854051437 853113937 851642761 854132843
827H54132843K981644Q52050R86939o394501q022766j621323k130508J129227J1384659
$$ 854132843 857114487 857966537 858953476 852558975 844536209 842914886 840784378 841913605 853298264
831.3H53298264M135208J760254N48095j0331955j559524O002960l546829k833863
$$ 853298264 857433472 859193726 859741821 849409866 847850342 853853302 850306473 847472610
835.2H47472610j059799N214539N358505k306671l793640k817993r70002J0085450
$$ 847472610 846412811 851627350 856985855 854679184 850885544 848067551 847097549 857182999
839H57182999J132660j1268692n804215L634262J180344k577133r90067j558914L330078
$$ 857182999 858315659 847046967 841242752 844877014 846057358 843480225 842490158 840931244 844261322
843.4H44261322J905975j227035j116562J358719O529770j032105l348999l08761m150315
$$ 844261322 846167297 844940262 843823700 845182419 851712189 850680084 847331085 847022324 842872009
847.7H42872009N651932M761505m861984j871414j068955j576767k724304k144470
$$ 842872009 848523941 853285446 848423462 846552048 845483093 843906326 841182022 839037552
851.6H39037552m020462l438873m736329L507767L085480o270676o898727L872833
$$ 839037552 835017090 831578217 826841888 830349655 833435135 827164459 820265732 824138565
855.4H24138565N095444p83234K664871J076584l283310l960952J419601k576904o174317
$$ 824138565 829234009 828450775 831115646 832192230 828908920 824947968 826367569 823790665 817616348
859.8H17616348J723633N262451o3781P75527J531678o371918o01196k380905n754776
$$ 817616348 819339981 824602432 824538651 825314178 826845856 820473938 819872742 817491837 811737061
864.1H11737061p09763M137344O95267q969421m558564j362075o180191k041703j47781
$$ 811737061 811027298 815164642 815859909 806890488 802331924 800969849 794789658 792747955 792600174
868.5G92600174j403885n986252j391830J803894l187103m357529k729187m419937
$$ 792600174 791196289 785210037 783818207 785622101 782434998 778077469 775348282 770928345
872.3G70928345P82623k242889r506455j0918274o715011o14243q870926j8946457
$$ 770928345 771710968 769468079 759961624 749043350 742328339 741714096 732843170 713896713
876.2G13896713n749359p155380j5770798q983688n914459j2220002j9256706k1966286
$$ 713896713 708147354 700991974 685221176 676237488 670323029 658103027 638846321 616880035
880F16880035j4096946j2047043j7262993j5500984j8907356k0749207j6244659j6196557
$$ 616880035 602783089 590736046 573473053 557972069 539064713 518315506 502070847 485874290
883.9D85874290j9023208j9861946j4185601p465629j4839897k1132126q972397j564751
$$ 485874290 466851082 446989136 432803535 425337906 410498009 389365883 380393486 378828735
887.7C78828735j4380874j7136078j3447533j3867397o833668n797958p224312n041924
$$ 378828735 364447861 347311783 333864250 319996853 313163185 307365227 300140915 295098991
891.6B95098991o805286o261597j109104r14421J382065L792572p77512n641594j98040
$$ 295098991 288293705 282032108 280923004 280008583 281390648 285183220 284405708 278764114 278566074
895.9B78566074J00842m126816l083668P61986K441216j131840J582680l34168l073940
$$ 278566074 278666916 274540100 271456432 272218418 274659634 273527794 275110474 274776306 271702366
900.3B71702366M339275L599015J332740P317906J1305408Q580456N037842J0527553
$$ 271702366 276041641 279640656 280973396 288291302 299596710 308177166 313215008 323742561
904.1C23742561J3411332J1346778R534188J3325119J5131073J0663795J5932579K0001831
$$ 323742561 337153893 348500671 358034859 371359978 386491051 397154846 413087425 433089256
908D33089256J4331169J3879929J4704971J7043190J1092301M777298J6716461J6204452
$$ 433089256 447420425 461300354 476005325 493048515 504140816 508918114 525634575 541839027
911.9E41839027J2356263J5860061J3340607J8417396J6287690R028549J0468368J1896820
$$ 541839027 554195290 570055351 583395958 601813354 618101044 627129593 637597961 649494781
915.7F49494781N596390O638642P402649R544601P331161Q461533J3880615N014191
$$ 649494781 655091171 661729813 669132462 678677063 686008224 694469757 708350372 713364563
919.6G13364563j295242R424514R286118N598068K085953J372375M306641O319580
$$ 713364563 712069321 721493835 730779953 736378021 738463974 739836349 744142990 750462570
923.4G50462570L304062l02734L743820N938339L718567M760819m330674M402848J0195617
$$ 750462570 753766632 753463898 757207718 763146057 766864624 771625443 767294769 771697617 781893234
927.8G81893234K613144K699738K492141J000138L765487j694641K487717N335236
$$ 781893234 784506378 787206116 789698257 790698395 794463882 792769241 795256958 800592194
931.6H00592194M436416j870575q71353J323547K912598k343826K143707j389999M90112
$$ 800592194 805028610 803158035 802286682 803610229 806522827 804179001 806322708 804932709 805422821
936H05422821P70187j041717J227417O593857K168197K522736r03092J516037N989380
$$ 805422821 806193008 805151291 806378708 812972565 815140762 817663498 816760406 818276443 824265823
940.3H24265823Q97217m474716j349106K361908J911621n146332l4332M822464j479034
$$ 824265823 825163040 820688324 819339218 821701126 823612747 818466415 818432083 823254547 821775513
944.6H21775513J547317j035690J143036Q394470j587830j562194k495881k469177
$$ 821775513 823322830 822287140 823430176 831824646 830236816 828674622 826178741 823709564
948.5H23709564K303620j68991J392974J819077k833786J168823J631165o339493j1426010
$$ 823709564 826013184 825844193 827237167 829056244 826222458 827391281 829022446 822682953 811256943
952.8H11256943n923767j205445N663987l524476p574310n316238l117371m054260
$$ 811256943 805333176 804127731 809791718 806267242 798692932 793376694 790259323 786205063
956.7G86205063o960449n526581m130402p527771q483047q814698m303512L893204
$$ 786205063 779244614 773718033 769587631 762059860 753576813 744762115 740458603 744351807
960.6G44351807K501449L867264P725830Q578720J0598526N240326O927033M981384
$$ 744351807 746853256 750720520 758446350 767025070 777623596 782863922 789790955 794772339
964.4G94772339Q69064L332901R83963L862686O135025K978669K496185N130997J841964
$$ 794772339 795641403 798974304 799958267 803820953 809955978 812934647 815430832 820561829 822403793
968.8H22403793k880401r68781P03201K190934N662079N24063k533112k447052m886627
$$ 822403793 819523392 818554611 819257812 821448746 827110825 827634888 825101776 822654724 817768097
973.1H17768097l8529M78364K135696L419037j274948m016953l263702j414414j261520
$$ 817768097 817729568 818207932 820343628 823762665 822487717 818470764 815207062 813792648 812531128
977.4H12531128N2185M00009M99573p33109l047332m471970k893829J784515k036514
$$ 812531128 812583313 812983322 813482895 812749786 809702454 805230484 802336655 804121170 802084656
981.8H02084656q84323j352082l229446l226318L2043J451874m504318m950028j440124
$$ 802084656 801200333 799848251 796618805 793392487 793424530 794876404 790372086 785422058 783981934
986.1G83981934j221543l666076k665711j306000j335525m536820o822204j995163
$$ 783981934 782760391 779094315 776428604 775122604 773787079 769250259 762428055 760432892
990G60432892L441009m18930l346252j613083j937561l236923l162766M72031O90765
$$ 760432892 763873901 763454971 760108719 758495636 756558075 753321152 750158386 750630417 751321182
994.3G51321182j858825m486237k314911l137283K88009K339096l638458j217270J23902
$$ 751321182 749462357 744976120 742661209 739523926 739811935 742151031 738512573 737295303 737419205
998.7G37419205L617172J59836J242904K323456l467407o59714L532563q7891J771622
$$ 737419205 741036377 741196213 742439117 744762573 741295166 740635452 744168015 744080124 745851746
1003G45851746J561203Q81424j236878r96399J600800J130981j553192r98993J047592
$$ 745851746 747412949 748294373 747057495 746061096 747661896 748792877 747239685 746240692 747288284
1007.3G47288284J210327j593627M675903K529526l348618k17514N03922j783982l117370
$$ 747288284 748498611 746904984 751580887 754110413 750761795 750544281 751048203 749264221 746146851
1011.7G46146851j263199k44065k396316M00772l440247k236404O85806m08630K653580
$$ 746146851 744883652 744639587 742243271 742644043 739203796 736967392 737653198 737244568 739898148
1016G39898148J152496J078644J31836K535247J322251m01535r71070j247711n560150
$$ 739898148 741050644 742129288 742261124 744796371 746118622 745717087 744746017 743498306 737938156
1020.4G37938156j745911j32522m515228j215287k559356l731156m488373l469543
$$ 737938156 736192245 736059723 731544495 730329208 727769852 724038696 719550323 716080780
1024.2G16080780k760773j746063k905579p196960n324860l424453l064957P16248
$$ 716080780 713320007 711573944 708668365 701471405 696146545 692722092 689657135 690373383
1028.1F90373383J105117K565461j973420q40149L369828r16J286469J673736q54263
$$ 690373383 691478500 694043961 692070541 691230392 694600220 694599304 695885773 697559509 696705246
1032.4F96705246J235657K699661k854080k782746M810105R33990j0871811k940826
$$ 696705246 697940903 700640564 697786484 695003738 699813843 700747833 689876022 686935196
1036.3F86935196O46744L292846M568406L16543O59790N504303J657715j370697k897415
$$ 686935196 687581940 690874786 695443192 695759735 696419525 701923828 703581543 702210846 699313431
1040.6F99313431n854950n459061k614059l832932j0604934p033921J36566l432083
$$ 699313431 693458481 687999420 685385361 681552429 670947495 663913574 664050140 660618057
1044.5F60618057r877777q846817p28073O53992o387215n254631K328682P692528M106750
$$ 660618057 650740280 641893463 641165390 641819382 635432167 630177536 632506218 640198746 644305496
1048.8F44305496J028290L563309O261291o33468j586533k475204l565445J034240
$$ 644305496 645333786 648897095 655158386 654524918 652938385 650463181 646897736 647931976
1052.7F47931976l241195r530716q610421q690261j0959320j3482628j3663597r770890
$$ 647931976 644690781 635160065 626549644 617859383 606900063 593417435 579753838 569982948
1056.5E69982948o711616n630150k086144K141495M234925P144012N620499P404747
$$ 569982948 563271332 557641182 555555038 557696533 561931458 569075470 574695969 582100716
1060.4E82100716R058265M950257J872024M305763P229615L435402K999725Q994255
$$ 582100716 591158981 596109238 597981262 602287025 609516640 612952042 615951767 624946022
1064.2F24946022L929482O758461J0846977Q839950J2001038J6677399J2137298N710373
$$ 624946022 628875504 635633965 646480942 655320892 667321930 683999329 696136627 701847000
1068.1G01847000J0854721J2439423K703781M875183N669937L881302M347687M482651
$$ 701847000 712701721 725141144 727844925 732720108 738390045 742271347 746619034 751101685
1071.9G51101685K330627L405609N334702O5155m203110N348663M291306k787323j571427
$$ 751101685 753432312 756837921 762172623 762237778 758034668 763383331 767674637 764887314 763315887
1076.3G63315887p59811J587143M810104q54339K22320j278839j15509J97373j980744
$$ 763315887 762556076 764143219 768953323 768098984 768321304 767042465 766926956 767124329 765143585
1080.6G65143585l18908K409362j134262K342148N322495m79737q575668o631775k028885
$$ 765143585 764824677 767234039 766099777 768441925 773764420 773284683 764709015 758077240 756048355
1085G56048355K654953N23224m695663l621827k221298n057831l180465n906372m710007
$$ 756048355 758703308 759226532 754530869 750909042 748687744 743629913 740449448 734543076 729833069
1089.3G29833069l058624n210877k570419j411820k678451l568268R01718o015625
$$ 729833069 726774445 721563568 718993149 717581329 714902878 711334610 712236328 706220703
1093.2G06220703r791946o725998k295532l520279r173813q259049r156112r906388
$$ 706220703 696428757 689702759 687407227 683886948 674713135 666454086 657297974 647391586
1097F47391586q043136r495507j1243095j3265381j1802177j2379494j1654015j7142410
$$ 647391586 639348450 629852943 618609848 605344467 593542290 581162796 569508781 552366371
1100.9E52366371j6763115q004913n632897q239784j4988937j1939507j0447044j0067520
$$ 552366371 535603256 527598343 521965446 513725662 498736725 486797218 476350174 466282654
1104.7D66282654j1303215j1835594j3530732j2157402r834213q642120j0375328r659996
$$ 466282654 454979439 443143845 429613113 417455711 407621498 398979378 388604050 378944054
1108.6C78944054r189415j0182267o432876m498787j819954L287430O286468P066117
$$ 378944054 369754639 359572372 353139496 348640709 346820755 350108185 356394653 363460770
1112.5C63460770J4515571J7428360J3462181J3581696J5658646J8262939J8253593
$$ 363460770 377976341 395404701 408866882 422448578 438107224 456370163 474623756
1115.8D74623756J4274102J1204567J1766471J3323861J6566238J3066406J0981827
$$ 474623756 488897858 500102425 511868896 525192757 541758995 554825401 565807228
1119.2E65807228J3972511J7219506J5322075J3938140J1673470J1266365J1320267
$$ 565807228 579779739 596999245 612321320 626259460 637932930 649199295 660519562
1122.6F60519562R874420R953384R292603R628601P791748L184128M717636N500870
$$ 660519562 670393982 680347366 689639969 699268570 707060318 710244446 714962082 720462952
1126.4G20462952K112960K617951M283447K632828K2201J092453K145691K415848L160629
$$ 720462952 722575912 725193863 729477310 732110138 732132339 733224792 735370483 737786331 740946960
1130.8G40946960J469422r20334j989975q75473k10037j966172J891633l057328p718200
$$ 740946960 742416382 741496048 739506073 738630600 738420563 736454391 738346024 735288696 727570496
1135.1G27570496k962342r07898p770919j0065384o675797l516159p609100j3062821
$$ 727570496 724608154 723700256 715929337 705863953 699188156 695671997 688062897 675000076
1139F75000076r192581q265076p722473k164764n838318o403580k915497l571624K532234
$$ 675000076 665807495 657542419 649819946 647655182 641816864 635413284 632497787 628926163 631458397
1143.3F31458397P403221L951492M765931Q029632J1070175R773178N046692P735749
$$ 631458397 638861618 642813110 647579041 655608673 666678848 676452026 681498718 689234467
1147.2F89234467R962921Q333969M859466K608567M039993Q287964M547195M747315
$$ 689234467 699197388 707531357 712390823 714999390 719039383 727327347 731874542 736621857
1151G36621857M357681R25446K330169L373184K663956j70441J932221O383133O222839
$$ 736621857 740979538 741904984 744235153 747608337 750272293 750101852 752034073 758417206 764640045
1155.4G64640045Q15048K587891M476166K38418K722016L837433J674423J486664M534225
$$ 764640045 765455093 768042984 772519150 772757568 775479584 779317017 780991440 782478104 787012329
1159.7G87012329K090988m52575L904800K390594J36109K138138M8065K70538L110962
$$ 787012329 789103317 788650742 792555542 794946136 795082245 797220383 797268448 797538986 800649948
1164.1H00649948P89261J517334J708984L51410o10733M01993j711655J81351M643173
$$ 800649948 801439209 802956543 804665527 805016937 804406204 804808197 803096542 803277893 807921066
1168.4H07921066L883362p20291J643600J420746M3183j625367p58667o54449r4910
$$ 807921066 811804428 811084137 812727737 814148483 814191666 812566299 811807632 811153183 811058273
1172.7H11058273L852997K04315k887878l424988Q5449M345627M113922O69556j791611
$$ 811058273 814911270 815115585 812227707 808802719 808888168 813233795 817347717 818017273 816225662
1177.1H16225662l461609k23312M78058J54037M284058j537170L76434K107467p42568
$$ 816225662 812764053 812540741 813018799 813172836 817456894 815919724 816296158 818403625 817661057
1181.4H17661057l300553J199341L182297J023636m204102j447144J033478l52401
$$ 817661057 814360504 815559845 818742142 819765778 815561676 814114532 815148010 814795609
1185.3H14795609j4878o99997r71603K185745j27563j721650K333832N46112j344680
$$ 814795609 814780731 814080734 813109131 815294876 815167313 813445663 815779495 816325607 814980927
1189.6H14980927o51474o08750r78088o72760p61338J31226Q07190j327209m373932
$$ 814980927 814329453 813720703 812742615 812069855 811308517 811439743 812246933 810919724 806545792
1193.9H06545792l14713O89011n09415J486588Q45260k451935n4702j421128l758239
$$ 806545792 806231079 806920090 806410675 807897263 808742523 806290588 806235886 804814758 801056519
1198.3H01056519k909928r38568n04455k749558l589401M82559l465729o184006l199234
$$ 801056519 798146591 797208023 796703568 793954010 790364609 790847168 787381439 781197433 777998199
1202.6G77998199k402725l953857l831787j948395j126480k790680L23639K80685j978836
$$ 777998199 775595474 771641617 767809830 765861435 764734955 761944275 762267914 762548599 760569763
1207G60569763K65579n79605O9275J880264L798752K632599O4545K595215J609420
$$ 760569763 760835342 760255737 760325012 762205276 766004028 768636627 768701172 771296387 772905807
1211.3G72905807j471557o30951K317047M002380K381669J402282P95975q4457J548004
$$ 772905807 771434250 770803299 773120346 777122726 779504395 780906677 781702652 781618195 783166199
1215.6G83166199K178344l77426o57425j377105L25317L951263K046128o06919j269226
$$ 783166199 785344543 784967117 784309692 782932587 783257904 787209167 789255295 788648376 787379150
1220G87379150O73981L47138P16323J38855M24652N32914L14254k844085k397995q8425
$$ 787379150 788053131 788400269 789116592 789255447 789680099 790213013 790527267 787683182 785285187 785196762
1224.8G85196762j921158l636856k593002m188233k220459q83636k443848k607727
$$ 785196762 783275604 779638748 777045746 772857513 770637054 769753418 767309570 764701843
1228.7G64701843j927719k869339l471374l656922n469589n735626o517639p206803
$$ 764701843 762774124 759904785 756433411 752776489 747306900 741571274 735053635 727846832
1232.5G27846832p427749p548981p738495j1137695j0735779q386993m636155k883758
$$ 727846832 720419083 712870102 705131607 693993912 683258133 674871140 670234985 667351227
1236.4F67351227n299912n935363o006699n233841k498016l840332o581574o153946
$$ 667351227 662051315 656115952 650109253 644875412 642377396 638537064 631955490 625801544
1240.2F25801544o423340q588676q117561q651886j2726479j1817970j0428849j0166740
$$ 625801544 619378204 610789528 602671967 594020081 581293602 569475632 559046783 548880043
1244.1E48880043j0531807j1782150j0027275q096733l626252J45417p98035J160393
$$ 548880043 538348236 526566086 516538811 508442078 504815826 504961243 504163208 505323601
1248E05323601M420433O820030R923286J3084450J1175308J0968628J4109116Q475609
$$ 505323601 509744034 516564064 526487350 539571800 550747108 561715736 575824852 584300461
1251.8E84300461Q557167R856949Q246498N073776O174927Q819427N816307K210427
$$ 584300461 592857628 602714577 610961075 616034851 622209778 631029205 636845512 639055939
1255.7F39055939M417495R964219Q681945M164658N435104Q792420O522751M948043
$$ 639055939 643473434 653437653 662119598 666284256 671719360 680511780 687034531 691982574
1259.5F91982574L907624N51605P30972K961884J566772j81350k502060m490128k863846
$$ 691982574 695890198 696441803 697172775 700134659 701701431 701520081 699018021 694527893 691664047
1263.9F91664047k791824k459564l036805k604217l83606p85904M62113K282180K860871
$$ 691664047 688872223 686412659 683375854 680771637 680388031 679602127 680064240 682346420 685207291
1268.2F85207291K931594M730912N770569O077575O015854M744950P467269O462937
$$ 685207291 688138885 692869797 698640366 704717941 710733795 715478745 722946014 729408951
1272.1G29408951N723800O154786M984436K693176M226761N952301J887359J702042
$$ 729408951 735132751 741287537 746271973 748965149 753191910 759144211 761031570 762733612
1275.9G62733612M859848M107132O07681k42157j5182p24487K339935J546402k066879
$$ 762733612 767593460 771700592 772308273 772066116 772050934 771326447 773666382 775212784 773145905
1280.3G73145905j204377q54263P06177K40021l873291k424393j570053n76401p69882
$$ 773145905 771941528 771087265 771793442 772033463 768160172 765735779 764165726 763589325 762819443
1284.6G62819443j857834j612625j173630L85513j812973k648773r96323J174088J013947
$$ 762819443 760961609 759348984 758175354 758560867 756747894 754099121 753102798 754276886 755290833
1288.9G55290833k001801K68402k7161K230225J463471M04434J41601k18811j178741
$$ 755290833 753289032 753557434 753530273 755760498 757223969 757628403 757770004 757551193 756372452
1293.3G56372452r80606j517411r67712j771317m31594q03070k08970k390899k703247
$$ 756372452 755391846 753874435 752906723 751135406 750703812 749900742 749691772 747300873 744597626
1297.6G44597626K369766J165848j894684o19507N44205m65698K507629R10873k54669
$$ 744597626 746967392 748133240 746238556 745619049 746163254 745697556 748205185 749116058 748861389
1302G48861389j607590l48663Q21381N16967J004792r58252J554642L777847L22799
$$ 748861389 747253799 746905136 747726517 748243484 749248276 748290024 749844666 753622513 753945312
1306.3G53945312j637878N1193M079209L746795p08389J406479K818451k094422m76455
$$ 753945312 752307434 752358627 756437836 760184631 759476242 760882721 763701172 761606750 761130295
1310.6G61130295J291351K61688K524720J926727l881836k128525n75638l60031k70462
$$ 761130295 762421646 762683334 765208054 767134781 763252945 761124420 760548782 760188751 759918289
1315G59918289j91650k50473j594391j824951j588898j095734m508056j256562N26505
$$ 759918289 759726639 759476166 757881775 756056824 754467926 753372192 748864136 747607574 748134079
1319.3G48134079m252930n298691k969131k318954k248917m141998m440995m571685
$$ 748134079 743881149 738582458 735613327 733294373 731045456 726903458 722462463 717890778
1323.2G17890778o527100o104431n936890n831909o800461q022613o395722m275131
$$ 717890778 711363678 705259247 699322357 693490448 686689987 678667374 672271652 667996521
1327F67996521L29132J155624R2469O31332K601166M549332L911895M338074M309540
$$ 667996521 668325653 669481277 669573746 670205078 672806244 677355576 681267471 685605545 689915085
1331.4F89915085K472687L837814M804993J721725J692200L294983k79846q41446J534729
$$ 689915085 692387772 696225586 701030579 702752304 704444504 707739487 707459641 706618195 708152924
1335.7G08152924j748429l475647J20850j730881k268677r23614k400818m235535l977050
$$ 708152924 706404495 702928848 703049698 701318817 699050140 698126526 695725708 691490173 687513123
1340.1F87513123j782914J744690k127151o014557n770187l222580l845826m393463
$$ 687513123 685730209 687474899 685347748 679333191 673563004 670340424 666494598 662101135
1343.9F62101135n075149l553086n014953p930222n451011n723076p900162o241875
$$ 662101135 657025986 653472900 648457947 640527725 635076714 629353638 621453476 615211601
1347.8F15211601m964905m583053n772247m723092m155921o048966p667732o483383
$$ 615211601 610246696 605663643 599891396 595168304 591012383 584963417 577295685 570812302
1351.6E70812302o113243q940011q577117o572838r635239j0564804j0129967q724060
$$ 570812302 564699059 555759048 547181931 540609093 530973854 520409050 510279083 501555023
1355.5E01555023r627800j1709251j0786972j1805687j4657936j3230782q470993j0604324
$$ 501555023 491927223 480217972 469431000 457625313 442967377 429736595 421265602 410661278
1359.3D10661278j2398606j0444450r494781j4013329j1358795p038002o752854r654197
$$ 410661278 398262672 387818222 378323441 364310112 352951317 345913315 339160461 329506264
1363.2C29506264j0283337p607613p475738m791565k628193j970634j130505j22280
$$ 329506264 319222927 311615314 304139576 299348011 296719818 294749184 293618679 293496399
1367.1B93496399P26929J800289J319866J476326L228970K442474L112888M745884
$$ 293496399 294223328 296023617 297343483 298819809 302048779 304491253 307604141 312350025
1370.9C12350025N569554N841522N624275P410927O238937M239273M940262O219711
$$ 312350025 317919579 323761101 329385376 336796303 343035240 347274513 352214775 358434486
1374.8C58434486K997857K766532K244072J100655Q2703n913L828392M060783K815476
$$ 358434486 361432343 364198875 366442947 367543602 367626305 367620392 371448784 375509567 378325043
1379.1C78325043J487961J53770J509056K868996L521080L075523K241554N558472
$$ 378325043 379813004 379966774 381475830 384344826 387865906 390941429 393182983 398741455
1383C98741455O824646N558052P092819R461251Q736305R370308R976768J0999413
$$ 398741455 405566101 411124153 418216972 427678223 436414528 445784836 455761604 466761017
1386.8D66761017J3086090J0698929Q700180R474640J1104469J0851402R489785R348220
$$ 466761017 479847107 490546036 499246216 508720856 519825325 530676727 540166512 549514732
1390.7E49514732Q941765Q241959Q552055O831436O969147Q773422O675606O846352
$$ 549514732 558456497 566698456 575250511 582081947 589051094 597824516 604500122 611346474
1394.5F11346474M143715L532943K838288N329818M850045M677200M108238J443253
$$ 611346474 615490189 619023132 621861420 627191238 632041283 636718483 640826721 642269974
1398.4F42269974K71454k09656K903747K154007K14157R41544L82996R65423M05579
$$ 642269974 642541428 642331772 645235519 647389526 647603683 648545227 648928223 649893646 650299225
1402.7F50299225j190872Q90121J670838j912385m622421l70025k06223j465225n84717
$$ 650299225 649108353 649998474 651669312 649756927 645134506 644764481 644558258 643093033 642508316
1407.1F42508316k238159m695664k739868k7961l246270m708976m614144m687385n049210
$$ 642508316 640270157 635574493 632834625 632806664 629560394 624851418 620237274 615549889 610500679
1411.4F10500679o045418n866050n913544o077957n362511n950546p247391o759758
$$ 610500679 604455261 598589211 592675667 586597710 581235199 575284653 568037262 561277504
1415.3E61277504m875641l402367k556686j006012L582268K355652J909866J212120
$$ 561277504 556401863 552999496 550442810 549436798 553019066 555374718 557284584 558496704
1419.1E58496704J612511o14128o15006R99718p14340p30057k90756r10912m251022
$$ 558496704 560109215 559495087 558880081 559879799 559165459 558435402 558144646 557233734 552982712
1423.5E52982712q166809j1341400p636643q970909j1609154j2387962j2380028j2348213
$$ 552982712 544815903 533474503 525837860 516866951 505257797 492869835 480489807 468141594
1427.3D68141594j4853554j6208877j6695290j3755302j3734780k0705757j3146706
$$ 468141594 453288040 437079163 420383873 406628571 392893791 372188034 359041328
1430.7C59041328j2142753q945503r758873n968132j534958l618603n444317k74639
$$ 359041328 346898575 337953072 328194199 322226067 320691109 317072506 311628189 311353550
1434.6C11353550M266663K869052L433648R512100Q272514k440224M126549P726174
$$ 311353550 315620213 318489265 321922913 331435013 339707527 337267303 341393852 349120026
1438.4C49120026O603355M599304M755211N611153N195083N310822K702103L202514
$$ 349120026 355723381 360322685 365077896 370689049 375884132 381194954 383897057 387099571
1442.3C87099571M086647K669411l23830r1476p1716k633553l869667l565521l080979
$$ 387099571 391186218 393855629 393531799 393440323 393368607 390735054 386865387 383299866 380218887
1446.6C80218887m200821n431594r664154q874283j040001k599526k243919k041092
$$ 380218887 376018066 370586472 360922318 352048035 351008034 348408508 346164589 344123497
1450.5C44123497k00806M625206P873040R006271R565926J1172409J2689323J1191292
$$ 344123497 343922691 348547897 356420937 365427208 374993134 386165543 398854866 410046158
1454.3D10046158J1130256J4035874J2794609J0655861J9363212J3790360P107391
$$ 410046158 421176414 435212288 448006897 458662758 478025970 491816330 498923721
1457.7D98923721J0563736J2570496J0805931J0152588J1129799J1783180J0967369
$$ 498923721 509487457 522057953 532863884 543016472 554146271 565929451 576896820
1461.1E76896820R972496Q722344J1351203Q675271P342147P824364N193329Q592186
$$ 576896820 586869316 595591660 606942863 615618134 622960281 630784645 635977974 644570160
1464.9F44570160J0594788N170288N807037O407165N961228M191971M546966N133972
$$ 644570160 655164948 660335236 666142273 672549438 678510666 682702637 687249603 692383575
1468.8F92383575L532868M388885M035645N110855K761459M266587P315139J922150
$$ 692383575 695916443 700305328 704340973 709451828 712213287 716479874 723795013 725717163
1472.7G25717163K485123K255935J340027L407440J858826J610947R72519L029556
$$ 725717163 728202286 730458221 731798248 735205688 737064514 738675461 739647980 742677536
1476.5G42677536L550720M50211K143860K120437L60794K094498L182144K450943J654740
$$ 742677536 746228256 746678467 748822327 750942764 751303558 753398056 756580200 759031143 760685883
1480.9G60685883m13666M91028J640472J858521K457656O03486j121903K051163K781982
$$ 760685883 760272217 760763245 762403717 764262238 766719894 767323380 766201477 768252640 771034622
1485.2G71034622R47037j096649J951675K419510J564407m02450R07593L918991N92956
$$ 771034622 771981659 770885010 772836685 775256195 776820602 776418152 777325745 781244736 781837692
1489.5G81837692m409866Q99277J154251J835327O26449J726227J072693k482757j488953
$$ 781837692 777427826 778327103 779481354 781316681 781943130 783669357 784742050 782259293 780770340
1493.9G80770340L889770K551117M01764j520843n127564K991410L523483R27734p36160
$$ 780770340 784660110 787211227 787612991 786092148 780964584 783955994 787479477 788407211 787671051
1498.2G87671051k697449L20816L448029J511688m34036J343384O82983j341705K804031
$$ 787671051 784973602 785294418 788742447 790254135 789820099 791163483 791846466 790504761 793308792
1502.6G93308792j67465k256317K71683K761917K229080o023712m867630K549820n65110
$$ 793308792 793141327 790885010 791156693 793918610 796147690 790123978 785256348 787806168 787241058
1506.9G87241058Q206559m28238m749527J513977M411010k473373J90582K634049J04828
$$ 787241058 795447617 795019379 790269852 791783829 796194839 793721466 793912048 796546097 796650925
1511.2G96650925k803421l264008J539383N369492O34689j183548j870041k800369
$$ 796650925 793847504 790583496 792122879 797492371 798127060 796943512 795073471 792273102
1515.1G92273102J495056J663284J794129j582260o984711L331222M442902R33533
$$ 792273102 793768158 795431442 797225571 795643311 788658600 791989822 796432724 797366257
1519G97366257p80030m466400k817001M968338j971893N278625o92825l293534L059083
$$ 797366257 796586227 792119827 789302826 794271164 792299271 797577896 796885071 793591537 796650620
1523.3G96650620K481384J48315j124267o445389o34308N455017M43878l079071q11691
$$ 796650620 799132004 799280319 798156052 791710663 791076355 796531372 796975250 793896179 793084488
1527.6G93084488J854629P48139J603393P90940j834946O89163k23770k039413j965790
$$ 793084488 794939117 795687256 797290649 798081589 796246643 796935806 796712036 794672623 792706833
1532G92706833n08881j386413j206055Q32520K689361k48337j448593J323853K49023
$$ 792706833 792197952 790811539 789605484 790438004 793127365 792879028 791430435 792754288 793003311
1536.3G93003311p27997j824646J202927Q40454j677704J491089k367935p321167J676330
$$ 793003311 792275314 790450668 791653595 792494049 790816345 792307434 789939499 782618332 784294662
1540.7G84294662P198258j889420n190124M164352J576996P05795J378556l965607
$$ 784294662 791492920 789603500 784413376 788577728 790154724 790860519 792239075 788273468
1544.5G88273468n743713K873153L645020j015930O1569J027298J090088n68695m13437
$$ 788273468 782529755 785402908 789047928 788031998 788093567 789120865 790210953 789642258 789228821
1548.9G89228821k078781l314514k56196K152405m77752L51028K302399K835693j753769
$$ 789228821 787150040 783835526 783579330 785731735 785253983 785605011 787907410 790743103 788989334
1553.2G88989334l468017l790818K658005K207489K53754m502J232605K223282o189041
$$ 788989334 785521317 781730499 784388504 786595993 786849747 786845245 788077850 790301132 784112091
1557.5G84112091J211548N323486P99256m71726j7241669p089386J4468766M829864
$$ 784112091 785323639 790647125 791446381 790974655 773732986 766643600 781112366 785942230
1561.4G85942230R33838m76456L56141k96402j604691J72424o92062J845856K884292
$$ 785942230 786876068 786399612 786755753 786459351 784854660 785027084 784335022 786180878 789065170
1565.7G89065170j048355r55963Q29163o77414m53339k232284o96335k494126l093338
$$ 789065170 788016815 787060852 787890015 787212601 786759262 784526978 783830643 781336517 778243179
1570.1G78243179K049485J786422Q81882R2621j52359J47323m348J58615N23453m55933
$$ 778243179 780292664 782079086 782960968 783053589 782901230 783048553 783044205 783202820 783726273 783270340
1574.9G83270340j828308l052368m016419N620346o714n25894J363068R0332J034622
$$ 783270340 781442032 778389664 774373245 779993591 779986877 779460983 780824051 780914383 781949005
1579.2G81949005n41077j977081Q74024j49384P41577J603470j099167k759399N2032
$$ 781949005 781407928 779430847 780304871 780155487 780897064 782500534 781401367 778641968 778694000
1583.6G78694000R45740n5847j443329l58353L10974m35943o78330j095276j665267
$$ 778694000 779639740 779583893 778140564 777782211 778093185 777657242 776978912 775883636 774218369
1587.9G74218369J94625J789170L01361k566605n60455P80334K56272l58048j81656
$$ 774218369 774412994 776202164 776503525 773936920 773376465 774156799 774413071 774055023 773873367
1592.3G73873367L76053J49765q57849j099319j85318R69619j074142O6910j349106
$$ 773873367 774249420 774399185 773541336 772442017 772256699 773226318 772152176 772219086 770869980
1596.6G70869980j418381K60086j45645m92020K05841r76409j171494j481094j565476
$$ 770869980 769451599 769711685 769566040 769074020 769279861 768303452 767131958 765650864 764085388
1600.9G64085388J385880R0942j858597K85416j2894k9602q47244k096253j398391
$$ 764085388 765471268 765562210 763703613 763989029 763976135 763946533 763099289 761003036 759604645
1605.3G59604645O46438m14047k649994l180160k88697Q32673j30234k583695l594513
$$ 759604645 760251083 759837036 757187042 754006882 753718185 754550858 754420624 751836929 748242416
1609.6G48242416k27890J394577k184677k090835j274796J82800l408889l698349K28729
$$ 748242416 748014526 749409103 747224426 745133591 743858795 744041595 740632706 736934357 737163086
1613.9G37163086q3847j926117j87683j379090l750610q086395M093246Q79898q34579
$$ 737163086 737079239 735153122 734965439 733586349 729835739 721749344 725842590 726722488 725887909
1618.3G25887909r8496k66418k108612r87244k266845k202836o2789l129807m069290
$$ 725887909 725789413 725522995 723414383 722427139 720160294 717957458 717894669 714764862 710695572
1622.6G10695572o48575n776672n252304l999405j650543k875290l246003m100341
$$ 710695572 710046997 704270325 699018021 695018616 693368073 690492783 687246780 683146439
1626.5F83146439m612351n093078o139298n035934o982346r584808p779312o875000
$$ 683146439 678534088 673441010 667301712 662265778 655283432 645698624 637919312 631044312
1630.3F31044312m205475p430382p318611n467568p619934r513054o973190p501068
$$ 631044312 626838837 619408455 612089844 606622276 599002342 589489288 582516098 575015030
1634.2E75015030j0643959j8304138k0420800j3270340o708107j0035591j8450775
$$ 575015030 564371071 546066933 525646133 512375793 505667686 495632095 477181320
1637.6D77181320j8800812j2477378j6772881j5057144j3354836j1887130j1798706
$$ 477181320 458380508 445903130 429130249 414073105 400718269 388831139 377032433
1641C77032433r582863q331871o299820o728020l584633m692078k017250j122589k732429
$$ 377032433 367449570 359117699 352817879 346089859 342505226 337813148 335795898 334673309 331940880
1645.3C31940880J777305N660630J945152N137901O814461Q150864J0677414J0099640
$$ 331940880 333718185 339378815 341323967 346461868 353276329 361427193 372104607 382204247
1649.2C82204247Q473510Q261071N857849Q351974O929131P053222P771378J0208130
$$ 382204247 390677757 398938828 404796677 413148651 420077782 427131004 434902382 445110512
1653D45110512j3580933p669067n510788j4607353j0359230r944039j3483276j3526879
$$ 445110512 431529579 423860512 418349724 403742371 393383141 383439102 369955826 356428947
1656.9C56428947j7276649j8469925j6813545j8482800k0236587j8704949k0553360
$$ 356428947 339152298 320682373 303868828 285386028 265149441 246444492 225891132
1660.2B25891132k1953544k0665417j8455162j7333689j5227051k2945509j5592746
$$ 225891132 203937588 183272171 164817009 147483320 132256269 109310760 93718014
1663.6I3718014j2874937j1685152j0510555q757133p316904n720735m061036l321609
$$ 93718014 80843077 69157925 58647370 49890237 42573333 36852598 32791562 29469953
1667.5B9469953k001486j793154j889834l659592m356318p79351R15031r20560m105798
$$ 29469953 27468467 25675313 23785479 20125887 15769569 14990218 15905249 14984689 10878891
1671.8A0878891p47190M71032r37171o00242K72220K441111N752528n944429k867090
$$ 10878891 10131701 10602733 9665562 9065320 9337540 11778651 17531179 11586750 8719660
1676.2H719660J692900L65960P84201r6150j29850J657371K215045P26003J116929
$$ 8719660 10412560 10778520 11562721 11466571 11336721 12994092 15209137 15935140 17052069
1680.5A7052069Q35912o98330K002166M834462L789874L726191M988062Q091605K2770920
$$ 17052069 17887981 17189651 19191817 24026279 27816153 31542344 36530406 44622011 67392931
1684.8F7392931O539497M382210J0827322J3548470J6433468J9581461K3596773K3676910
$$ 67392931 73932428 78314638 89141960 102690430 119123898 138705359 162302132 185979042
1688.7A85979042K1787548K3953953K7044372K4025631K3293400K1775017K4324875
$$ 185979042 207766590 231720543 258764915 282790546 306083946 327858963 352183838
1692.1C52183838K5168457K2143974J7430725J7342987J8754197J6685867J8042412
$$ 352183838 377352295 399496269 416926994 434269981 453024178 469710045 487752457
1695.4D87752457L6906738P699013N297126J0315476J2244530J0705452J0486335P045250
$$ 487752457 524659195 532358208 537655334 547970810 560215340 570920792 581407127 588452377
1699.3E88452377Q719254J1997375O737061O246872M445801K675628O104393O496163
$$ 588452377 597171631 609169006 615906067 622152939 626598740 629274368 635378761 641874924
1703.2F41874924M691467J184463M876862O587906L730240n23758J341629O562805
$$ 641874924 646566391 647750854 652627716 659215622 662945862 662422104 663763733 670326538
1707F70326538M975510P03048K561799K622680K655258K144089K938309M452362K486725
$$ 670326538 675302048 676005096 678566895 681189575 683844833 685988922 688927231 693379593 695866318
1711.4F95866318L315353K489395J416931L806611J896286L330535L615113P1563J282883
$$ 695866318 699181671 701671066 703087997 706894608 708790894 712121429 715736542 715808105 717090988
1715.7G17090988K832718K069244o05850j650238O673126j927414k01644M235458J950684
$$ 717090988 719923706 721992950 721387100 719736862 726409988 724482574 724280930 728516388 730467072
1720G30467072J869506L136444Q38395k07520J399155N64651L48130J731414j213760
$$ 730467072 732336578 735473022 736311417 736103897 737503052 738067703 738415833 740147247 738933487
1724.4G38933487j241760J425857J881943J461792K439346J806107J310654m04358
$$ 738933487 737691727 739117584 740999527 742461319 744900665 746706772 748017426 747613068
1728.2G47613068M78286Q39920N96390K541428j98746l85590J197052K169266J365891
$$ 747613068 748091354 748931274 749527664 752069092 751870346 751484756 752681808 754851074 756216965
1732.6G56216965j625366m757996O92596l04870P335968L949890j551514O89545J267395
$$ 756216965 754591599 749833603 750526199 750221329 757557297 761507187 759955673 760645218 761912613
1736.9G61912613N49850j898498J193847L078843Q90808J9073K805100l86811R65348
$$ 761912613 762462463 760563965 761757812 764836655 765727463 765746536 768551636 768164825 769130173
1741.3G69130173K031097K30103q00248j091690K157288K181778J202087J157380M083404
$$ 769130173 771161270 771391373 770591125 769499435 771656723 773838501 775040588 776197968 780281372
1745.6G80281372P02820j278458J26648J013718J489334j375427Q32061M665986O51168
$$ 780281372 780984192 779705734 779832382 780846100 782335434 780960007 781792068 786458054 787109222
1749.9G87109222J17722j074982m043884L380432K608566P13959K113648k57035j579437
$$ 787109222 787226944 786151962 782108078 785488510 788097076 788811035 790924683 790667648 789088211
1754.3G89088211O23703P47147K53677J347809m83551r62372J366959K053375M33121
$$ 789088211 789711914 790459061 790712738 792060547 791576996 790614624 791981583 794034958 794468079
1758.6G94468079j759797j935882p94449L389511K463532l287659k784653M863968
$$ 794468079 792708282 790772400 789977951 793367462 795830994 792543335 789758682 794622650
1762.5G94622650N42679N82886j107941j197052K261047k33383m66461O05850k26974
$$ 794622650 795165329 795748215 794640274 793443222 795704269 795470886 795004425 795610275 795383301
1766.8G95383301P96432k581634m647599J67084L089981L803482M56314R78775l268203
$$ 795383301 796179733 793598099 788950500 789117584 792207565 796011047 796467361 797446136 794177933
1771.1G94177933o818924K207489k836914J081772K874908J504364j24359j900406
$$ 794177933 787359009 789566498 786729584 787811356 790686264 792190628 792066269 790165863
1775G90165863m08173p6217N79834M11758J06888n16052k015686J112976Q50754k681961
$$ 790165863 789757690 789681473 790261307 790673065 790779953 790263901 788248215 789361191 790211945 787529984
1779.8G87529984k304230m82636L808594M35028j093140N77317L82766k016906M36783
$$ 787529984 785225754 784743118 788551712 788986740 787893600 788470917 788853683 786836777 787273560
1784.2G87273560j433793j585769J656494J529159o80770O59408l50036j781617M79966
$$ 787273560 785839767 784253998 785910492 787439651 786758881 787418289 787068253 785286636 785766602
1788.5G85766602o51856j558990M77981L446121R80606l889770j524963l180008l438187
$$ 785766602 785114746 783555756 784033737 787479858 788460464 784570694 783045731 779865723 776427536
1792.8G76427536O163254L086700Q36106j835480j866760q82950J909408K291413j99280
$$ 776427536 782590790 785677490 786513596 784678116 782811356 781928406 783837814 786129227 785929947
1797.2G85929947J12381o90766l611679m69818J735916L187867K275085l98331j072692
$$ 785929947 786042328 785351562 781739883 781270065 783005981 786193848 788468933 788070602 786997910
1801.5G86997910o29349k505570J295472K744598l67127l64913P79418L18070k77939
$$ 786997910 786368561 783862991 785158463 787903061 787535934 787171021 787950439 788268509 787990570
1805.9G87990570p43332K728577L103485j504364L62167Q20847J42975K37426P80335
$$ 787990570 787247238 789975815 793079300 791574936 791937103 792757950 792900925 793138351 793918686
1810.2G93918686o92215l40424J476136L84445M30908j023483j938935J521683J334458
$$ 793918686 793226471 792886047 794362183 794746628 795177536 794154053 792215118 793736801 795071259
1814.5G95071259J649169J598816p58895p55616k2125K530289O92978j371918l52860
$$ 795071259 796720428 798319244 797560349 796804733 796782608 799312897 800005875 798633957 798281097
1818.9G98281097J965485J125336j083832R93576K776871R90829J410065K57873j425476
$$ 798281097 800246582 801371918 800288086 801281662 804058533 805049362 806459427 806717300 805291824
1823.2H05291824j798019L56598J701660l025894R20791J647110K23771L90853Q55332
$$ 805291824 803493805 803850403 805552063 802526169 803446960 805094070 805317841 805708694 806564026
1827.6H06564026L25928k483292j384735R85718K07901L680496J911774q32291J517486
$$ 806564026 806889954 804406662 803021927 804007645 804215546 807896042 809807816 808975525 810493011
1831.9H10493011P52411n63659n20706L356933K0752j191177q36869k05307K167969
$$ 810493011 811245422 810681763 810161057 813517990 813538742 812347565 811510696 811305389 813473358
1836.2H13473358q42666l361817P56683J600190R2163o64978O04782k06452Q9722K148209
$$ 813473358 812630692 809268875 810025558 811625748 811717911 811052933 811657715 811451263 811540985 813689194
1841.1H13689194p3090j174850j240845k228851N15976l12272n12771K983627K790528
$$ 813689194 813616104 812441254 811200409 808971558 809487534 809175262 808662491 811646118 814436646
1845.4H14436646K9678j411743o27823m42734K77405K405472r59244n25055J416244
$$ 814436646 814466324 813054581 812426758 811984024 812261429 814666901 813707657 813182602 814598846
1849.7H14598846N35431q33664p28073K92511P51725J18331k01873K1972L09449N85937
$$ 814598846 815134277 814300613 813572540 813865051 814616776 814735107 814533234 814555206 814864655 815450592
1854.6H15450592P52029O83823K29187L47138O86035j32981l03573R47418Q9798j07040
$$ 815450592 816202621 816886444 817115631 817462769 818148804 818015823 817712250 818659668 818749466 818642426
1859.4H18642426m67072J6556Q63724j669007j91879K078018R36356Q8958j037139
$$ 818642426 818175354 818191910 819055634 817386627 817194748 819272766 820209122 820298080 819260941
1863.7H19260941J019973R69620l6545j368026n53666K706757N35126k393723j042023
$$ 819260941 820280914 821250534 821213989 819845963 819292297 821999054 822534180 820140457 819098434
1868.1H19098434J332550k678527j379013M699783m15039j812210J525345J811981
$$ 819098434 820430984 817752457 816373444 821073227 820658188 818845978 820371323 822183304
1871.9H22183304k14539j085281j297684j07879J692123K318878l109207j939697J841659
$$ 822183304 821968765 820883484 819585800 819477921 821170044 823488922 820379715 818440018 820281677
1876.3H20281677K095795q48999k860031J203766J373977r03701p62635k6550M60205
$$ 820281677 822377472 821528473 818668442 819872208 821246185 820342484 819579849 819553299 820013504
1880.6H20013504L2578j835099l38516K500534j03607L85513R27811k754440J186142
$$ 820013504 820046082 818210983 817872467 820373001 820269394 820654907 821582718 818828278 820014420
1885H20014420K27890j75629J379318N1651j15051l6316j090088j003342j753234P37915
$$ 820014420 820242310 820066681 821445999 821497650 821382599 821346283 820256195 819252853 817499619 818237534
1889.8H18237534K846069J320877L24554j255569j385117j184539K048797N44510J294174
$$ 818237534 821083603 822404480 822729034 821473465 820088348 818903809 820952606 821497116 822791290
1894.1H22791290o50634l214264P54623R44061j934814K64587p85751r26514K557144
$$ 822791290 822140656 818926392 819681015 820625076 818690262 818954849 818169098 817242584 819799728
1898.5H19799728M00086r63974P4386L66593M7989o16532N92347j87989j173553k22397
$$ 819799728 820199814 819235840 819310226 819676819 819724808 819108276 819700623 819512634 818339081 818116684
1903.3H18116684r94797Q20618J400757N12161o27518j522598j81656Q93784m42810
$$ 818116684 817121887 817942505 819343262 819855423 819227905 817705307 817523651 818417435 817974625
1907.6H17974625J76468j98670k550583n96924q54339Q68835L05786j29242J696778
$$ 817974625 818151093 817952423 815401840 814804916 813950577 814819412 815125198 814995956 816692734
1912H16692734M75769J046219p02668k367019J103439K046127O53840n58167l265457
$$ 816692734 817168503 818214722 817512054 815145035 816248474 818294601 818948441 818390274 815124817
1916.3H15124817j992416J373825P9498j100235K492447M01916J557923J387634j126633
$$ 815124817 813132401 814506226 814585724 813485489 815977936 816379852 817937775 819325409 818198776
1920.6H18198776j231918J195221j486817j71890j056518o68106J056366K783813R0561
$$ 818198776 816966858 818162079 816675262 816503372 815446854 814778748 815835114 818618927 818709488
1925H18709488k736511p13883L48664j6327Q34427Q6135m31442L38593N94177o93436
$$ 818709488 815972977 815259094 815607758 815591431 816425858 816511993 816080551 816419144 817013321 816319885
1929.8H16319885o77566K072830j04599m00238K748337L19214j496659p06939p15409
$$ 816319885 815642319 817715149 817610550 817210312 819958649 820277863 818781204 818074265 817358856
1934.1H17358856p07474j057815k026978K54975n77622r70382M38156k80228q95615
$$ 817358856 816651382 815593567 813566589 813821564 813243942 812273560 812711716 812431488 811535873
1938.5H11535873j96380J34201q2016Q72574l37220m023437J385803K128983k624970
$$ 811535873 811339493 811473694 811391678 812264252 811927032 807903595 809289398 811418381 808793411
1942.8H08793411J745453J384735p94830j425324k487793M77372L324203J017685N42984
$$ 808793411 810538864 811923599 811128769 809703445 807215652 807693024 811017227 812034912 812577896
1947.2H12577896l56293j878357N1041L16467j903686K98462j157303m1657J963044
$$ 812577896 812221603 810343246 810394287 810710754 808807068 809105530 807948227 807906570 809869614
1951.5H09869614K307586K29950j443481L85513J126328l83149j83105K45590P05719
$$ 809869614 812177200 812407150 810963669 811349182 812475510 812092361 811909256 812154846 812860565
1955.8H12860565J571350K3194K11258l68500l43628P73544J063080J206970n0277
$$ 812860565 814431915 814455109 814666367 814297867 813954239 814727783 815790863 816997833 816947556
1960.2H16947556p16858k128983K60010J484146J259766p52564j771850J055297J799469
$$ 816947556 816230698 814101715 814361725 815845871 817105637 816353073 814581223 815636520 817435989
1964.5H17435989l8833j096039J52054r1706j400146N13611K358627M14276j280288
$$ 817435989 817397156 816301117 816453171 816361465 814961319 815474930 817833557 818247833 816967545
1968.9H16967545J376571M97208j848297P42798J616668N55725K18277k265167m77066
$$ 816967545 818344116 818841324 816993027 817735825 819352493 819908218 820126495 817861328 817384262
1973.2H17384262R38644J130982k69470r11331K61077k96173k832184n92880J475983
$$ 817384262 818322906 819453888 819184418 818273087 818534164 818237991 815405807 814812927 816288910
1977.5H16288910N79834N69458J067276J150894n09491R79538p24106o92520j573105
$$ 816288910 816868744 817438202 818505478 819656372 819146881 820126419 819402313 818709793 817136688
1981.9H17136688o06460Q97140J055908n11093J358261J686249n86395j984635R79004
$$ 817136688 816530228 817427368 818483276 817972183 819330444 821016693 820430298 818445663 819424667
1986.2H19424667J379166j744308n21546L09830o05850J869354N71823N4932o33316
$$ 819424667 820803833 819059525 818537979 818847809 818241959 820111313 820683136 820738068 820104752
1990.6H20104752K71682J402665j993104r42306p54013L72009O15082M15649K416840
$$ 820104752 820376434 821779099 819785995 818843689 818089676 818461685 819076767 819492416 821909256
1994.9H21909256m36401j151963J74485o8741p97577O54220o96487r80530J884384
$$ 821909256 821472855 820320892 820495377 820426636 819629059 820283279 819586792 818606262 820490646
1999.2H20490646Q97828j501008o19354J735001J148071r68552j598587Q83942n35431
$$ 820490646 821388474 819887466 819268112 821003113 822151184 821182632 819584045 820467987 819932556
2003.6H19932556K08054m53186j042939k00653j6937J306763n10559k27967j061401
$$ 819932556 820140610 819687424 818644485 818443832 818426895 819733658 819223099 818995132 817933731
2007.9H17933731j65100J790771L655472k55890L21503j631012k586975J155548K429428
$$ 817933731 817768631 819559402 823214874 822958984 823280487 821649475 819062500 820218048 822647476
2012.3H22647476o37588j778183N61218K56500j614303j396256R20715L329010j526031
$$ 822647476 822009888 820231705 820792923 821049423 819435120 818038864 818959579 822288589 820762558
2016.6H20762558k218704Q92639M24728j526K47040k2812j00784r21555p46307L66211
$$ 820762558 818543854 819436493 819861221 819859695 820106735 820083923 819983139 819061584 818315277 818681488
2021.4H18681488J83868L02887O69785Q20312R31931o18973j644439o19431J071701
$$ 818681488 818865356 819168243 819838028 820658340 821590271 820971298 819326859 818707428 819779129
2025.8H19779129j007080K90832j25274o10428M60434J229324Q91876k109375k572250
$$ 819779129 818772049 819062881 818937607 818327179 818787613 820016937 820908813 818799438 816227188
2030.1H16227188l21197K003326K032318l12958n42984j377182R02939N35202P8354
$$ 816227188 815905991 817909317 819941635 819628677 819085693 817708511 818611450 819146652 819225006
2034.4H19225006J013870k11944l574524o58341K493058J730575j729126j346130n5313
$$ 819225006 820238876 820026932 816452408 815794067 818287125 820017700 818288574 816942444 816887131
2038.8H16887131n38101K283096k62146k277832j598282j427383J122512J166001j057587
$$ 816887131 816349030 818632126 818369980 816092148 814493866 813066483 814188995 815354996 814297409
2043.1H14297409n86090J542664P42569k260666k690201J116257J954116J800080O22024
$$ 814297409 813711319 815253983 815996552 813735886 811045685 812161942 814116058 815916138 816538162
2047.5H16538162o97784j052399L66211l76358j938171j598053m0512J426696J886750
$$ 816538162 815840378 814787979 815154190 814777832 812839661 811241608 811201096 812627792 814514542
2051.8H14514542J11847k734223j998215p67135Q64563m37012J287079J106720p37457
$$ 814514542 814626389 811892166 809893951 809126816 809991379 809554367 810841446 811948166 811210709
2056.1H11210709n88532k77557J161728R82742K26593p5226L86429j87912r24759K68478
$$ 811210709 810622177 810344620 811506348 812489090 812715683 812640457 813026886 812838974 811914215 812182693
2061H12182693R09958k720184j517792Q82721K683792o26220r59473p23495J189346
$$ 812182693 813092651 810372467 808854675 809737396 812421188 811794968 810835495 810112000 811301346
2065.3H11301346O60629p35321j307373j421432l48969K005386J139908j483459j340409
$$ 811301346 811961975 811226654 809919281 808497849 808148880 810154266 811294174 809810715 808470306
2069.6H08470306n72586K745972J611862j153412j721267O52847N3101M22439K186127
$$ 808470306 807897720 810643692 812255554 811102142 809380875 810033722 810086823 810509262 812695389
2074H12695389q84323j287842J76849j10016R67408J118621j224365k928619J62735
$$ 812695389 811811066 810523224 810700073 810590057 811557465 812676086 811451721 808523102 808685837
2078.3H08685837K537384L128357N39703j869125r92050O30951J99508j383972R68781
$$ 808685837 811223221 814351578 814891281 813022156 812030106 812661057 812860565 811476593 812445374
2082.7H12445374J145935L31039j361465o03867O92978j17493j571960O18973K350921
$$ 812445374 813591309 813922348 812560883 811957016 812649994 812532501 810960541 811579514 813930435
2087H13930435j010055j991806Q545K457428J139068k91595O39343Q03375k99988n95245
$$ 813930435 812920380 810928574 810937119 813394547 814533615 814242020 814881363 815684738 815384750 814789505
2091.8H14789505k612381J52969K285309P66602Q20541j578674m82254l41187j915970
$$ 814789505 812177124 812330093 814615402 815382004 816202545 814623871 814141617 813800430 811884460
2096.2H11884460J66321K385025K83661j195297j087036k53754J144486R33837L11280
$$ 811884460 812050781 814435806 814719467 813524170 812437134 812183380 813327866 814261703 814572983
2100.5H14572983K35367O28357O12335j616440J32904K249985j076660o91071J491013
$$ 814572983 814808350 815436707 816049042 814432602 814565506 816815491 815738831 815047760 816538773
2104.8H16538773J066742k988129k90680K73666l67508q11233J652679K639313P60651
$$ 816538773 817605515 814617386 814326706 814600372 814232864 813421631 815074310 817713623 818474274
2109.2H18474274k9602l664093j747132L154297N5237j369019J40610J498032j890183
$$ 818474274 818444672 814780579 813033447 816187744 816242981 814873962 815014572 816512604 814622421
2113.5H14622421K186508K087708p21817j62048q1177l55606R24530k329865o07528
$$ 814622421 816808929 818896637 818174820 818012772 817931595 817575989 818500519 816170654 815563126
2117.9H15563126J230697r32846J827469J931152K206726l151550j972427j013794
$$ 815563126 816793823 815860977 817688446 819619598 821826324 818674774 816702347 815688553
2121.7H15688553k678375L30505j1978j039963K338867J793213J268234j056213j912765
$$ 815688553 813010178 813340683 813328705 812288742 814627609 816420822 817689056 816632843 814720078
2126.1H14720078J98135J534881k13089n30624J415329L23715n98678l014527l14331
$$ 814720078 814918213 816453094 816240005 815709381 817124710 817448425 816849747 813835220 813520889
2130.4H13520889K653580Q97675j412049L05863j030579j48621K456589J641236j065598
$$ 813520889 816174469 817072144 815660095 815965958 814935379 814786758 817243347 818884583 817818985
2134.7H17818985j069336j91040J020813K94189n27496J638336j157455n49851J111527
$$ 817818985 816749649 816558609 817579422 817873611 817346115 818984451 817826996 817277145 818388672
2139.1H18388672k548447L6240j28021P38525J01776Q14667J901092k81295j686325
$$ 818388672 815840225 815876465 815748444 816486969 816588745 817403412 819304504 819023209 817336884
2143.4H17336884K82516J57623q02841R06601K133865j17187j372681k09884p8431
$$ 817336884 817619400 817777023 816974182 817880783 820014648 819897461 818524780 818314896 818236465
2147.8H18236465m31900q65249o14472j025161J338501R43679M27323n78690K181473
$$ 818236465 817804565 816939316 816324844 815299683 816638184 817581863 818009186 817430496 819611969
2152.1H19611969R60312k513886p69271k02179M74929K89841O5765p27767j42136j131592
$$ 819611969 820572281 818058395 817289124 817086945 817561874 817851715 817917480 817189713 817047577 815915985
2156.9H15915985J299820J884537j741791P41425J602020j088562O52847M12369j386032
$$ 815915985 817215805 819100342 817358551 818099976 819701996 818613434 819266281 819678650 818292618
2161.3H18292618l66287n9815r10797M06418N60760l11355M41055J436310J052856
$$ 818292618 817926331 817866516 816955719 817362137 817922897 817611542 818052597 819488907 820541763
2165.6H20541763j09558Q7433o22406p31964K391739J971130k367630j375198j315384
$$ 820541763 820432205 820519638 819897232 819165268 821557007 823528137 821160507 819785309 818469925
2169.9H18469925K14004K068177J28021K75497j95694j712493j525803J357880J473159
$$ 818469925 818683929 820752106 820880127 821155624 820959930 819247437 817721634 819079514 820552673
2174.3H20552673p22732k40631j214218J09329O53991J143647q7509j164399J785126
$$ 820552673 819829941 819589310 818375092 818484421 819138412 820282059 820194550 819030151 820815277
2178.6H20815277J926651k779236j416702K157745j344604k666321K054443K105713
$$ 820815277 822741928 819962692 818545990 820703735 819359131 816692810 818747253 820852966
2182.5H20852966l18908n42679l9978j554718Q19397J473999J378708m64859k198868
$$ 820852966 820534058 819991379 819951401 818396683 819216080 820690079 822068787 821603928 819405060
2186.8H19405060Q3160l30887j575927p23038R88388r20792q04519K427902J251221
$$ 819405060 819488220 819157333 817581406 816858368 817846756 816925964 816121445 818549347 819800568
2191.2H19800568l84674N90362k725601j890564L056412Q76693j793212M13360J625672
$$ 819800568 819415894 820006256 817280655 815390091 818446503 819323196 817529984 817943344 819569016
2195.5H19569016l56675j193618q60138M25491L21503K49176p38984J024170J52054
$$ 819569016 819212341 818018723 817158585 817584076 817905579 818154755 817415771 818439941 818591995
2199.8H18591995r78241j030807J292953J52664p67288p37686j36719J62125J52588
$$ 818591995 817613754 816582947 817875900 818028564 817261276 816523590 816386871 816548996 816701584
2204.2H16701584j821137j528930R29031J921387j065293k732543K01187P87277K892609
$$ 816701584 814880447 813351517 814280548 816201935 815136642 812404099 812605286 813392563 816285172
2208.5H16285172O70776j878662j988602Q71353j000213m280091j400223J798325P97424
$$ 816285172 816955948 815077286 813088684 813960037 812959824 808679733 807279510 809077835 809875259
2212.9H09875259M59595Q53424P46842J687622j572876j591721O38886o1341j058426
$$ 809875259 810334854 811188278 811935120 813622742 812049866 810458145 811097031 811035690 809977264
2217.2H09977264k114868O27289J483231L13034N50384r62448J729431n6915m8981
$$ 809977264 807862396 808489685 809972916 810285950 810836334 809873886 811603317 811546402 811497421
2221.5H11497421M93546r48410j99204j460266J110001O39419k059784L8453R37500
$$ 811497421 811990967 811042557 810843353 809383087 810493088 811132507 809072723 809111176 810048676
2225.9H10048676n61982j569366P97577M89120J494522N95780k148361q49228J580887
$$ 810048676 809486694 807917328 808714905 809204025 810698547 811294327 809145966 808296738 809877625
2230.2H09877625P03735L41568j89362P859J189727P47910j661453j94855J801147
$$ 809877625 810581360 810922928 810733566 810741425 811931152 812679062 811017609 810822754 812623901
2234.6H12623901j688385k096939m26635K239837J455689l510j017990Q09631J67008
$$ 812623901 810935516 808838577 808411942 810651779 812107468 812103958 811085968 811895599 812062607
2238.9H12062607r40705J464234m67301m27093J53351j138382L35922J826096J272354
$$ 812062607 811121902 812586136 812118835 811691742 811845093 810706711 811042633 812868729 814141083
2243.2H14141083P0190J094361N65033j007004j117478J376190P23649j835556k95792
$$ 814141083 814211273 815305634 815870667 814863663 813746185 815122375 815846024 814010468 813714676
2247.6H13714676K079239q93326j790009M84925j4649j046676l11051J229553J736451
$$ 813714676 815793915 814900589 813110580 813595505 813580856 812534180 812223129 813452682 815189133
2251.9H15189133L66516k117005q22753J009368K826767o19354o99005Q69522j198273
$$ 815189133 815555649 813438644 812615891 813625259 816452026 815832672 815133667 816003189 814804916
2256.3H14804916p40051l30658m36630K611999J391755l441925j275101L30810L53852
$$ 814804916 814064865 813734207 813297577 815909576 817301331 813859406 812584305 812915115 813268967
2260.6H13268967O72760n66559P84073p26929r03702N80826J348648J072540K28501
$$ 813268967 813941727 813375168 814159241 813432312 812528610 813109436 814458084 815530624 815759125
2264.9H15759125Q18557o11801k594299K105560K904740l207016l042984J081238K670211
$$ 815759125 816577682 815965881 813371582 815477142 818381882 815174866 812131882 813213120 815883331
2269.3H15883331k05383l921738J366272K805481L48511j585159N87845J331558j936875
$$ 815883331 815677948 811756210 813122482 815927963 816276474 814691315 815279160 816610718 814673843
2273.6H14673843m18396J575699L24631n07278n17426l92380m69284j856308n0888
$$ 814673843 814255447 815831146 816155777 815648499 815131073 814738693 814269409 812413101 812362213
2278H12362213Q53729J002884R66950n92194L10135R61075m56085M35791l08152J472397
$$ 812362213 813215942 814218826 815185776 814593582 814903717 815864792 815408707 815844498 815536346 817008743
2282.8H17008743K650833q26644k929078k393646m05273J671829r38110o65894j340942
$$ 817008743 819659576 818832932 815903854 813510208 813104935 814776764 813838654 813172760 811831818
2287.1H11831818o92902J940079L177185j111832k049942q24509N76554L182373l017883
$$ 811831818 811138916 813078995 816256180 815144348 813094406 812269897 812846451 816028824 813010941
2291.5H13010941m549790K766571L41110k212448n29861J44806M49371J120987j115570
$$ 813010941 808461151 811227722 811568832 809356384 808826523 808971329 809420700 810541687 809426117
2295.8H09426117l163376L410721J847839q71658j356964l812485K198715K003403
$$ 809426117 806262741 809673462 811521301 810649643 809292679 805480194 807678909 809682312
2299.6H09682312q55560j697922J241531M07486j708755m785156J498565M364472J69296
$$ 809682312 808826752 807128830 808370361 808777847 807069092 802283936 803782501 808146973 808316269
2304H08316269n197907o980056M774093M907379p50503o892471K941513O054916k742538
$$ 808316269 803118362 796138306 800912399 805819778 805069275 798176804 801118317 807173233 804430695
2308.3H04430695r996109l292923P725982J876145n756836r498215R245987J0441132
$$ 804430695 794434586 791141663 798867645 800743790 794986954 785488739 794734726 805175858
2312.2H05175858k781678j3643112K593079Q402023j716537q563919j596680N921707
$$ 805175858 802394180 788751068 791344147 799746170 798029633 789465714 787869034 793790741
2316G93790741m83475q112869k082062R685669K560349q477784r690322R335861L732681
$$ 793790741 793307266 785194397 783112335 792798004 795358353 786880569 777190247 786526108 790258789
2320.4G90258789o200104r307327J0948944O702423q854065j3366623J2460328O42089
$$ 790258789 784058685 774751358 785700302 792402725 783548660 770182037 782642365 783284454
2324.2G83284454r315338k376022J0252838K831573q640060m657974Q586426K360229
$$ 783284454 773969116 771593094 781845932 784677505 776037445 771379471 779965897 782326126
2328.1G82326126j1648636r297256J1297683m60510j8032684M409790J9275513o506577
$$ 782326126 770677490 761380234 772677917 772217407 754184723 758594513 777870026 771363449
2332G71363449j9053116J7057648Q153305j2066803o910858J6510849K427978j3714370
$$ 771363449 752310333 769367981 777521286 765454483 758543625 775054474 777482452 763768082
2335.8G63768082j178284J4746475n014419j8034058J3506012N428772k0448151l353958
$$ 763768082 762589798 777336273 772321854 754287796 767793808 773222580 752774429 749420471
2339.7G49420471J9307251p608490j5520401J9017410Q389740j3578949p23800J5373688
$$ 749420471 768727722 761119232 745598831 764616241 773005981 759427032 758703232 774076920
2343.5G74076920n367279j2085877J3317947J704636j4186478J2784348J4387283n287475
$$ 774076920 768709641 756623764 769941711 771646347 757459869 770244217 784631500 779344025
2347.4G79344025k645569O401138M789810q22067j1723709J526794P910996j7124329
$$ 779344025 776698456 783099594 787889404 787067337 775343628 776870422 784781418 767657089
2351.2G67657089j2765045J1655350J005783n398407R105453o717453j7270965R444351
$$ 767657089 754892044 766547394 767553177 762154770 771260223 764542770 747271805 756716156
2355.1G56716156J039810r889450J0637894j703797j4882125R006805K854919o857681
$$ 756716156 757755966 747866516 758504410 756800613 741918488 750925293 753780212 746922531
2359G46922531j91650j3434601N49164J4924621j989441K174836Q857421j3214035
$$ 746922531 746730881 733296280 733845444 748770065 746780624 748955460 757812881 744598846
2362.8G44598846M843827M836654m786682N225449l702469J088409N300065r152146
$$ 744598846 749442673 754279327 749492645 754718094 751015625 752104034 757404099 748251953
2366.7G48251953R406891M292603k707673O357956m203109R930496L025589q440247
$$ 748251953 757658844 761951447 759243774 765601730 761398621 771329117 774354706 765914459
2370.5G65914459K428131J986237R367599N31693j1597p48596m00085N174789k968597
$$ 765914459 768342590 770328827 779696426 780228119 780216522 779467926 779067841 784242630 781274033
2374.9G81274033K727127M473190P985382j676254o50254q94165l40805K191697L489990
$$ 781274033 784001160 788474350 796459732 794783478 794133224 793239059 792898254 795089951 798579941
2379.2G98579941n74112J626663L979187j396637J571274K095489N16892j736298J049347
$$ 798579941 798005829 799632492 803611679 802215042 803786316 805881805 806398697 804662399 805711746
2383.6H05711746L422241J679612m26560O54526J597443o4774r35516p07016n28336
$$ 805711746 809133987 810813599 810387039 811041565 812639008 812574234 811638718 810931702 810403366
2387.9H10403366K119827K223359k681427j502686J918411O32324J129456o7596K2811
$$ 810403366 812523193 814746552 812065125 810562439 812480850 813113174 814242630 814175034 814197845
2392.2H14197845N03159J03226j987915j929779q31757N90286m11071K035751L36761
$$ 814197845 814701004 814804230 812816315 810886536 810054779 810645065 810233994 812269745 812606506
2396.6H12606506j713333k721023P00912K417297K15760m31290J15280R0027n23376
$$ 812606506 810893173 808172150 808873062 811290359 811506119 811074829 811190109 811280136 810756760
2400.9H10756760J053314J263046L50113j171799k546692J97754J896592N20629j944732
$$ 810756760 811810074 813073120 813423233 812251434 809704742 809902496 811799088 812319717 810374985
2405.3H10374985m90494o62613j113052J730728K042312r25064j167526n10254P76749
$$ 810374985 809884491 809221878 808108826 809839554 811881866 810956802 809789276 809279022 810055771
2409.6H10055771l26615Q50144l32108p93838o60706r33838K142334K051468j774444
$$ 810055771 809729156 810579300 810247192 809453354 808792648 807858810 810001144 812052612 810278168
2413.9H10278168Q81881M54636j210709p23571K851638R12018l081970m94995L45001
$$ 810278168 811160049 811614685 810403976 809680405 812532043 813444061 810362091 809867096 810212097
2418.3H10212097L65296J195221r48716o34384k85110m21067o87561K372437J575012
$$ 810212097 810577393 811772614 810823898 810189514 809904404 809483337 808795776 811168213 812743225
2422.6H12743225j820602k362671P0724L91693n98602M20609K830886K987748r77250
$$ 812743225 810922623 808559952 808630676 809022369 808423767 808844376 811675262 814663010 813685760
2427H13685760l434066k537689K938919K876968q63800N91049j326980k827607o7138
$$ 813685760 810251694 807714005 810652924 813529892 812666092 813257141 811930161 809102554 809035416
2431.3H09035416J263733j17951N49851K14233j255264J381378L30887k139893N89295
$$ 809035416 810299149 810181198 810731049 810945282 809690018 811071396 811402283 809262390 809851685
2435.6H09851685K330246N44891n02396J83411J031494j72348n92041k34146j334229
$$ 809851685 812181931 812726822 812224426 812407837 813439331 813266983 812674942 812440796 811106567
2440H11106567q72345J68992L25241k2812O76498N36041N13230n74646q65555q96835
$$ 811106567 810234222 810403214 810728455 810705643 811382141 811918182 812431412 811856766 810991211 810094376
2444.8H10094376J677551J320190M46854j129990k966385J033936L222198m42581r25522
$$ 810094376 811771927 813092117 813538971 812408981 809442596 810476532 813698730 813256149 812330627
2449.1H12330627j002197r81979l56751L85361O53763K077789M91409O15921J041184
$$ 812330627 811328430 810346451 809989700 810375061 811028824 813106613 813598022 814213943 815255127
2453.5H15255127r72214k075119k30636k794877n61752K906647L5782M05121J168060
$$ 815255127 814282913 812207794 811977158 809182281 808620529 811527176 811562958 811968079 813136139
2457.8H13136139j856461j995926K95563K510071N59540l387299k95410J957474P38754
$$ 813136139 811279678 809283752 809579315 812089386 812648926 809261627 808966217 810923691 811662445
2462.2H11662445k39181o55365j613617j766510L29361J830825m45633k243118N23682
$$ 811662445 811423264 810767899 809154282 807387772 807717133 809547958 809102325 806859207 807382889
2466.5H07382889K321548o4621O75736R59930j304931j018601l11966p11212J543121
$$ 807382889 809704437 809639816 810315552 811275482 809970551 808951950 808639984 807928772 809471893
2470.8H09471893J541672o52466m81415J159668J314698j777649k054138k270279M12521
$$ 809471893 811013565 810361099 809879684 811039352 812354050 810576401 808522263 806251984 806664505
2475.2H06664505L649292J147537j687393k159195J986771R28879r57108Q43277M27322
$$ 806664505 810313797 811461334 809773941 807614746 809601517 810530396 809573288 810416565 810843887
2479.5H10843887r63821q52051N112j90125J712494l93753l32107Q95614k316971j729507
$$ 810843887 809880066 809028015 809033127 808843002 810555496 810161743 809829636 810725250 808408279 806678772
2484.3H06678772J88217R85794j828537o7520J923294J658020M08707j68076r11026
$$ 806678772 806866989 807852783 806024246 805956726 807880020 809538040 809946747 809778671 808867645
2488.7H08867645l551025k67105K229461Q10013M93317j405335j320800K863693L412399
$$ 808867645 805316620 805049515 807278976 808088989 808582306 807176971 805856171 808719864 812132263
2493H12132263P98493j128846k264556k203599j0070m96140K29j066742o03638M009171
$$ 812132263 812930756 811801910 809537354 807333755 807323685 806827545 806827774 805761032 805157394 809166565
2497.8H09166565K097549K99530j2130k761460r95178M98200o82831J366958Q01087
$$ 809166565 811264114 811563644 811551514 808790054 807794876 808293076 807610245 808977203 809778290
2502.2H09778290j046753J63040R29718L97110R61304j15509j171112n62134P62176
$$ 809778290 808731537 808894577 809824295 810221405 811182709 811067200 809896088 809333954 810096130
2506.5H10096130j220016j860046J177978O73294P23877R98917J935272j110458l41340
$$ 810096130 808876114 807016068 808194046 808867340 809591217 810590134 812525406 811414948 811073608
2510.9H11073608M90418l67584P83691K064285j593094j005096N56793l28827J645661
$$ 811073608 811564026 811196442 811980133 814044418 812451324 811446228 812003021 811674194 813319855
2515.2H13319855K190704p45544j982727j482850k37045J581421J840592J77536k261277
$$ 813319855 815510559 814765015 812782288 811299438 811062393 812643814 814484406 814661942 812400665
2519.5H12400665k068100P19910J029129j293030k226867j423798J322327K111129
$$ 812400665 810332565 811052475 812081604 810788574 808561707 807137909 808460236 810571365
2523.4H10571365J967240q96759J04217J322174j345367k45209J500931k89612m10461
$$ 810571365 812538605 811641846 811746063 813068237 811722870 811477661 812978592 812688980 812278519
2527.7H12278519Q41674m74777k217331j400528L24860n76477m5700K653046N13000
$$ 812278519 813120193 812645416 810428085 809027557 809352417 808775940 808730240 811383286 811896286
2532.1H11896286j025467L46756Q86307n73273J465836J352386j923752r48028M67224
$$ 811896286 810870819 811217575 812103882 811530609 812996445 814348831 812425079 811477051 811944275
2536.4H11944275q07648j334381m35181l94973J732788K002182J96533j347580J401672
$$ 811944275 811136627 809802246 809367065 808972092 810704880 812707062 812903595 811556015 812957687
2540.8H12957687O638p62329Q93936q1635j175918k001724R18426L229294j689453
$$ 812957687 812964325 812201996 813095932 813014297 811838379 809836655 810755081 813984375 812294922
2545.1H12294922k409439J390457K669144J04980k813949K6397R1019k08206Q72421
$$ 812294922 809885483 811275940 813945084 814050064 811236115 811262512 811353531 811145325 812017746
2549.4H12017746J338272j968155k360382M150772K383042k646256j984100o41785
$$ 812017746 813356018 811387863 809027481 813178253 815561295 812915039 810930939 810289154
2553.3H10289154L0670j97983L67585m0665J364670K07519O45676J827011r88998k630158
$$ 810289154 810319824 810121841 810489426 810448761 811813431 812020950 812666626 814493637 813504639 810874481
2558.1H10874481j929855P05108L249894J44729l297271Q09173J380158l24784q41369
$$ 810874481 808944626 809649734 812899628 813044357 809747086 810556259 811936417 811611633 810770264
2562.5H10770264j837159j705856J130600J894226p553q07876j046372k02255J184997
$$ 810770264 808933105 807227249 808357849 810252075 810244522 809436646 808390274 808188019 809373016
2566.8H09373016K088242o48041J233368J425171k830200k046433J817398J389313
$$ 809373016 811461258 810813217 812046585 813471756 810641556 808595123 810412521 811801834
2570.7H11801834j851196j350250K96249j93634P91092P40585j137695j674118O95343
$$ 811801834 809950638 808600388 808896637 808703003 809494095 810234680 809096985 807422867 808118210
2575H08118210J508255J707840K518921l23563r33609m99802K442m40445k080536J824188
$$ 808118210 809626465 811334305 813853226 813529663 812596054 812096252 812098694 811658249 809577713 811401901
2579.8H11401901J291962k771149l093490N38940J058731J159210J408005N12619J571427
$$ 811401901 812693863 809922714 806829224 807368164 808426895 809586105 810994110 811506729 813078156
2584.2H13078156j599808l835755L17307J488724j288987M28696J053162j248398j676560
$$ 813078156 811478348 807642593 807959900 809448624 808159637 808588333 809641495 808393097 806716537
2588.5H06716537J534043O81381p23114K930527l8071k944260k032699J639480K000199
$$ 806716537 808250580 808931961 808208847 811139374 811101303 808157043 806124344 807763824 809764023
2592.8H09764023p18079k91748N2490j635818j512680o16532J058503M71801J376496
$$ 809764023 809045944 808754196 808806686 807170868 805658188 805041656 806100159 806571960 807948456
2597.2H07948456Q28781j088867k479096p82470R32159J145935m3030o5460q68683
$$ 807948456 808777237 807688370 805209274 804426804 805358963 806504898 806461868 806396408 805527725
2601.5H05527725k608032K411194Q20083j789703k030487j608810L613586K082825
$$ 805527725 802919693 805330887 806150970 804361267 802330780 800721970 804335556 806418381
2605.4H06418381j497879J53274m78592J323624l93524p66525L97338j027755J2588
$$ 806418381 804920502 805073776 804595184 805918808 805525284 804758759 805156097 804128342 804140930
2609.7H04140930J09101l77198k6703J958084L104859k869034l023300K000809J114425
$$ 804140930 804250031 803872833 803846130 805804214 808909073 806040039 803016739 805017548 806131973
2614H06131973k182159j719055Q58307J146392M731J349411o20041j186524J120301
$$ 806131973 803949814 802230759 803089066 804235458 804240189 805589600 804969559 803783035 804903336
2618.4H04903336k91062p16629j86157K44064O63605J031113l1205j523361p9345j994172
$$ 804903336 804612274 803895645 803709488 803953552 804617157 805648270 805617065 804093704 804014359 802020187
2623.2H02020187J017533L873977k169799k817078K019424p934L63083P07092o91681
$$ 802020187 803037720 806911697 804741898 801924820 803944244 803936310 804299393 805006485 804314804
2627.6H04314804N15289Q01621J15967J99127n15289n64728k168198K098694K895737
$$ 804314804 804830093 805631714 805747681 805946808 805431519 804866791 802698593 804797287 807693024
2631.9H07693024j201020l84140j087417J071090K31247k306900Q85697N61828k45666
$$ 807693024 806492004 806107864 805020447 806091537 806322784 804015884 804901581 805463409 805217743
2636.2H05217743K631149K916031q38165l207779j228104P68662l5477M9820k717514
$$ 805217743 807848892 810764923 809926758 806718979 805490875 806259537 806224060 806273880 803556366
2640.6H03556366N62668K965164K266922J94550j925660j822586j458664J150742K327652
$$ 803556366 804119034 807084198 809351120 809545670 807620010 805797424 804338760 805489502 807817154
2644.9H07817154Q13217j364365R4223O41785l125992J95237R76257Q26950O16379
$$ 807817154 808630371 807266006 807360229 808002014 804876022 805071259 806047516 806874466 807490845
2649.3H07490845O7825J906204N33295q63342p90787j217346O83899q04062j602631
$$ 807490845 807558670 809464874 809998169 809134827 808344040 807126694 807810593 807006531 805403900
2653.6H05403900O48194J485672L21273k56805o31867m78744q9874q85086J490249
$$ 805403900 806052094 807537766 807859039 807602234 806970367 806491623 806401749 805516663 807006912
2657.9H07006912J623764r60846p72705k72979J194000J663818J70670J95617j055679
$$ 807006912 808630676 807669830 806897125 806624146 807818146 809481964 809652634 809848251 808792572
2662.3H08792572j462097j115723M17252P9040j670150p89643N18875K76261J601944
$$ 808792572 807330475 806214752 806632004 806711044 805040894 804251251 804770126 805046387 806648331
2666.6H06648331p17774r12246K398147K137833k427902l527680J485138r2468q30918
$$ 806648331 805930557 805018311 807416458 809554291 807126389 803598709 805083847 804991379 804160461
2670.9H04160461J230927r80530m63333m98810j655731J939926J471558P81479R68399
$$ 804160461 805391388 804410858 803947525 803448715 801792984 803732910 805204468 805985947 806954346
2675.3H06954346K82287k04620l083267M77676L076477O11267k279052j312562J377335
$$ 806954346 807236633 807032013 803948746 804426422 807502899 808114166 805835114 804522552 805899887
2679.6H05899887P09457R28116k481613j225586K586136n39703M57229r12246q36792
$$ 805899887 806609344 807537460 805055847 803830261 806416397 805876694 806333923 805421677 804584885
2684H04584885J817779M35562k500457k095108j66092L290252J766739n60989k473450
$$ 804584885 806402664 806838226 804337769 802242661 802076569 805366821 807133560 806572571 804099121
2688.3H04099121j080093P69577n53437r5901O63223j550445o71997K042465j29090
$$ 804099121 803019028 803788605 803235168 803139267 803802490 802252045 801580048 803622513 803493423
2692.6H03493423K432404m54102p74383o23550Q02001J132660q15277J118546L24478
$$ 803493423 805925827 805471725 804697342 804073792 804875793 806008453 805193176 806311722 806636200
2697H06636200k570877k018280l075791N32227K383347J157760J821366N3787k517014
$$ 806636200 804065323 802047043 798971252 799503479 801886826 803044586 804865952 804919739 802402725
2701.3H02402725j542587R47800p37992l65219Q47016Q4610K417907J070786k881775
$$ 802402725 800860138 801807938 801069946 800704727 801551743 801636353 804054260 805125046 802243271
2705.7H02243271j460648j31607M38156q2931J420746K30255p49054L81470J158905
$$ 802243271 800782623 800651016 801089172 801006241 802426987 802657242 801908188 802289658 803448563
2710H03448563J815872k791138k052917J195602q5373L78418j101837j102600m99268
$$ 803448563 805264435 802473297 800420380 801615982 801530609 801909027 800807190 799704590 799205322
2714.3G99205322k382889M95682J63040r46807N53283j411590j366577J663208P84683
$$ 799205322 796822433 797318115 797481155 796534348 797087631 795676041 794309464 795972672 796757355
2718.7G96757355p60727k145310j368789L17688j204224j598663p12433j786347J65787
$$ 796757355 795996628 793851318 792482529 792800217 791595993 789997330 789284897 787498550 787664337
2723G87664337m10232l38211j626816l76435O29960k376938m344025K81601K5864M49295
$$ 787664337 787254105 786915894 785289078 784912643 785542603 783165665 778821640 779103241 779129105 779578400
2727.9G79578400L77731k072830K53753J194230l16544j550674J472168J872787k457352
$$ 779578400 779956131 777883301 778137054 779331284 779014740 777464066 778936234 780809021 778351669
2732.2G78351669m48074j056671l92990K194824m93164K91977J019439q75320J348343
$$ 778351669 777903595 776846924 776453934 778648758 778155594 778447571 779467010 778591690 779940033
2736.5G79940033J986771R49173j897202j736679L077545K329407L85361J489181n95322
$$ 779940033 781926804 782875977 780978775 779242096 782319641 784649048 785034409 786523590 785928268
2740.9G85928268K639618N50080j400986J09177k872467P29217K809601Q83560N40619
$$ 785928268 788567886 789117966 787716980 787826157 784953690 785682907 788492508 789376068 789916687
2745.2G89916687L92456J608810k0294M86374n65719Q6593J465912j626587J95465
$$ 789916687 790309143 791917953 791897659 792384033 791818314 791904907 793370819 791744232 791939697
2749.5G91939697K604676j360703j707840N09033p8430j320724r80912J661301P67517
$$ 791939697 794544373 793183670 791475830 791984863 791906433 790585709 789604797 791266098 792033615
2753.9G92033615k50397j072616k95868n91431j548385K902298K151870R92432n445328
$$ 792033615 791783218 790710602 790414734 789823303 788274918 791177216 793329086 794321518 788876190
2758.2G88876190l586120O524734L063278j500168O29120j806945o94886P94754k418518
$$ 788876190 785290070 791814804 794878082 793377914 794007034 792200089 791505203 792299957 789881439
2762.6G89881439K025147J766662J035767j24512l027038M76303J345672P17926k183990
$$ 789881439 791906586 793673248 794709015 794584503 791557465 792033768 793379440 794097366 791913376
2766.9G91913376k182770N81665Q79212J286468O22406j81808k2583q02308j001892
$$ 791913376 789730606 790312271 791191483 792477951 793100357 792918549 792895966 792093658 791091766
2771.2G91091766k899j666336N71289K050476J076126k681579l447800K485733P88498
$$ 791091766 791088867 789422531 789993820 792044296 793120422 790438843 786991043 789476776 790265274
2775.6G90265274k510605M20151j044464q33817K9984J238708K612915o27975J28860
$$ 790265274 787754669 788174820 787130356 786296539 786326523 787565231 790178146 789550171 789679031
2779.9G89679031J204987j477661m605408k454452K213745J014328j236878j857757
$$ 789679031 790884018 789406357 784800949 782346497 784560242 785574570 784337692 782479935
2783.8G82479935J739883P97501j163864l36609J87683j2055j845016Q44726J809235
$$ 782479935 784219818 785017319 783853455 783516846 783704529 783692474 781847458 782692184 784501419
2788.1G84501419j438446p04346j67465j226196j366196r04693k693863k452240J837921
$$ 784501419 783062973 782358627 782191162 780964966 779598770 778694077 776000214 773547974 775385895
2792.5G75385895J196670q18252J781692o63604l633118j005478j363602J651154k74658
$$ 775385895 776582565 775764313 777546005 776882401 773249283 772243805 770880203 772531357 772256699
2796.8G72256699k216111j104202O27976J224670l311386l557892j11160R21478p25021
$$ 772256699 770040588 768936386 769564362 770789032 767477646 763919754 763808594 764730072 764005051
2801.1G64005051j731263P77970j021195l653869j869049P84607k298890m682464k191620
$$ 764005051 762273788 763051758 762030563 758376694 756507645 757292252 754993362 750310898 748119278
2805.5G48119278J187668J378097j522445J072158q16268l913956j896744k952576
$$ 748119278 749306946 750685043 749162598 750234756 749418488 745504532 743607788 740655212
2809.3G40655212j481399q41675j385498j334152n66941M57154j319504j117096j875000
$$ 740655212 739173813 738332138 736946640 735612488 735045547 735502701 734183197 733066101 731191101
2813.7G31191101l632049k826996k267456j982270J7624J227951n09414o317749l595047
$$ 731191101 727559052 724732056 722464600 720482330 720499954 721727905 721218491 714900742 711305695
2818G11305695o4927k216186m078980n97076J646500l901596l418351q55636j295624
$$ 711305695 711240768 709024582 704945602 704348526 705995026 702093430 698675079 697819443 696523819
2822.4F96523819l264618m304733k293473l620681l667527k811431m058686o885299
$$ 696523819 693259201 688954468 686660995 683040314 679372787 676561356 672502670 665617371
2826.2F65617371l553849l740005l058014k88239k208786n101776m791565l321304
$$ 665617371 662063522 658323517 655265503 654977264 652768478 647666702 642875137 639553833
2830.1F39553833q44841j294365m340858j990128o55708j615525p06176P60345K185745
$$ 639553833 638708992 637414627 633073769 631083641 630427933 628812408 628106232 628866577 631052322
2834.4F31052322k936477k33918N254822K137451o47735j02463N87158P72095L24554
$$ 631052322 628115845 627881927 633136749 635274200 634626465 634524002 635111160 635883255 636207809
2838.8F36207809J145249j021423r83391j501046j812057l91426j737480j700974l161316
$$ 636207809 637353058 636331635 635348244 633847198 632035141 631643715 629906235 628205261 625043945
2843.1F25043945n046310l653946m70696J78376l760987o174049l433075j745644k746162
$$ 625043945 619997635 616343689 615872993 616051369 612290382 606116333 602683258 600937614 598191452
2847.4E98191452l473930n174408m752846k022743k638588l452492j861420l028907
$$ 598191452 594717522 589543114 584790268 582767525 580128937 576676445 574815025 571786118
2851.3E71786118j169663O59599j665229k200432n66330o39267p78542J726189J692924
$$ 571786118 570616455 571276054 569610825 567410393 566844063 566204796 565426254 567152443 568845367
2855.6E68845367j812439o49871J246528L332672p858J622696J771126k074547j50185
$$ 568845367 567032928 566383057 567629585 570962257 570954399 572577095 574348221 572273674 572123489
2860E72123489R59893l16010J282272K496377K974090M15268j08566M95414k30178
$$ 572123489 573083382 572767372 574049644 576546021 579520111 579935379 579826813 580322227 580092049
2864.3E80092049j898766k577934J055450J667023j852760j140900j86539k927284
$$ 580092049 578193283 575615349 576670799 578337822 576485062 575344162 575157623 572230339
2868.2E72230339j183281J49613k159806r69734m606438m794349j580735l828048m292717
$$ 572230339 571047058 571196671 569036865 568067131 563460693 558666344 557085609 553257561 548964844
2872.5E48964844k558403m086533m368324o099281m810410m439049n546837l532676
$$ 548964844 546406441 542319908 537951584 531852303 527041893 522602844 517056007 513523331
2876.4E13523331m162979o032181p018547m799080l684654l544083o360474o858482
$$ 513523331 509360352 503328171 496309624 491510544 487825890 484281807 477921333 471062851
2880.2D71062851k991295j663933k410812m162636o372070m656029l061333l484230
$$ 471062851 468071556 466407623 463996811 459834175 453462105 448806076 445744743 442260513
2884.1D42260513l945999k621040q64296j154556k880021k751083J086540J345253
$$ 442260513 438314514 435693474 434829178 433674622 430794601 428043518 429130058 430475311
2887.9D30475311o52656l55606Q06312P38182J930313L317223K401848K446327L311386
$$ 430475311 429822655 429467049 430273361 431011543 432941856 436259079 438660927 441107254 444418640
2892.3D44418640L902168n10330p4425L832016L549958K145920K654418J957741M608231
$$ 444418640 448320808 447810478 447736053 451568069 455118027 457263947 459918365 461876106 466484337
2896.6D66484337M856682K252197J636772M73518q69789J824417M637681L079490J715012
$$ 466484337 471341019 473593216 475229988 475703506 474833717 476658134 481295815 484375305 486090317
2901D86090317L027305K755318J111374k712593L04222R66492J605720K121239n22690
$$ 486090317 489117622 491872940 492984314 490271721 490575943 491542435 493148155 495269394 494746704
2905.3D94746704j731872j441994n50385l339271l408814j344337l230591l288803
$$ 494746704 493014832 491572838 491022453 487683182 484274368 482930031 479699440 476410637
2909.2D76410637j976242l479538o342850m069404j341553l036118p026977q637162
$$ 476410637 474434395 470954857 464612007 460542603 459201050 456164932 449137955 440500793
2913D40500793n048027k651329o464195o683578p521973p473564o363449p001763p771301
$$ 440500793 435452766 432801437 426337242 419653664 412131691 404658127 398294678 391292915 383521614
2917.4C83521614p453461k730369n227356j0119896q620224m713478m642945o173286
$$ 383521614 376068153 373337784 368110428 357990532 349370308 344656830 340013885 333840599
2921.2C33840599l369064l584099q88825j093788k263527J994629L178940L231621
$$ 333840599 330471535 326887436 325998611 324904823 322641296 324635925 327814865 331046486
2925.1C31046486L929100O650085Q158265P132492N827446O088905O644211O152916
$$ 331046486 334975586 341625671 349783936 356916428 362743874 368832779 375476990 381629906
2928.9C81629906O702919Q070945Q262101J614875O27137O347580L976364L921051
$$ 381629906 388332825 396403770 404665871 406280746 406907883 413255463 417231827 421152878
2932.8D21152878K751999J709137K704811j21536n13878J436195L157311K81143k259560
$$ 421152878 423904877 425614014 428318825 428197289 427683411 429119606 432276917 432558060 430298500
2937.1D30298500P23419J656456p11632k344322Q91266l35083j608581p68280m9286
$$ 430298500 431021919 432678375 431966743 429622421 430513687 430178604 428570023 427801743 427752457
2941.5D27752457N6610k062378m55551J983642n90667j637879L14522J22414j615677
$$ 427752457 427809067 425746689 425291138 427274780 426684113 425046234 425360756 425483170 423867493
2945.8D23867493m284020j979790p58514k703209j442413n34477l427048l818855J690559
$$ 423867493 419583473 417603683 416845169 414141960 412699547 412165070 408738022 404919167 406609726
2950.1D06609726J866074k805596l323021J075859L542786J234550j601486l53699
$$ 406609726 408475800 405670204 402347183 403423042 406965828 408200378 406598892 406245193
2954D06245193J776963J652183J913452M02413j025772P63092j82038K093163M813690
$$ 406245193 408022156 409674339 411587791 411990204 410964432 411727524 411545486 413638649 418452339
2958.3D18452339J760178O20117j34850O5766M43268k463303o05812J798553J238480
$$ 418452339 420212517 420832634 420697784 420763550 421206818 418743515 418137703 419936256 421174736
2962.7D21174736r01146l770409l853149q56667k343788n737724j572113k082253m300842
$$ 421174736 420273590 416503181 412650032 411793365 409449577 403711853 402139740 400057487 395756645
2967C95756645l017998o09626k518158l489838j444817J921883j300201m431076J78108
$$ 395756645 392738647 392129021 389610863 386121025 384676208 386598091 385297890 380866814 381044922
2971.4C81044922J660004J941642J699410J982879J712265L98484J462784N01937L074494
$$ 381044922 382704926 384646568 386345978 388328857 390041122 390439606 391902390 392404327 395478821
2975.7C95478821N181045N076409L805732M84353J057930P378654P417183K789955
$$ 395478821 400659866 405736275 409542007 410026360 411084290 418462944 425880127 428670082
2979.6D28670082N706902Q023033L236580L963966Q560410K668151L245736P826957
$$ 428670082 434376984 442400017 445636597 449600563 458160973 460829124 464074860 471901817
2983.4D71901817P411156N389061N546608O382713M430275M229508N084228K119751
$$ 471901817 479312973 484702034 490248642 496631355 501061630 505291138 510375366 512495117
2987.3E12495117L811531Q142586M469299M06456J199341N306587O223069K892837
$$ 512495117 516306648 524449234 528918533 529324989 530524330 535830917 542053986 544946823
2991.1E44946823K752152N897331Q042335M516182N329628M746361N392647O213188
$$ 544946823 547698975 553596306 561638641 566154823 571484451 576230812 581623459 587836647
2995E87836647O197434O279525N208321P266960R141731O272888K475815N86396N319862
$$ 587836647 594034081 600313606 605521927 612788887 621930618 628203506 630679321 631265717 636585579
2999.3F36585579P822380K794647K457276M487991L154831r79309J932831K736053
$$ 636585579 644407959 647202606 649659882 654147873 657302704 656323395 658256226 660992279
3003.2F60992279L835678M278336K47574j472245l38058Q08487J011657K667923K858658
$$ 660992279 664827957 669106293 669353867 667881622 667543564 668352051 669363708 672031631 674890289
3007.5F74890289J386032J000672o88248l81012J272888M21143l115234k917176p8430
$$ 674890289 676276321 677276993 676588745 676207733 677480621 677901764 674786530 671869354 671790924
3011.9F71790924Q37631Q42057l505707n847168J95236J699600r42001R74121j238098
$$ 671790924 672628555 673470612 669964905 664117737 664312973 666012573 665070572 666044693 664806595
3016.2F64806595K04010j955719l207779n71671o47659J692886p87506l662262J72654
$$ 664806595 665010605 663054886 659847107 659275436 658627777 660320663 659533157 655870895 656043549
3020.6F56043549Q01239P94067Q47015k031097j694946J036377M491653k63214k84195
$$ 656043549 656844788 657638855 658485870 656454773 654759827 655796204 660287857 660024643 659740448
3024.9F59740448M421005L584824j889877J738204K440186M024048J786652q32901
$$ 659740448 664161453 667746277 665856400 667594604 670034790 674058838 675845490 675012589
3028.7F75012589M677505K810974L94516J756210L708649L699875K498322n94559o70166
$$ 675012589 679690094 682501068 682895584 684651794 688360443 692060318 694558640 693964081 693293915
3033.1F93293915L639297L268814j027755l66745K417144N298920L549118K206040
$$ 693293915 696933212 700202026 699174271 698807526 701224670 706523590 710072708 712278748
3036.9G12278748J788559K431030K603225N22690N79300Q71353j479339P39975K564773
$$ 712278748 714067307 716498337 719101562 719624252 720203552 721074905 719595566 720335541 722900314
3041.3G22900314J773377J825714J57013N86624J748047K742920k031327O3324K140580
$$ 722900314 724673691 726499405 726656418 727243042 728991089 731734009 729702682 729766006 731906586
3045.6G31906586K87018m55246l88566J01090Q02994J256561J22986J444397J074371
$$ 731906586 732193604 731738358 731349792 731450882 732253876 733510437 733633423 735077820 736152191
3050G36152191j8387R10721l188934O1340M409180k991638j540375L125000L355636
$$ 736152191 736133804 737044525 733855591 733916931 738326111 735334473 733794098 736919098 740274734
3054.3G40274734k046356m000625P7438j28860j39313j90048j499405Q54950J68991
$$ 740274734 738228378 734227753 734305191 734176331 734037018 733846970 732347565 733202515 733371506
3058.6G33371506q27332l167419m063034j748276m16946N44204j774597p095J324463
$$ 733371506 732544174 729376755 725313721 723565445 723148499 723692703 721918106 721911011 723235474
3063G23235474l051072k546463k026214k488403o494141m210968n87998m577255m535064
$$ 723235474 720184402 717637939 715611725 713123322 706629181 702418213 701830215 697252960 692717896
3067.3F92717896j767579j472015m651794p255631m030456k273255k731094k449265
$$ 692717896 690950317 689478302 684826508 677570877 673540421 671267166 668536072 666086807
3071.2F66086807l647842k952881j633072o145935j159439j426468m039612L48511
$$ 666086807 662438965 659486084 657853012 651707077 650547638 649121170 645081558 645430069
3075F45430069Q39691l448944k994537m74739J044578K304154l06931m351501k408562
$$ 645430069 646269760 642820816 639826279 639351540 640396118 642700272 642393341 638041840 635633278
3079.4F35633278J503296k744408k264404J281051O83175J863403l587723n856132
$$ 635633278 637136574 634392166 632127762 633408813 634091988 635955391 632367668 626511536
3083.2F26511536o38085L368111K425270r07860m357986j474152N351334O154365N645104
$$ 626511536 625873451 629241562 631666832 630758972 626400986 624926834 630278168 636432533 642077637
3087.6F42077637M548874N318298M351044M648361K598648K476120N726623O891175
$$ 642077637 646626511 651944809 656295853 660944214 663542862 666018982 671745605 678636780
3091.4F78636780O573028N225144K350769O246490N745011O702957M490433L157577
$$ 678636780 685209808 690434952 692785721 699032211 704777222 711480179 715970612 719128189
3095.3G19128189N428772J576767L254700K996750K14080J649857N145721N458222
$$ 719128189 724556961 726133728 729388428 732385178 732599258 734249115 739394836 744853058
3099.2G44853058o28128R89761L624039J730423J219024P37916K942047L149032k014389
$$ 744853058 744224930 745214691 748838730 750569153 751788177 752526093 755468140 758617172 756602783
3103.5G56602783o49414J016846J317444P47833J394043K778320K519684J785736m3335
$$ 756602783 755953369 756970215 758287659 759035492 760429535 763207855 765727539 767513275 767469940
3107.8G67469940R8801K452164J567916j719970j309204k492142k456970L679046J705246
$$ 767469940 767568741 770020905 771588821 769868851 768559647 766067505 763610535 767289581 768994827
3112.2G68994827K284241K538071j793595j09329j792526K647018J935578j67923j08719
$$ 768994827 771279068 773817139 772023544 771914215 770121689 772768707 774704285 774536362 774427643
3116.5G74427643J534729j047287l947601L39813R3612K352448L151245L71094M76990
$$ 774427643 775962372 774915085 770967484 771307297 771400909 773753357 776904602 777275696 777752686
3120.8G77752686k085648p20596M98428Q82492p28149M879303L164749m764710l831482
$$ 777752686 775667038 774946442 775444870 776327362 775599213 780478516 783643265 778878555 775047073
3125.2G75047073M353943L305435n051117J558686m66385m513016K201920M474334
$$ 775047073 779401016 782706451 777655334 779214020 778747635 774234619 776436539 780910873
3129G80910873k59780J133041k709351k356414K806777j420898j309433K56729L77808
$$ 780910873 780651093 781784134 779074783 776718369 779525146 778104248 776794815 777051544 777429352
3133.4G77429352Q86383j4572O52084L89481K577819P82776j127700p7439k435760
$$ 777429352 778315735 778301163 778953247 779342728 781920547 782703323 781575623 781498184 779062424
3137.7G79062424j431427K044754m25873k468567L344345K226486J40305J529999K556152
$$ 779062424 777630997 779675751 779249878 776781311 780125656 782352142 782492447 784022446 786578598
3142.1G86578598k69394m743729p71789j767502j54343O917267J669617j697998l693161
$$ 786578598 786309204 781565475 780793686 779026184 778871841 785789108 787458725 785760727 782067566
3146.4G82067566R14078n59922L92991K282180o64825J177826L31802j433639q31681
$$ 782067566 782981644 782421722 782814713 785096893 784432068 785609894 785941696 784508057 783676376
3150.7G83676376J247712r88923j623764J93100o03408j095353j738433K587890P6142
$$ 783676376 784924088 783935165 782311401 782504501 781901093 780805740 779067307 781655197 781731339
3155.1G81731339J715240J707916k841186R93271R83657k604293j145783K077561l66974
$$ 781731339 783446579 785154495 782313309 783306580 784290237 781685944 780540161 782617722 782250748
3159.4G82250748l553772k95716K532120N56564K185364q01773k318344j65100M635544
$$ 782250748 778696976 778401260 780933380 781489944 783675308 782873535 780555191 780390091 785025635
3163.8G85025635J422043j069947P1106p88879j230774L72925R29413r63822m006958
$$ 785025635 786447678 785377731 785448837 784659958 783429184 783802109 784731522 783767700 779760742
3168.1G79760742o14776j906434o50024M484024L446198J899948J150894k555084m045410
$$ 779760742 779145966 777239532 776589508 781073532 784519730 786419678 787570572 785015488 780970078
3172.4G80970078J006851L082733j905441l909073k98081K319565K577591R6664N09644
$$ 780970078 781976929 785059662 783154221 779245148 778947067 781266632 783844223 783940887 784450531
3176.8G84450531j656418J610336K607728J104202K15912q58994j708221k707672r53064
$$ 784450531 782794113 784404449 787012177 788116379 788332291 787473297 785765076 783057404 782104340
3181.1G82104340l75367K366J034240J228485j413955P06176N97916M08020L571854
$$ 782104340 781728973 781731339 782765579 783994064 782580109 783286285 783884201 784292221 787864075
3185.5G87864075l393860l369370L88031N787354j773377n147400k056274j132736
$$ 787864075 784470215 781100845 781488876 787276230 785502853 780355453 778299179 777166443
3189.3G77166443N290222N244446J63193j584320J27105p86056l273926l050919l94668
$$ 777166443 782456665 787701111 787864304 786279984 786407089 785621033 782347107 779296188 778901520
3193.7G78901520k423020N113602M233322n180130K69165R66187j041489M276810j791458
$$ 778901520 776478500 781592102 785825424 780645294 780914459 781880646 780839157 785115967 783324509
3198G83324509k660828J160889J710510j07117q22372J714325o34308m928742K998810
$$ 783324509 780663681 781824570 783535080 783427963 782605591 784319916 783685608 778756866 781755676
3202.3G81755676K914810l633422k675782K229004K558289o03333j265106K273712
$$ 781755676 784670486 781037064 778361282 780590286 783148575 782545242 781280136 783553848
3206.2G83553848K666550J92337l125305n15061j473465k678070L853073L151627k130127
$$ 783553848 786220398 786412735 783287430 782772369 781298904 778620834 782473907 785625534 783495407
3210.5G83495407j999969K740860J752548m076767J535568P57752j916123n404587
$$ 783495407 781495438 784236298 785988846 781912079 783447647 784205399 782289276 776884689
3214.4G76884689L038178L810577j548691J163102j824418l512344K613449J010361
$$ 776884689 779922867 783733444 782184753 783347855 781523437 778011093 780624542 781634903
3218.3G81634903K00424K606354k308960m933701l2043L481216N24216J025467r34906
$$ 781634903 781835327 784441681 782132721 777199020 777166977 780648193 781172409 782197876 781262970
3222.6G81262970O02035j78756j649399j865082k529373N87387L409653n607605l756714
$$ 781262970 781865005 781686249 780036850 778171768 775642395 776229782 779639435 774031830 770275116
3226.9G70275116Q34732K673950N724259J584396j590424N690155j237411n135269
$$ 770275116 771109848 773783798 779508057 781092453 779502029 785192184 783954773 778819504
3230.8G78819504K701263l49884k290344p31506l427582P24335L907012k036438q02993
$$ 778819504 781520767 781170883 778880539 778149033 774721451 775445786 779352798 777316360 776513367
3235.1G76513367J437988M51736l35998J497726k255859n68695J165771K157288P20673
$$ 776513367 777951355 778403091 778067093 779564819 777308960 776740265 777906036 780063324 780783997
3239.5G80783997J32446n13001j674728l634033j854325M142304J700516l7766m70276
$$ 780783997 780916443 780403442 778728714 775094681 773240356 777382660 779083176 779045410 778575134
3243.8G78575134J512986K29034l076325m526977k416992K922287N419082L516236
$$ 778575134 780088120 780317154 777240829 772713852 770296860 773219147 778638229 782154465
3247.7G82154465k120819k698059n95398Q77075K286224n910797j829758J879883J241379
$$ 782154465 780033646 777335587 776740189 777617264 779903488 773992691 772162933 774042816 775284195
3252G75284195n24674m78363J761170L142471K758408j382370n862961O91147K040176
$$ 775284195 774759521 774281158 776042328 779184799 781943207 780560837 774697876 775389023 777429199
3256.4G77429199m882049n416184J507416N104752j31989p26547O98776K754211n07812
$$ 777429199 772547150 767130966 768638382 773743134 773611145 772884598 773583374 776337585 775829773
3260.7G75829773m823608m96827L741532J187057k133484J595002l902741k940597
$$ 775829773 771006165 770509338 774250870 775437927 773304443 774899445 770996704 768056107
3264.5G68056107K29187k681275N33676K561722j082840o99081K592315J034775N20172
$$ 768056107 768285294 765604019 766137695 768699417 767616577 766917496 769509811 770544586 771064758
3268.9G71064758M737702j604920k413406j118240l483963j693268j599884M091949
$$ 771064758 775802460 774197540 771784134 770665894 767181931 765488663 763888779 767980728
3272.7G67980728J96610j955033j455841l813934M114151M933014J572189k788696
$$ 767980728 768177338 766222305 764766464 760952530 765066681 769999695 771571884 768783188
3276.6G68783188l767853L200150K786178k57644n19333Q87451l82462j79367Q36258
$$ 768783188 765015335 768215485 771001663 770744019 770224686 771112137 770729675 770550308 771386566
3280.9G71386566q46023J669235k97394k941971j938782L352280L540802j725845J453476
$$ 771386566 770540543 772209778 771912384 768970413 767031631 770383911 773924713 772198868 773652344
3285.3G73652344j403809j883316k379913J045913K503891L140412r58557m272919
$$ 773652344 772248535 770365219 767985306 769031219 771535110 774675522 773716965 769444046
3289.1G69444046k999725o55213K050400J956329m687042l389511J157379O616059
$$ 769444046 766444321 765789108 767839508 769795837 765108795 761719284 762876663 769492722
3293G69492722M916229k757034l827591l257904R5672K965546J214981l08304K996140
$$ 769492722 774408951 771651917 767824326 764566422 764662094 767627640 768842621 768534317 771530457
3297.3G71530457Q26263j297073k545395o430817J259461J585845m122009K733460
$$ 771530457 772356720 771059647 768514252 762083435 763342896 764928741 760806732 763540192
3301.2G63540192K954178k683411m827957J347274J583329o054154k686310L115006
$$ 763540192 766494370 763810959 758983002 760330276 761913605 755859451 753173141 756288147
3305.1G56288147K522964j458129J805496J779938j346817L03421Q05053j238098o950989
$$ 756288147 758811111 757352982 759158478 760938416 759591599 759895020 760700073 759461975 752510986
3309.4G52510986j147384J247558o79855l609161M62799p93534l382110M6615l9749
$$ 752510986 751363602 752611160 751931305 748322144 748784943 747991409 744609299 744655914 744616165
3313.7G44616165M6539j306152J446457J134033j25808J568222l856659k313691j130828
$$ 744616165 744662704 743356552 744803009 745937042 745811234 747379456 743522797 741209106 740078278
3318.1G40078278R16595L83148J108017m859695p706604N757904N352783j556244j483002
$$ 740078278 740994873 741378021 742486038 737626343 729919739 735677643 741030426 739474182 737991180
3322.4G37991180k498016k04468j243820k55356J380692k603760p12357j961059n550079
$$ 737991180 735493164 735288696 734044876 733789520 735170212 732566452 731854095 729893036 724342957
3326.8G24342957R28497K790680k883225K204819M961166M106217P13653n870590k607193
$$ 724342957 725271454 728062134 725178909 727383728 732344894 736451111 737164764 731294174 728686981
3331.1G28686981J060791k320404k214660L312530j148529L125229M020233j180572
$$ 728686981 729747772 727427368 725212708 728525238 727376709 730501938 734522171 733341599
3335G33341599q48008J721802L89710j810685N037308P29446n547332l547745K277069
$$ 733341599 732493591 734215393 734605103 732794418 737831726 738561172 733013840 729466095 731743164
3339.3G31743164M460526J606292M137192K371445n27802L91922j680603J704025L551178
$$ 731743164 736203690 737809982 741947174 744318619 743790817 744182739 742502136 744206161 747757339
3343.6G47757339K558136k275085k110138K550430k433624j729660r13925J706390
$$ 747757339 750315475 748040390 745930252 748480682 746047058 744317398 743403473 745109863
3347.5G45109863N514221K79694m24042n31845K183533M754257P46842M31823M970856
$$ 745109863 750624084 750903778 750479736 749947891 752131424 756885681 757632523 758064346 763035202
3351.8G63035202O58264l932800k950974K232819L847122j909408l934555R81597m5089
$$ 763035202 763693466 759760666 756809692 759042511 762889633 760980225 757045670 758027267 757982178
3356.2G57982178K901458J928254j517105m79508l006439N33981L411713j152802n40695
$$ 757982178 760883636 762811890 761294785 760815277 757808838 758342819 761754532 760601730 760061035
3360.5G60061035J401291M922485K159958k631836N83191N267716k438584j301117
$$ 760061035 761462326 766384811 768544769 765912933 766496124 771763840 769325256 768024139
3364.4G68024139J652527J983719k156982k717438K098236o13403j132279K364273
$$ 768024139 769676666 771660385 769503403 766785965 768884201 768270798 767138519 769502792
3368.2G69502792P75605K314834j208954k567749N62134N67703k091903M67071J168061
$$ 769502792 770278397 772593231 771384277 768816528 769378662 769946365 767854462 768321533 769489594
3372.6G69489594J037139l549881p44476l909454j663666Q142853M040375j514054
$$ 769489594 770526733 766976852 766232376 762322922 760659256 768802109 772842484 771328430
3376.4G71328430J228867J158676j953507k937316J86233j163254j716537J767044
$$ 771328430 772557297 773715973 771762466 768825150 769011383 767848129 766131592 767898636
3380.3G67898636J084823l778915j398239L879929K852401K221451L77426j020126
$$ 767898636 768983459 765204544 763806305 767686234 770538635 772760086 773137512 772117386
3384.1G72117386J784592J314621j503144j825866k998734M07486P95822k861023R5825
$$ 772117386 773901978 775216599 773713455 771887589 768888855 769296341 770092163 767231140 767326965
3388.5G67326965K478638J080322j042633l008117k267838j967316N153351l99551
$$ 767326965 769805603 770885925 769843292 766835175 764567337 762600021 767753372 767353821
3392.3G67353821L96728L588028m67987k356262n94864R78775j44806J404038J640701
$$ 767353821 767750549 771338577 770870590 768514328 767919464 768898239 768753433 770157471 771798172
3396.7G71798172J77231K119903P1412m835206J102295L777695l343811j50223k46963
$$ 771798172 771975403 774095306 774166718 769331512 770433807 774211502 770867691 770717468 770470505
3401G70470505q532715J85394M700928j762466O47888J642456J419296n35660J543122
$$ 770470505 761937790 762123184 766824112 765061646 765709534 767351990 768771286 768235626 769778748
3405.4G69778748K489776k817535N75485N086212o28128o210937k749939n19638j860276
$$ 769778748 772268524 769450989 770026474 775112686 774484558 768273621 765523682 765004044 763143768
3409.7G63143768P462921O113739k604370l286895Q63647J459045k997741l454056
$$ 763143768 770606689 776720428 774116058 770829163 771692810 773151855 770154114 766700058
3413.6G66700058J462860K316361L197403k613678l341675O86493k565232l86505M766693
$$ 766700058 768162918 770479279 773676682 771063004 767721329 768407822 765842590 765456085 770222778
3417.9G70222778J820298l174134m751129K13547M93545L608170L526840K80762k67944
$$ 770222778 772043076 768868942 764117813 764331360 764824905 768433075 771959915 772240677 771972733
3422.2G71972733k178421m70734o084137L796692J2423477m135590r780044N78995
$$ 771972733 769794312 769323578 763239441 767036133 779459610 775324020 765543976 766122971
3426.1G66122971k299881m029847L926392K279205N204316N520401m879990r44824
$$ 766122971 763823090 759793243 763719635 765998840 771203156 776723557 771843567 770898743
3429.9G70898743K24914k58331j367111J5945Q08182j922608M844971O734925k379227
$$ 770898743 771123657 770865326 769498215 769514160 770322342 768399734 773244705 779979630 777600403
3434.3G77600403p881775k512970J049652K01874N59158K491226J935578J171341L335647
$$ 777600403 769718628 767205658 768255310 768457184 769016342 771507568 773443146 774614487 777950134
3438.6G77950134m90799l044204o904679m281997R319381R64279n445632K481002K035065
$$ 777950134 777459335 774415131 767510452 763228455 772547836 773512115 768066483 770547485 772582550
3443G72582550L99857n97916J885910J830826l841782P77588L864670o499252n975190
$$ 772582550 772982407 772384491 774270401 776101227 772259445 773037033 776901703 770402451 764427261
3447.3G64427261N036164l48358L2806K536621Q87985p43789M63714M57535m266892
$$ 764427261 769463425 769115067 769147873 771684494 772572479 771828690 772292404 772749939 768483047
3451.6G68483047J440278K341461j437683J750335J241303j986237M18701L30506l523178
$$ 768483047 769923325 772264786 770827103 772577438 773818741 771832504 772251205 772581711 769058533
3456G69058533j266403J943511L7156M927673K441711n525055k98080O25763j931152
$$ 769058533 767792130 769735641 769772797 774700470 777142181 771617126 771319046 771944809 770013657
3460.3G70013657q52738J586685m210052j970139M720612O58951n483856J00326R333801
$$ 770013657 769160919 770747604 766537552 764567413 769288025 769946976 764463120 764563446 773897247
3464.7G73897247N200196l645249m569092L237687L600082m73633m291382m608459
$$ 773897247 779097443 775452194 770883102 774120789 777720871 777247238 772955856 768347397
3468.5G68347397p72171J681442N66330Q27713n13382p14340J051330k248535j024704
$$ 768347397 767575226 769256668 769822998 770650711 770137329 769422989 770474319 768225784 767201080
3472.9G67201080L049698P296372O00509l220977J973724J711426l901062j443329
$$ 767201080 770250778 777547150 778147659 774926682 776900406 778611832 774710770 773267441
3476.7G73267441j629257M70428L664169j110000l694840j069259J461029L403167
$$ 773267441 771638184 772108612 775772781 774662781 770967941 769898682 771359711 774762878
3480.6G74762878J514206j238327l471908l762665L077774M352722l202057j98059
$$ 774762878 776277084 775038757 771566849 767804184 770881958 775234680 772032623 771834564
3484.4G71834564P22885l73153j642533j722107O32172L165894N05676n126648J730575
$$ 771834564 772557449 772184296 770541763 768819656 769451828 772617722 773123398 767996750 769727325
3488.8G69727325L405381k739945j184234J682968L230743M073181L383866o84281
$$ 769727325 773132706 770392761 769208527 770891495 774122238 778195419 781579285 780895004
3492.6G80895004r571228j375198O218796p86438k150650j657639j217041j299744
$$ 780895004 771323776 769948578 776167374 775380936 773230286 771572647 770355606 769055862
3496.5G69055862J694031O20651K230225M461823j811066k159042K79922j770782K259216
$$ 769055862 770749893 771370544 773600769 778062592 776251526 774092484 774372406 772601624 774860840
3500.8G74860840O18515m361344J218110M085540J78528l539047m758606L203049N596695
$$ 774860840 775479355 771118011 772336121 776421661 776600189 773061142 768302536 771505585 777102280
3505.2G77102280m024048j252365N505218J735764m679337m417114M247665N712967
$$ 777102280 773078232 771825867 777331085 779066849 774387512 769970398 774218063 779931030
3509G79931030J160965m767456l163757K503204K704621L267822J613388j335144j791458
$$ 779931030 781091995 776324539 773160782 775663986 778368607 781636429 783249817 781914673 780123215
3513.4G80123215l557053k832641K208938K68631J78986K116928l07694m67529o71310
$$ 780123215 776566162 773733521 775942459 776211090 776390076 778507004 778199310 777731781 777060471
3517.7G77060471J148605l187637k952652L635482K744065k491532O680832L025589
$$ 777060471 778209076 775021439 772068787 775704269 778448334 775956802 782637634 785663223
3521.6G85663223Q29544l81775o866989k754211M483871m565048m285278M438324j44425
$$ 785663223 786492767 786110992 779244003 776489792 780973663 776408615 772123337 776561661 776417236
3525.9G76417236l006744K285843j766892l145828M490814L772507L199616M20608
$$ 776417236 773410492 775696335 773929443 770783615 775274429 779046936 782246552 782667160
3529.8G82667160j744232l070679k252426M265518j688385n705566K793045K779999
$$ 782667160 780922928 777852249 775599823 779865341 778176956 772471390 775264435 778044434
3533.6G78044434p03583N15289n89447L487702k125397o25000j357804J801758Q18863
$$ 778044434 777340851 777856140 777266693 780754395 778628998 778003998 776646194 778447952 779266815
3538G79266815k646866L242264K701340p25327J783905J483384L297500J226959p123565
$$ 779266815 776619949 779862213 782563553 781838226 783622131 785105515 788403015 789629974 782506409
3542.3G82506409k838059r39712K32620J554642j817093q87451L049240L864364N19333
$$ 782506409 779668350 778728638 778961258 780515900 778698807 777811356 780860596 784724960 785244293
3546.6G85244293m917145m306793o39114K669601M037552K509155J753312k301026
$$ 785244293 780327148 776020355 775381241 778050842 782088394 784597549 786350861 784049835
3550.5G84049835k829971k649613j669845M123993N399322m16259L5705p23343j036224
$$ 784049835 781219864 778570251 776900406 781024399 786423721 786007462 786043167 785319824 784283600
3554.8G84283600k032013k247238O12869J773911L542785N251465R51309o142196p03736
$$ 784283600 782251587 780004349 780617218 782391129 785933914 791185379 792136688 785994492 785290756
3559.2G85290756l26385q007279J04523L347931k456055J158905Q086014J779251k130966
$$ 785290756 784964371 776957092 777061615 780409546 777953491 779112396 787198410 788977661 786846695
3563.5G86846695P58667L012619K35062j89362n526504p507935j575775Q516617P44247
$$ 786846695 787605362 790617981 790853043 790663681 785137177 777629242 776053467 784570084 785314331
3567.9G85314331m008102O989746N162735J790161l67584n661698m043731J189270
$$ 785314331 781306229 788295975 793458710 795248871 794881287 789219589 785175858 786365128
3571.7G86365128K801055K838212n520554J792526P088700j535264q488998r13544
$$ 786365128 789166183 792004395 786483841 788276367 795365067 793829803 785340805 784427261
3575.6G84427261K172699j863937J315613n01786m428710L13720K738495p69653j709595
$$ 784427261 786599960 784736023 786051636 785549850 781121140 781434860 784173355 783403702 781694107
3579.9G81694107R21173K632599L179626k713928m183426N04227J424637M438629O303024
$$ 781694107 782615280 785247879 788427505 785713577 781530151 782034378 783459015 787897644 794200668
3584.3G94200668k422790n652619J570282j043014n368271k195129M73327l05481M130326
$$ 794200668 791777878 786125259 787695541 786652527 781284256 779089127 779562454 779256973 783387299
3588.6G83387299N074386Q14285m308090M01917K526779j836777M102631k092819n901719
$$ 783387299 788461685 789275970 784967880 785369797 787896576 786059799 790162430 788069611 782167892
3592.9G82167892j573410J201630J874313m6691l799973Q28323L711319J45569n5389
$$ 782167892 780594482 781796112 783670425 783623734 779823761 780652084 784363403 784508972 784453583
3597.3G84453583K476578L196258k564087m711685j138382J539536M647369J908035
$$ 784453583 786930161 790126419 787562332 782850647 781712265 783251801 787899170 789807205
3601.1G89807205J407318J27945J600037J135101m337539k299195j13373O80390J949081
$$ 789807205 791214523 791342468 792942505 794077606 789740067 787440872 787327499 788007889 789956970
3605.5G89956970J230545k032089p233429j347961L455276K712326j384659n642395
$$ 789956970 791187515 789155426 781921997 780574036 784029312 786741638 785356979 779714584
3609.3G79714584n23834N963287Q453980J903534l353958o059799o872712L237152
$$ 779714584 779190750 785154037 793608017 795511551 792157593 786097794 779225082 782462234
3613.2G82462234N936356K095795o65741k824173j617203J944962O142273k010117
$$ 782462234 788398590 790494385 789828644 787004471 785387268 787332230 793474503 791464386
3617G91464386k399750K583390j090241N135345l92379j1548996l256302N24597O461029
$$ 791464386 789064636 791648026 790557785 795693130 795300751 783751755 780495453 781020050 787481079
3621.4G87481079P437286L76359o033478J400451L770905j501389K87247m335861J023712
$$ 787481079 794918365 795294724 789261246 790661697 794432602 792931213 793218460 788882599 789906311
3625.7G89906311M471664j38778j671524l265381o322556o204986l851700m322281
$$ 789906311 794377975 794239197 792567673 789302292 782979736 776774750 772923050 768600769
3629.6G68600769O844559J1529007q11768l278351K993393K187958m7607m154435J096421
$$ 768600769 775445328 786974335 786162567 782884216 785877609 788065567 788017960 783863525 784959946
3633.9G84959946N638809l251801m001693L750991P56760j750030l376008J469574
$$ 784959946 790598755 787346954 783345261 787096252 787853012 786102982 782726974 784196548
3637.8G84196548K125855J107941m00696P12967K541961j235961M609451J834793l864899
$$ 784196548 786322403 787430344 787029648 787742615 790284576 789048615 793658066 795492859 791627960
3642.1G91627960K655716N010910n89752m957047k220764R58939J274490N083695N911178
$$ 791627960 794283676 799294586 798704834 793747787 791527023 792485962 793760452 798844147 804755325
3646.5H04755325o376648j1182937j383286K949753j398087l514022N677414P581253
$$ 804755325 798378677 787195740 785812454 788762207 787364120 783850098 789527512 797108765
3650.3G97108765o326294p660599K645264L501815J058197o35604r00116K851638L265381
$$ 797108765 790782471 783121872 785767136 789268951 790327148 789691544 788791428 791643066 794908447
3654.7G94908447L72544j363068O37741n978317L488006J0168076m825592n673447
$$ 794908447 795280991 793917923 794555664 788577347 792065353 802233429 797407837 791734390
3658.5G91734390P304459L548050q434067j195145L795929M071350L78037k867127
$$ 791734390 799038849 802586899 794152832 792957687 796753616 800824966 801203003 798335876
3662.4G98335876l669204K14767N943680q60214m225922k274170J398621M887771k108917
$$ 798335876 794666672 794881439 800825119 799964905 795738983 793464813 794863434 799751205 797642288
3666.7G97642288J453934M752960n340805j1062393K435379Q043747J457367o473236
$$ 797642288 799096222 803849182 798508377 787445984 789881363 797925110 799382477 792909241
3670.6G92909241r952927P746582O135254K384338J486817L96652N559845j06201j3938904
$$ 792909241 782956314 790702896 796838150 799222488 800709305 801105957 806665802 806559601 792620697
3674.9G92620697k298355J0263138j332627j389694M040146K015076k954865j726913
$$ 792620697 790322342 800585480 799252853 797863159 801903305 803918381 800963516 799236603
3678.8G99236603k302399k074966M632644M402619k934113k251510K22930J597443
$$ 799236603 796934204 794859238 799491882 803894501 800960388 798708878 798931808 800529251
3682.6H00529251k62604j548004J759415P016144J419525l351975n63430N8364o084213
$$ 800529251 800266647 798718643 800478058 807494202 808913727 805561752 804998322 805056686 798972473
3687G98972473k461624L170319j0281296k12479J7571716P60575m294892o479797m953461
$$ 798972473 796510849 799681168 789399872 789187393 806759109 807519684 803224792 796744995 791791534
3691.3G91791534O731263K568130q42743N027161M751892o249161n756073o28738p65991
$$ 791791534 798522797 801090927 800248184 805275345 810027237 803778076 798022003 797393265 796627274
3695.6G96627274j030121j534043K861939L179169J302032J263580L278199j620331
$$ 796627274 795597153 794063110 796925049 800104218 801406250 802669830 805948029 804327698
3699.5H04327698l292389l822251j259918J107712J778488N378800J350250m234161
$$ 804327698 801035309 797213058 795953140 797060852 798839340 804218140 805568390 801334229
3703.4H01334229N93414k37885j658935K502670M070511j718369o713485M396591O510696
$$ 801334229 801927643 801689758 800030823 802533493 806604004 804885635 798172150 802568741 809079437
3707.7H09079437k259521m65546r90829p40586N894165n797195n103073Q908920j285629
$$ 809079437 806819916 806354370 805363541 804622955 810517120 804719925 799616852 808525772 807240143
3712H07240143j031571L971100m77600r14841J84479L679047L55987q42971l301392
$$ 807240143 806208572 810179672 809702072 808787231 808971710 812650757 813006744 812163773 808862381
3716.4H08862381l389587j07041j561355M251861L016358l394318k372742q01391L36380
$$ 808862381 805472794 805365753 803804398 808056259 811072617 807678299 805305557 804504166 804840546
3720.7H04840546l610459L88642K999649m341126N355225M82712k085801J741333m009323
$$ 804840546 801230087 801618729 804618378 800277252 805632477 806115189 804029388 805770721 801761398
3725.1H01761398o12793L038712n927277o056442J995163J998444K368621L355408
$$ 801761398 801148605 804187317 798260040 792203598 794198761 796197205 798565826 801921234
3728.9H01921234J227265P06176l776245j547165J823426j838456r016113O683807
$$ 801921234 803148499 803854675 800078430 798531265 800354691 798516235 789500122 796183929
3732.8G96183929N203705K816849J588974m761124m919510j115722R241104l17459
$$ 796183929 801387634 804204483 805793457 801032333 796112823 794997101 804238205 803920746
3736.6H03920746m292984O89316M97436l161697L938827R409714J158752k28881m744645
$$ 803920746 799627762 800317078 800814514 797652817 801591644 811001358 812160110 811931229 807186584
3741H07186584n239639K972107r85336r54819O269150J156006l1465225j1319047L5702363
$$ 807186584 801946945 804919052 803933716 802978897 809248047 810404053 778938828 767619781 803322144
3745.3H03322144O224365q665085P68509k677689J178665P761078L247681r478912
$$ 803322144 809546509 800881424 801649933 798972244 800150909 807911987 811159668 801680756
3749.2H01680756j7445679J4487457J4191590K625122j288834n425568p298813M045563
$$ 801680756 784235077 798722534 812914124 815539246 814250412 808824844 801526031 805571594
3753H05571594R76258m093247N31921K865906k38189K885971o756363m460450M069291
$$ 805571594 806547852 802454605 802986526 805852432 805614243 808500214 801743851 797283401 801352692
3757.4H01352692L371963L801270K454681q70819n216293l226242L748626K642517
$$ 801352692 804724655 808525925 810980606 810109787 804893494 801667252 805415878 808058395
3761.2H08058395K841263J050263m990769k343445j028366K61917M547272n065460
$$ 808058395 810899658 811949921 806959152 804615707 803587341 803849258 808396530 803331070
3765.1H03331070j0527191k426605Q650512N884476k989349j610108P763367M624100
$$ 803331070 792803879 790377274 799027786 804912262 801922913 800312805 808076172 812700272
3768.9H12700272j668702p602081q875656N091019O118240j925507J273957J080475
$$ 812700272 811031570 803429489 794553833 799644852 805763092 803837585 805111542 806192017
3772.8H06192017K875671L379059m144440J967087J110840m614716o32477k084045
$$ 806192017 809067688 812446747 808302307 810269394 811380234 806765518 806133041 804048996
3776.7H04048996j70059J560669K321472L05405k335129q321228j036759P969284M714356
$$ 804048996 803878937 805439606 807761078 808066483 805731354 797410126 796373367 804342651 809057007
3781H09057007j300736J969376j149902l481369K321319M046860q802643q938064P06558
$$ 809057007 807756271 809725647 808575745 805094376 807415695 811462555 802659912 793721848 794428406
3785.3G94428406M815521N550156j581879L334198J453934n993805p52793J287690
$$ 794428406 799243927 804794083 803212204 806546402 808000336 802006531 801253738 802541428
3789.2H02541428j555176o31790M063110L309708J581039J646652L529129l579101
$$ 802541428 800986252 800354462 804417572 807727280 809308319 810954971 814484100 810904999
3793H10904999n309067k395706l397751j917496M511261N250092j789170p77893j3580
$$ 810904999 805595932 803200226 799802475 797884979 802396240 807646332 805857162 805079269 805065689
3797.4H05065689l477554L25393m094467J335831N181808k34527K270584r57489j5171890
$$ 805065689 801588135 801913528 797819061 799154892 804336700 804102173 806372757 805415268 790243378
3801.7G90243378J550903J1769943K902222j700745J385956L734970k66723k117768
$$ 790243378 791794281 803564224 806466446 804765701 806151657 809886627 809619904 807502136
3805.6H07502136M25873K538605p507324l892289N651017K313003k141647q68149k336121
$$ 807502136 807928009 810466614 802959290 799067001 804718018 807031021 804889374 804021225 801685104
3809.9H01685104j372985R49554k344208K326966l542710o485138O586609L319092
$$ 801685104 800312119 801261673 798917465 801244431 797701721 791216583 797803192 801122284
3813.8H01122284k28806P197495N002518o519623j6355133J47705R881439K253571
$$ 801122284 800893478 808090973 813093491 806573868 790218735 790366440 800247879 802501450
3817.6H02501450K041092K482681L057251j929627l531036n590973p373199M200134
$$ 802501450 804542542 807025223 810082474 808152847 804621811 799030838 791657639 795857773
3821.5G95857773K947464N955581r71908j256332J467666J031723J816101K554093
$$ 795857773 798805237 804760818 803788910 802532578 804000244 805031967 806848068 809402161
3825.4H09402161j038285k975311m475784k836762j912918M614487N699692k794495
$$ 809402161 808363876 805388565 800912781 798076019 796163101 800777588 806477280 803682785
3829.2H03682785L42102J141815k48871K32239L49198M059066k060852j14288l304138
$$ 803682785 804024887 805166702 804917831 805150070 805499268 809558334 807497482 807383194 804079056
3833.6H04079056l831406J316376n321808m22211J0137024L665467k805558m384536
$$ 804079056 800247650 801564026 796242218 795820007 805957031 809622498 806816940 802432404
3837.4H02432404r007950N043792J2001725l203812o340103k553940n24139N461044
$$ 802432404 793424454 798468246 810469971 807266159 800926056 798372116 797847977 803309021
3841.3H03309021J871567R30023L592453k073746m668197p616425M535523M633483
$$ 803309021 805180588 806110611 809703064 807629318 802961121 795344696 799880219 804513702
3845.1H04513702k216186L645477j212158m412613Q94394P211304N549392n364990
$$ 804513702 802297516 805942993 804730835 800318222 801212616 808423920 813973312 808608322
3849H08608322m768982L05405J135559k67181k698899k959213j028290M601670l333970
$$ 808608322 803839340 804144745 805280304 805013123 802314224 799355011 798326721 802928391 799594421
3853.3G99594421j8038025j5367355J5695038J5756607P187882J950531N29403k321014
$$ 799594421 781556396 766189041 781884079 797640686 804828568 806779099 807308502 804987488
3857.2H04987488m54865m373245K801361M033127l460922l635407N07431J687851n104980
$$ 804987488 804532623 800159378 802960739 806993866 803532944 799897537 800404968 802092819 796987839
3861.5G96987839M355011M473572J500701Q50907j220551p034225p009964l06778Q290710
$$ 796987839 801342850 805816422 807317123 808168030 806947479 799913254 792903290 792596512 800887222
3865.9H00887222O549607o5995l665542P14721P15714k096481J440124K364044l307190
$$ 800887222 807436829 807370834 803705292 804420013 805135727 803039246 804479370 806843414 803536224
3870.2H03536224m003677P031555R7351l112030P242050K235337k213822p093277j0983963
$$ 803536224 799532547 806564102 806661453 803549423 810791473 813026810 810812988 803719711 792735748
3874.5G92735748L180237M140015N392990q56476K54364M217911l105240m589462O36215
$$ 792735748 795915985 800056000 805448990 804592514 804846878 809064789 805959549 801370087 802006302
3878.9H02006302Q038177o87179j2569199n761719L27836Q173751Q400040k863846
$$ 802006302 810044479 809357300 796788101 791026382 791354218 799527969 807928009 805064163
3882.7H05064163l675155M15954J372528M642639m193878r744034l634643Q386078
$$ 805064163 801389008 801804962 803177490 807820129 803626251 793882217 790247574 798633652
3886.6G98633652J637649m16565o07681N35355L757019M029388P538910j541672j0723800
$$ 798633652 800271301 799854736 799247055 799782410 803539429 807568817 815107727 813566055 802842255
3890.9H02842255r960862L695832N049515J820602J507416r46579l261261j267395
$$ 802842255 792881393 796577225 801626740 803447342 804954758 804008179 800746918 799479523
3894.8G99479523O87637J761017N756073J596146M59518M218674p084427q559571n483245
$$ 799479523 800167160 801928177 807684250 809280396 809739914 813958588 806874161 798314590 792831345
3899.1G92831345j931076Q012390P341079j950302n612488o823577N235061J0921021
$$ 792831345 790900269 798912659 806253738 804303436 798690948 791867371 797102432 808023453
3903H08023453L093338o959458p448501P666092K998199r854355m640960O014328Q78448
$$ 808023453 811116791 804157333 796708832 804374924 807373123 797518768 792877808 798892136 799770584
3907.3G99770584k937469M209289Q287354J082000p110519k272339L453293n024338
$$ 799770584 796833115 801042404 809329758 810411758 803301239 801028900 804482193 799457855
3911.2G99457855J823502L505707k714234p83768q33892J302871R42917j462936k27738
$$ 799457855 801281357 804787064 802072830 801289062 800455170 801758041 802700958 801238022 801010284
3915.5H01010284J149521k880859k121277m249954M577179K946548o006851R99451
$$ 801010284 802159805 799278946 797157669 792907715 797484894 800431442 794424591 795424042
3919.4G95424042K287140k287751M055710R74961J50451P87583J802597J534423Q60062
$$ 795424042 797711182 795423431 799479141 800454102 800604553 801392136 803194733 804729156 805589218
3923.7H05589218K042694m554138q193817j146393L145447J107788p55997J961289
$$ 805589218 807631912 803077774 794883957 793737564 796883011 797990799 797234802 799196091
3927.6G99196091L286590J342850K181091r96704l669967l544312J760407K495040
$$ 799196091 802482681 803825531 806006622 805009918 801339951 797795639 799556046 802051086
3931.4H02051086n423660n798950j368866O458969K951660j089401N707016J69678
$$ 802051086 796627426 790828476 789459610 795918579 798870239 797780838 803487854 803657532
3935.3H03657532m761582k676239p61108l07617J219864o088868L83377O809464M395523
$$ 803657532 798895950 796219711 795458603 795150986 796370850 790281982 790665359 797474823 801870346
3939.6H01870346M63028k438354l102417k966767n05295m2877J391373M365463M137650
$$ 801870346 802333374 799895020 796792603 793825836 793320541 793277664 794669037 799034500 803172150
3944H03172150J573333k037582n271912l51104N685577P572403n124435j0310212n270919
$$ 803172150 804745483 802707901 797435989 797084885 802770462 810342865 805218430 794908218 789637299
3948.3G89637299O424102l61099m097977R35288J195755J182098J040650k24533J566314
$$ 789637299 796061401 795700302 791602325 792537613 793733368 794915466 795956116 795731583 797297897
3952.7G97297897J959153j87302l060303j750793N129242K431640n067596L45001R69238
$$ 797297897 799257050 799069748 796009445 794258652 799387894 801819534 796751938 797096939 798066177
3957G98066177j804885k749177M390717K243958k136612r613K22625L051911P9193
$$ 798066177 796261292 793512115 797902832 800146790 798010178 798000565 798223190 801275101 801354294
3961.3H01354294l703842K52533M12902l719406l614959J995010K302322j237259L384629
$$ 801354294 797650452 797902985 798315887 794596481 790981522 792976532 795278854 794041595 797426224
3965.7G97426224J057281l190841p9346K711334L305206J903305J83411l393402j770325
$$ 797426224 798483505 795292664 795213318 797924652 801229858 803133163 803316574 799923172 798152847
3970G98152847M266358M314499k528153r691315l595657M690704o6375k76261O231537
$$ 798152847 802419205 806733704 804205551 794514236 790918579 795609283 795542908 795266647 801498184
3974.4H01498184J720963n586624k500992J419830r32617j421127M224319K440033
$$ 801498184 803219147 797632523 795131531 796551361 795618744 794197617 798421936 800861969
3978.2H00861969l400421q732300J030197M264679J256638K93655m28162K952652K810669
$$ 800861969 797461548 788729248 789759445 794024124 795280762 795574417 795146255 798098907 800909576
3982.6H00909576m338913k337493K204284M458313L900070n220260p60422J105194
$$ 800909576 796570663 794233170 796437454 800895767 804795837 799575577 798815155 799920349
3986.4G99920349k443466P29828J887665M87899l180389q48999J986923J787644j268311
$$ 799920349 797476883 798206711 800094376 800582275 797401886 796552887 798539810 800327454 799059143
3990.8G99059143k098923J124573m11453l909989J866761K717132j409073J398163
$$ 799059143 796960220 798084793 797673340 793763351 795630112 798347244 796938171 798336334
3994.6G98336334K193146q30002k189178o009674N543975M60663j837463K490921K254867
$$ 798336334 800529480 799699478 797510300 791500626 797044601 797505264 795667801 798158722 800413589
3999H00413589l072357o387329M110260
$$ 800413589 797341232 790953903 795064163
4000.4G95064163
$$ 795064163
$$ =====================================================
$$ Start of Advanced Chemistry Development specific data
$$ =====================================================
##$UVIR_ASSIGNMENT=ACDTABLE(X,Y,A,VT)
(1645.2935,33.1941,'1,3',undefined)
(3022.9614,65.476,'1,13',undefined)
(2854.6709,56.5426,'4,12',undefined)
(2886.9788,42.8044,'4,12',undefined)
(2923.6267,32.2641,'4,12',undefined)
(2953.0413,40.82,'4,12',undefined)
(2970.8831,38.0867,'4,12',undefined)
(1676.1548,0.872,'5,8',undefined)
(1645.2935,33.1941,'9,10',undefined)
(1434.5686,31.1354,'2,14,15',undefined)
(1450.9636,34.3923,'2,14,15',undefined)
(2854.6709,56.5426,'2,14,15',undefined)
(2886.9788,42.8044,'2,14,15',undefined)
(2923.6267,32.2641,'2,14,15',undefined)
(2953.0413,40.82,'2,14,15',undefined)
(2970.8831,38.0867,'2,14,15',undefined)
(1434.5686,31.1354,'6,16,17',undefined)
(1450.9636,34.3923,'6,16,17',undefined)
(2854.6709,56.5426,'6,16,17',undefined)
(2886.9788,42.8044,'6,16,17',undefined)
(2923.6267,32.2641,'6,16,17',undefined)
(2953.0413,40.82,'6,16,17',undefined)
(2970.8831,38.0867,'6,16,17',undefined)
(1434.5686,31.1354,'10,21,22',undefined)
(3022.9614,65.476,'10,21,22',undefined)
(3086.1309,62.4927,'10,21,22',undefined)
(1367.0594,29.3496,'7,18,19,20',undefined)
(1434.5686,31.1354,'7,18,19,20',undefined)
(2854.6709,56.5426,'7,18,19,20',undefined)
(2886.9788,42.8044,'7,18,19,20',undefined)
(2923.6267,32.2641,'7,18,19,20',undefined)
(2953.0413,40.82,'7,18,19,20',undefined)
(2970.8831,38.0867,'7,18,19,20',undefined)
(1367.0594,29.3496,'11,23,24,25',undefined)
(1434.5686,31.1354,'11,23,24,25',undefined)
(2854.6709,56.5426,'11,23,24,25',undefined)
(2886.9788,42.8044,'11,23,24,25',undefined)
(2923.6267,32.2641,'11,23,24,25',undefined)
(2953.0413,40.82,'11,23,24,25',undefined)
(2970.8831,38.0867,'11,23,24,25',undefined)

$$ =====================================================
$$ End of Advanced Chemistry Development specific data
$$ =====================================================
##END=$$ End of the data block
##END=$$ End of the link block
