##TITLE= Compound file, contains several data records
##JCAMP-DX= 5.0
##DATA TYPE= LINK
##BLOCKS=2
##ORIGIN= Department of Chemistry, UWI, JAMAICA
##OWNER= public domain
##TITLE= 4-chloroaniline
##JCAMP-DX= 4.24   $$ JSpecView
##DATA TYPE= INFRARED SPECTRUM
##BLOCK ID=1
##ORIGIN= Chem. Dep't, UWI, JAMAICA
##OWNER= public domain
##DATE= 00/06/08
##TIME= 14:33:00
##SPECTROMETER/DATA SYSTEM= PERKIN-ELMER 1000 FT-IR
##$MODELS=
<Models>
<ModelData id="pchloroaniline" type="MOL">
4-chloroaniline

  created with ArgusLab version 4.0.1
 14 14  0  0  0  0  0  0  0  0  0 V2000
   -0.1855   -1.2096    0.0152 C   0  0  0  0  0  0  0  0  0  0  0  0
    1.2065   -1.2032    0.0088 C   0  0  0  0  0  0  0  0  0  0  0  0
    1.9229    0.0052   -0.0001 C   0  0  0  0  0  0  0  0  0  0  0  0
    1.1995    1.2095   -0.0021 C   0  0  0  0  0  0  0  0  0  0  0  0
   -0.1925    1.2078    0.0043 C   0  0  0  0  0  0  0  0  0  0  0  0
   -0.8815   -0.0029    0.0127 C   0  0  0  0  0  0  0  0  0  0  0  0
   -2.6447   -0.0081    0.0254 Cl  0  0  0  0  0  0  0  0  0  0  0  0
    3.3190    0.0090   -0.0669 N   0  0  0  0  0  0  0  0  0  0  0  0
    3.7598    0.8478    0.2897 H   0  0  0  0  0  0  0  0  0  0  0  0
   -0.7271   -2.1499    0.0236 H   0  0  0  0  0  0  0  0  0  0  0  0
    1.7456   -2.1480    0.0056 H   0  0  0  0  0  0  0  0  0  0  0  0
    1.7330    2.1574   -0.0137 H   0  0  0  0  0  0  0  0  0  0  0  0
   -0.7397    2.1450    0.0043 H   0  0  0  0  0  0  0  0  0  0  0  0
    3.7647   -0.8238    0.2978 H   0  0  0  0  0  0  0  0  0  0  0  0
  1  2  4  0  0  0  0
  1  6  4  0  0  0  0
  1 10  1  0  0  0  0
  2  3  4  0  0  0  0
  2 11  1  0  0  0  0
  3  4  4  0  0  0  0
  3  8  4  0  0  0  0
  4  5  4  0  0  0  0
  4 12  1  0  0  0  0
  5  6  4  0  0  0  0
  5 13  1  0  0  0  0
  6  7  1  0  0  0  0
  8  9  1  0  0  0  0
  8 14  1  0  0  0  0
M  END
</ModelData>
<ModelData id="4ClA" type="XYZVIB" vibrationScale="0.1" baseModel="pchloroaniline">
14
Model[1]: Jmol 12.1.39_dev  2011-02-16 09:29
C    -0.18545   -1.20964    0.01521
C     1.20653   -1.20321    0.00878
C     1.92290    0.00523   -0.00012
C     1.19948    1.20948   -0.00208
C    -0.19253    1.20784    0.00429
C    -0.88145   -0.00291    0.01272
Cl   -2.64466   -0.00805    0.02538
N     3.31899    0.00898   -0.06688
H     3.75984    0.84784    0.28973
H    -0.72712   -2.14994    0.02362
H     1.74559   -2.14800    0.00561
H     1.73298    2.15736   -0.01373
H    -0.73970    2.14497    0.00428
H     3.76473   -0.82380    0.29780
14
Model[2]: PATH=Frequencies;IRIntensity=1.30 km/mol;Frequency=124.79 cm^-1
C    -0.18545   -1.20964    0.01521    0.00069    0.00042    0.09568
C     1.20653   -1.20321    0.00878    0.00053    0.00028    0.06711
C     1.92290    0.00523   -0.00012    0.00029    0.00001    0.00298
C     1.19948    1.20948   -0.00208    0.00054    0.00033    0.06711
C    -0.19253    1.20784    0.00429    0.00069    0.00045    0.09567
$$ [...]
Cl   -2.64466   -0.00805    0.02538    0.00002    0.00000   -0.00001
N     3.31899    0.00898   -0.06688   -0.04465   -0.00029   -0.03079
H     3.75984    0.84784    0.28973    0.29554    0.58308    0.22006
H    -0.72712   -2.14994    0.02362    0.00002    0.00060   -0.00018
H     1.74559   -2.14800    0.00561   -0.00046   -0.00126   -0.00159
H     1.73298    2.15736   -0.01373   -0.00047    0.00124   -0.00160
H    -0.73970    2.14497    0.00428    0.00003   -0.00060   -0.00017
H     3.76473   -0.82380    0.29780    0.29887   -0.57906    0.22561
14
Model[37]: PATH=Frequencies;IRIntensity=9.81 km/mol;Frequency=3649.41 cm^-1
C    -0.18545   -1.20964    0.01521   -0.00011    0.00004    0.00001
C     1.20653   -1.20321    0.00878    0.00004   -0.00039    0.00011
C     1.92290    0.00523   -0.00012    0.00000    0.00112   -0.00001
C     1.19948    1.20948   -0.00208   -0.00004   -0.00039   -0.00011
C    -0.19253    1.20784    0.00429    0.00011    0.00004   -0.00001
C    -0.88145   -0.00291    0.01272    0.00000   -0.00008    0.00000
Cl   -2.64466   -0.00805    0.02538    0.00000    0.00000    0.00000
N     3.31899    0.00898   -0.06688   -0.00024    0.07956   -0.00039
H     3.75984    0.84784    0.28973   -0.29473   -0.55629   -0.23602
H    -0.72712   -2.14994    0.02362    0.00018    0.00003   -0.00001
H     1.74559   -2.14800    0.00561   -0.00135   -0.00038   -0.00066
H     1.73298    2.15736   -0.01373    0.00136   -0.00036    0.00067
H    -0.73970    2.14497    0.00428   -0.00018    0.00003    0.00001
H     3.76473   -0.82380    0.29780    0.29805   -0.55238    0.24142
</ModelData>
</Models>
##$PEAKS=
<Peaks type="IR" xUnits="1/cm" yUnits="TRANSMITTANCE" >
<PeakData id="1" title="asymmetric stretch of NH2 group (~3474 cm-1)" peakShape="broad" model="4ClA.37" xMax="3494" xMin="3454"  yMax="1" yMin="0" />
<PeakData id="2" title="symmetric stretch of NH2 group (~3382 cm-1)" peakShape="broad" model="4ClA.36" xMax="3402" xMin="3362"  yMax="1" yMin="0" />
<PeakData id="3" title="Ar C-H asymmetric stretch(~2924 cm-1)" peakShape="broad" model="4ClA.32" xMax="2944" xMin="2904"  yMax="1" yMin="0" />
<PeakData id="4" title="Ar C-H symmetric stretch (~2854 cm-1)" peakShape="broad" model="4ClA.33" xMax="2874" xMin="2834"  yMax="1" yMin="0" />
<PeakData id="5" title="NH2 bend (~1616 cm-1)" peakShape="broad" model="4ClA.31" xMax="1636" xMin="1596"  yMax="1" yMin="0" />
<PeakData id="6" title="C=C aromatic ring (~1492 cm-1)" peakShape="broad" model="4ClA.27" xMax="1532" xMin="1452"  yMax="1" yMin="0" />
</Peaks>
##INSTRUMENT PARAMETERS=
  X: 4000.00,400.00 cm-1; 16 scans; mode ratio; resol 2.00 cm-1; apod strong
##DATA PROCESSING=
##MOLFORM= C6H6ClN
##MW=127.57
##CASREGISTRYNO= 106-47-8
##MP= 67
##BP= 232
##STATE= solid
##RESOLUTION=   2.000000
##DELTAX=  -2.000002
##XUNITS= 1/CM
##YUNITS= TRANSMITTANCE
##XFACTOR= 3.6E-3
##YFACTOR= 8.11943557E-7
##FIRSTX= 400
##FIRSTY= 0.70231256
##LASTX= 4000
##NPOINTS= 1801
##XYDATA= (X++(Y..Y))
111111H64977O1013L6897K0614j8737l4297J5668O6104L357p0833N4984N5309A059641
118333A082205J914j1481p437K924o137p907J986n668J6499R675j7943k5632j4369A027979
126667A037294J0000L213k310r387j3358j6138l754K996k346q268m260o50l718I82743
135000I63103j5632l105j2997k8484k8377k7582m7583q6682j24048j21773l5308E66483
142222H06130J64808O9533L4080J0037j805p907m837o066l104K671m476o210k888A048088
150556A052276L791K130r134n524M549Q773O50p654o209o824m151j408l935M909A039713
159444A037727o787N776N524j011j877l286n018j444j300n018k491J950N018o535A014946
168333A018737j08n524j300n379j1589j1877j1156j5055j6282j6499j5524j8556H53063
$$ plain form
111111 864977 925990 962887 983501 964764 930467 946135 1012239 1015596 944763 999747 1055056 1059641
118333 1082205 1084119 1072638 1065201 1068125 1061988 1054081 1056067 1050399 1066898 1076573 1058630 1032998 1018629 1027979
126667 1037294 1047294 1050507 1048197 1038810 1025452 1009314 1005560 1008556 1006210 997942 993682 993032 989314 982743
135000 963103 947471 944366 931369 902885 874508 846926 799343 712661 588613 466840 431532 566483
142222 806130 970938 1040471 1074551 1084588 1082783 1074876 1070039 1063973 1060869 1063540 1059064 1052854 1049966 1048088
150556 1052276 1056067 1058197 1049063 1043539 1048088 1056861 1057511 1049857 1043648 1036824 1032673 1031265 1027330 1032239 1039713
159444 1037727 1030940 1036716 1042240 1041229 1039352 1036066 1031048 1029604 1028304 1023286 1020795 1022745 1027763 1021228 1014946
168333 1018737 1018629 1013105 1011805 1006426 994837 982960 971804 956749 940467 923968 908444 889888 853063
176111G94505p5237p4154m8703J2672J31557K18203J44663M4694P076l429o860A138994
183333A126503j1806o354K744q159j0723R03k599l755K130J480O86l610o823m621A074551
192222A071049j2852j8593k0542N090K7258J7726K924M34J588l610m585J011K924A072060
200556A070941j480k672R03O607L610j011n271j697J805J553m044m368M729N705A077584
209444A080617L61J335j444l502r02k058l033j010m369l466k888m69L827K094A059533
218333A056067m007p293p148q557q375r098r242j2383j7763k7329l5706m4478H03459
226111G14611j24120j37659r1664r675N2890L6535l3972o1482j4008P6357J61413G46994
233333H78191Q2638N1301L0868J9206J2781P328P149O173K383J950M223K094J697A111231
$$ plain form
176111 794505 719268 645114 596411 609083 740640 958843 1103506 1148200 1155276 1151847 1144987 1138994
183333 1126503 1114697 1108343 1111087 1102928 1092205 1093108 1090509 1086754 1088884 1090364 1091050 1087440 1080617 1075996 1074551
192222 1071049 1058197 1039604 1019062 1024152 1051410 1069136 1072060 1072494 1074082 1070472 1065887 1066898 1069822 1072060
200556 1070941 1069461 1066789 1067692 1074299 1077909 1076898 1071627 1069930 1071735 1073288 1069244 1064876 1069605 1075310 1077584
209444 1080617 1080978 1082313 1080869 1077367 1076465 1074407 1071374 1070364 1065995 1062529 1059641 1059172 1062999 1065093 1059533
218333 1056067 1052060 1044767 1037619 1029062 1020687 1011589 1002347 989964 972201 944872 909166 864688 803459
226111 714611 590491 452832 361168 351493 404383 440918 406946 345464 331456 407813 569226 746994
233333 878191 960829 1012130 1042998 1062204 1074985 1082313 1089462 1095635 1098018 1099968 1104191 1106285 1107982 1111231
241667A115492J263K455J264j878M70L827r03m549m946j841K058J733J841L61A115853
250556A116430j877j480M151K672J047%L25l935m044j733m946j5776q268J1011A105455
259444A103072k996N271L466r39p94j264r39j263j264j08M69r02k636l61m69k383A094011
269444A093902j119j624l719l646l177j228m69j011k130j372k924m802p726j1986A027438
278333I87075n9171j7655N0977N6103K3250O715r75k671m33q67p94j841J299J011A041807
287222A040038o86k852r75j769k816n813q339j1337n595P003J3828R567K527k419A025885
296111A021878p798p545k058j408q629j2022j6787k4550n4551j33506j87877l6897F20564
303889G34756K00187J13470R784o137p835q917j1372j7185k4116k7005j9351k166I47038
$$ plain form
241667 1115492 1116755 1119210 1120474 1118596 1119066 1122893 1121990 1117441 1112495 1110654 1112712 1114445 1116286 1116647 1115853
250556 1116430 1114553 1113073 1117224 1119896 1120943 1120943 1121268 1117333 1113289 1111556 1106610 1090834 1082566 1093577 1105455
259444 1103072 1100076 1105347 1108813 1107874 1107080 1105816 1104877 1103614 1102350 1102242 1102711 1101809 1099173 1098812 1098343 1095960 1094011
269444 1093902 1092783 1091159 1087440 1083794 1080617 1079389 1078920 1077909 1075779 1074407 1071483 1066681 1058955 1046969 1027438
278333 987075 927904 910249 961226 1017329 1040579 1047294 1046319 1043648 1043215 1042348 1041554 1039713 1041012 1042023 1041807
287222 1040038 1039352 1036500 1035525 1033756 1030940 1025127 1016788 1005451 999856 1006859 1020687 1030254 1032781 1030362 1025885
296111 1021878 1014080 1006535 1004477 1003069 994440 982418 965631 941081 886530 753024 565147 528250 620564
303889 734756 934943 1048413 1058197 1052060 1044225 1035308 1023936 1006751 982635 955630 936279 934113 947038
311667I59782O354O896J4477K3538K1301J2636M332M33j119l971l755o679o029A026788
320000A027113j661j624j408k167l682k491m657p618j0903j6174k2744l3575q8307F89556
328333F21864K4333J59933K00188O1699J119n704m477n343m765o391m187l177A032131
336111A028954j083q66k203k707j950l032l250l574n271m621k996m585m333k996I82960
345000I81913l502n055o065p112q917j0289j0939j3033j5344j6390j7582j7402H28694
352778G99235l2095l2204l4261l7474m2926m6716n6573p5093o9822j8412N5453E55219
360000G61038J62028Q3252L7799J6535N921%m585l899l249r75j589o859q701o137A025452
368889A023178J083Q66L25J769J733j300J09J408o50k058l177n090l575k166j299A010831
$$ plain form
311667 959782 966136 973032 987509 1011047 1032348 1044984 1049316 1049749 1048630 1044659 1040904 1034225 1028196 1026788
320000 1027113 1025452 1023828 1022420 1020253 1016571 1014080 1009423 1001805 990902 974728 951984 918409 830102 689556
328333 621864 646197 806130 1006318 1068017 1069136 1063432 1058955 1053612 1048847 1042456 1038269 1035092 1032131
336111 1028954 1027871 1027005 1024802 1022095 1020145 1017113 1013863 1010289 1005018 1000397 997401 992816 988483 985487 982960
345000 981913 978411 973356 967291 960179 951262 940973 930034 917001 901657 885267 867685 850283 828694
352778 799235 767140 734936 700675 663201 620275 573559 516986 441893 372071 353659 409112 555219
360000 761038 923066 1006318 1044117 1060652 1066573 1066573 1061988 1058089 1054840 1053865 1052276 1045417 1036716 1030579 1025452
368889 1023178 1024261 1025127 1025452 1027221 1028954 1027654 1027763 1029171 1028521 1026463 1023286 1018196 1014621 1012455 1011156 1010831
378333A009423l863N41J589p22j950k238k924k564l502p653r206j878M188K238I81479
387222I79783n777l574j769Q30R39k635k491j264l033m043l935k888q232n343I33102
396111I27904m549p762j1914r928j3791k7474j3250O86J1011J2022Q051L791l97H71295
404444H67288j9676j4513q051q665k0506k0795j4405q448q989j7402l0903l3575F06159
412222E37853o7547o5057j06718j13759k9496K2203K8738k2528O0147J35817J58092H48550
419444I45485L7800L1661J7293J517L429r855q376q557j516M766R856N126j299A027654
427778A022311j8268j1552j0289l900q917j0542q484o607P943j444J227J228l899I44475
436111I31369j7906j3069j9640j3250k924q267j0615q520j0181j1733j2997j6932G58836
$$ plain form
378333 1009423 1005560 1006101 1007690 1006968 1005018 1002780 999856 997292 993790 986137 976931 975053 979241 981479 981479
387222 979783 974006 970432 968663 969493 970432 967797 965306 964042 961009 956966 953031 950143 941911 936568 933102
396111 927904 923355 915593 903679 893751 879960 852486 839236 839922 850933 862955 871006 874797 874400 871295
404444 867288 847612 833099 825048 816383 795877 775082 760677 752229 743240 725838 694935 661360 606159
412222 537853 470306 405249 298531 184772 155276 177479 206217 183689 243836 379653 537745 848550
419444 945485 983285 1014946 1032239 1033756 1037185 1027330 1018954 1010397 1008881 1013647 1023503 1028629 1027330 1027654
427778 1022311 1004043 992491 982202 978302 969385 958843 950359 943752 951695 950251 951478 952706 948807 944475
436111 931369 913463 900394 880754 867504 864580 856313 845698 837178 826997 815264 802267 785335 758836
443889G25333l4189l6391m7042n5814o7583q1845p8522o0075l9821n776M1915C32936
451111D80487J29499Q6032P6284M1843L6247M1662L1301J0686J3611J2635J6427I99350
458333A010289J1048J5487L61N163N415K744k202P58M224j08k563M909K564p95A055634
467222A056500O86j2419J444J986L538M765R03l322J336k563K563L25j011J553A055164
476111A052746L25m549m297L647K16j877k17m332k744k202n885M369K16j660k275A033214
485556A034081m044n126R74R03n560q66R75o50L465M477J841l25J120L068K491A038269
495000A036824%k274j877N41p58k202q67l25J408n41q67l25j516k419k707j733A019929
505000A018845j841l25J09j09K058j08q67J083J517o50j950m33k816k816J08n41A012239
$$ plain form
443889 725333 691144 654753 607711 551897 484314 402469 323947 263872 224051 218275 260190 332936
451111 480487 609986 696018 772302 814145 850392 892054 923355 934041 947652 960287 976714 999350
458333 1010289 1021337 1036824 1037185 1042348 1047763 1050507 1048305 1049063 1053287 1053179 1050616 1055525 1058089 1057294 1055634
467222 1056500 1057186 1044767 1046211 1048197 1051735 1056500 1057403 1054081 1055417 1052854 1055417 1055742 1054731 1056284 1055164
476111 1052746 1053071 1048522 1044225 1047872 1048088 1046211 1045994 1041662 1038918 1036716 1030831 1035200 1035416 1033756 1031481 1033214
485556 1034081 1030037 1024911 1025885 1026788 1021228 1020362 1021337 1020687 1024152 1028629 1030470 1030145 1031265 1034333 1036824 1038269
495000 1036824 1036824 1034550 1032673 1033214 1032456 1030254 1029387 1029062 1030470 1029929 1029062 1028737 1027221 1024802 1022095 1020362 1019929
505000 1018845 1017004 1016679 1016788 1016679 1018737 1018629 1017762 1018845 1020362 1019712 1017762 1017329 1014513 1011697 1011805 1011264 1012239
515000A012672J08j408l790l105q67r38k275p256p762p401j0687j5488j6751l574I47038
523889I71479J9423J1336O643L358Q66K17q67q66N41n41j192j949j264o49l25A004585
533333A001264k17J516K455J300j408q67K17l25q66Q66Q67j083r39j733p58N41A000830
543333I99242O14P58K16K17o50k347j371j517j480n41j09%L25m33k238j806J084I90794
553889I89639j156m33o50j697j155q66j156J09P58N05Q67L25R38R39M33n41J08I86859
564444I86967l97j300j80m34j371j09N06%r39j047L97k89q66p22L97J083J08o49I80433
575556I80216r75j155k89J08p58j372n05j697l466j155K17o14p58j81P2M34J660I70938
586111I72309J156M33N05q30j372q30L25J08N05Q31K16%o13j372%L25l25K16%I70757
$$ plain form
515000 1012672 1012780 1011372 1007582 1004477 1003610 1002672 1000397 993141 985379 977978 967291 951803 935052 931478 947038
523889 971479 990902 1002238 1008881 1012239 1013105 1013322 1012455 1011589 1012130 1011589 1010397 1008448 1007184 1006535 1006210 1004585
533333 1001264 1001047 1002563 1005018 1006318 1004910 1004043 1004260 1003935 1003069 1003935 1004802 1003719 1002780 1001047 1000289 1000830 1000830
543333 999242 999856 1000614 1000830 1001047 1000397 998050 996679 995162 993682 993141 993032 993032 993357 992924 990686 988880 989964 990794
553889 989639 988483 988050 987400 985703 984548 983682 982526 982635 983393 983898 984765 985090 986028 986967 987400 986859 986967 986859
564444 986967 986570 985270 985090 984656 983285 983176 983682 983682 982743 981696 982093 981804 980938 980216 980613 981696 981804 981155 980433
575556 980216 979241 978086 977797 977905 977147 975775 975270 973573 970107 968952 969169 968555 967797 967616 967688 968122 969782 970938
586111 972309 973465 973898 974403 973573 972201 971371 971696 971804 972309 973140 973356 973356 972743 971371 971371 971696 971371 971587 971587 970757
597778I69385j372n05j08K16J81o14p22%K89j336j155l25q31j444%J336P58O14I64367
608889I64042L25L25P2%n05l25J047J08j047j047j80o50j228m33p22j264j08M33I59240
620000I59349j81j08r39q30K16m33j155o14Q31k89j264K17Q30N06J263N06j553I55197
630556I55919p2j155r39q31j119j372p94n41j553p2J841n05k672q30K89j842m296I37182
641111I35052k455P22J408J119J08p94j119k166k239k021J08j625k852O14r02I21044
650556I23571M152J011J841K130j08m766m476j733l213O86J841J805J516R03J733I28012
660000I29456L357K853J841J516K383K89o14j625o13P94n06j841j08j228j119I35666
669444I36893k17k16l97j517j08J625j09j516j119p22J08P94P22L25l25j841%I33933
$$ plain form
597778 969385 968013 967508 967400 967616 967797 967183 966461 966461 966750 965414 964259 963934 963103 961659 961659 962995 963753 964367 964367
608889 964042 964367 964692 964764 964764 964259 963934 964981 965089 964042 962995 962815 962165 960937 960504 959782 958518 958410 958843 959240
620000 959349 959168 959060 958121 957291 957507 957074 955919 955305 956136 955847 954583 954800 955630 956136 957399 957905 956352 955197
630556 955919 955847 954692 953753 952922 951803 950431 949637 949096 947543 947471 949312 948807 946135 945305 945594 943752 939456 937182
641111 935052 932597 933319 934727 935846 935954 935160 934041 931875 929636 927615 927723 926098 923246 923860 922958 921044
650556 923571 927723 928734 930575 932705 932597 927831 923355 921622 918409 919095 920936 922741 924257 925160 926893 928012
660000 929456 932813 935666 937507 939023 941406 941695 941081 939456 938843 939637 939131 937290 937182 935954 934835 935666
669444 936893 936676 936460 936063 934546 934438 936063 935954 934438 933319 932597 932705 933499 934221 934546 934221 932380 932380 933933
680000I34546K89L97J769J517o14j119j553n05J047O86%o86o14O14O14j553r02I34330
690556I34835k89o13l25j81q30o14Q30O86r02r03J81l97j228Q31j09j119o14j08I29961
701667I30647k89p22j408j841j119o14N06n06j011j010r03L25j08j408k239o13I16279
711667I13571j589K89K89j408p2J083J805K708K346J517R02J517K88j805j516I17903
721111I14762l213j191k89l25K311L826J300N06J010n05n78k16j011j914r02J119I15195
731111I13788n06j300j516j08o86N05K275K238P94J09j914j227j81j08j08J08I11657
741111I12380K093K311P22J300J408k89o14p94j841j300O14O86o86j228m69R02I15701
751111I14871k89p22J011n06j697R03k17j805j300k88%j011L97j191%K021j08I08553
$$ plain form
680000 934546 934835 935232 937001 938518 937904 936785 935232 934727 935774 936460 936460 935774 935160 935774 936388 934835 933933 934330
690556 934835 934546 933933 933608 933427 932597 931983 932813 933499 932597 931694 931875 931478 930250 931081 930972 929853 929239 929131 929961
701667 930647 930358 929636 928228 926387 925268 924654 925160 924654 923643 922633 921730 922055 921947 920539 918300 917687 916279
711667 913571 911982 912271 912560 911152 911080 912163 913968 916676 919022 920539 921441 922958 923246 921441 919925 917903
721111 914762 911549 910358 910069 909744 912055 915881 917181 917687 918697 918192 917614 917398 916387 914473 913571 914690 915195
731111 913788 913282 911982 910466 910358 909672 910177 912452 914690 915484 915593 913679 912452 912271 912163 912055 912163 911657
741111 912380 914473 916784 917506 918806 920214 919925 919311 918517 916676 915376 915990 916676 915990 914762 914293 915195 915701
751111 914871 914582 913860 914871 914365 912668 913571 913354 911549 910249 909961 909961 908950 909347 908156 908156 910177 910069 908553
761667I08264j08N05J805l97o14j80o14P94J011p22j986j408n77l97K88o85Q66I07253
772222I07072j408o13N05J08P95K16p22n77q31r74k094j300O86J191J517J80j697I01657
782778I01585j08K88j191r03k88r75p94j589j119%k455l538k888m116m874m404H69057
792778H68082J444J841L322L429K347K744O86l97J083L97j09j08j80n06p94k238H75952
802778H71945R75K455M69p58j553K89J661p94n78n78k816m476l755k816m621k960H51727
812778H52305J805L249K600K708K816K491L104L430M080R74j660J08K89n06l61H77216
822222H77505n78j769p2J552K816J877j263r75k89J661K419O14J80P94N06%L61H85664
832778H85555J769N78k89n77n06K17%j08k17n78j372j949o86j372l538r75K89H76638
$$ plain form
761667 908264 908156 908661 910466 910069 909455 909275 908661 909455 910466 909744 907758 906350 905773 905376 905664 904979 905845 907253
772222 907072 905664 905051 905556 905664 906459 906675 905953 905376 904545 903571 901477 900177 900863 902054 903571 903751 902054 901657
782778 901585 901477 901765 900574 899671 899383 898408 897614 896025 894906 894906 892451 888913 886025 881909 877035 872631 869057
792778 868082 869526 871367 874689 878118 880465 883209 883895 883498 884581 884978 884869 884761 884581 884075 883281 881043 875952
802778 871945 872920 875375 875844 875086 873533 873822 875483 874689 874111 873533 870717 866241 862486 859670 855049 852089 851727
812778 852305 854110 857359 859959 862667 865483 867974 871078 874508 878588 879562 877902 878010 878299 877793 877432 877216
822222 877505 876927 875158 875086 876638 879454 881331 880068 879093 878804 880465 882884 883498 883678 884472 884978 884978 885339 885664
832778 885555 887324 887902 887613 887036 886530 886747 886747 886639 886422 885844 884472 882523 881837 880465 876927 875952 876241 876638
843333H75663k88L104L250R74q66j877j264r75k346l033p2K996M874K563J09k89H81620
853333H81223n77J191J047k058j552m70j011m69J08j660k925k88Q66N78O86L97H75375
863333H75375j553p94j08j444j264J444K058m69j769j445o86k16L97J661%j264H69057
873333H67901J156k89n78R39K16j732p95J81K89n78j047j155j733n78o86k599H57359
883333H56313j625n78k094j913r75j697k202k094l61M730P076L863J155P2L97H61620
892778H61800J81o50j09j732n78R75%K88o85k131%L98j336j372q30j09j08j986H50753
903889H50572q66j228n05J733j228l249l97N78r39j08j408k275r75j227q30q67H35842
913889H36131J09j914j480q67j407k167j480k89J81j408k708k419j588q31l61H16275
$$ plain form
843333 875663 875375 878479 881729 882703 881837 879960 878696 877721 875375 872342 872270 875266 880140 882703 882812 882523 881620
853333 881223 880646 881837 882884 880826 879274 878804 877793 877324 877432 875772 872847 872559 873425 874003 874689 875086 875375
863333 875375 873822 873028 872920 871476 870212 871656 873714 873245 871476 870031 869345 869129 869526 871187 871187 869923 869057
873333 867901 869057 868768 868190 869129 869345 867613 866818 866999 867288 866710 865663 864508 862775 862197 861511 858912 857359
883333 856313 854688 854110 852016 850103 849128 847431 845229 843135 842774 847504 854580 858443 859598 859670 860067 861620
892778 861800 861981 861331 861222 859490 858912 859887 859887 860175 859490 857359 857359 857757 856421 855049 854219 854110 854002 852016 850753
903889 850572 849706 848478 847973 849706 848478 845229 844832 845410 844471 844363 842955 840680 839705 838478 837648 836781 835842
913889 836131 836240 834326 832846 831979 830572 828405 826925 826636 826817 825409 822701 820282 818694 817863 817502 816275
923333H15445j481l032k491j661j950j913k744l141k707k925l718l069l249o354G68836
932222G64035n921o679r856j2311j2708j4369j8231k4117l0651l9243n0471o0038D24817
940000D13878P2421J40727J32424P8559L5308J1661K238o86l718n668n380l863H65483
947778H62558n199m873k311k960o824o606l105P2k238m766l935k491m549m982H02917
956667G98332l574p798r640o715q592j1264j2455j4152j7943k1806k5488l3792E87097
964444E52547j4946K5813O8089Q4877P8378N6753L3250J8124J0289M729L141J300I20827
972222I17687j084j732l502k311o86j119k89o14j299r03p94l97k563j914O14%H99202
982222I01874j09K89j083j191n06l97L25P94P95J769L25J80K89j083k491l755H98300
$$ plain form
923333 815445 813964 810932 808441 806780 804830 802917 800173 797032 794325 791400 787682 784613 781364 775010 768836
932222 764035 758114 751435 741579 729268 716560 702191 683960 659843 629192 589949 539478 479440 424817
940000 413878 486299 627026 759450 838009 873317 884978 887216 886530 882812 877144 871764 867901 865483
947778 862558 857359 852486 850175 847215 840391 833785 830680 830752 828514 823748 819813 817322 812773 807791 802917
956667 798332 794758 786960 777320 770605 762013 750749 738294 724142 706199 684393 658905 625113 587097
964444 552547 537601 563414 631503 716380 794758 851511 884761 902885 913174 917903 921044 922344 920827
972222 917687 916603 914871 911369 909058 908372 907253 906964 906350 905051 904148 903354 902957 900394 898480 899094 899094 899202
982222 901874 901765 902054 900971 899780 899274 898877 899202 899996 900791 902560 902885 903065 903354 902271 899780 896025 898300
992222I04076K996L98K88J192J119K311l98q303R75N415J80k707k166J372M007I13860
1001667I12560k816j083J986J408N05j08j480p23K311K708J227q339k094L610L791I16170
1011111I17109k17J625K022k744l105k635L538J010r02N018P22p22K347K419l755I15268
1020556I22127p94q953K815M730M549K238j08p22n957j625J733R03K707J09l430I21441
1030000I22560k16k636k310J913L755K094j697l646p22p3K419L430j228o967k491I15195
1039444I14979J119m043L213k203R03L935J516K131p23l97K311k311q30K527j408I21225
1048889I21622k89j805j336J336J408K419K021J517J08j841n343K021J625m874I19708
1057778I17795J011O13L322L538j697K419n451l358L755O86J227J516J228p22m152I17614
$$ plain form
992222 904076 907072 907470 907758 908950 910069 912380 911982 903679 904654 910069 910249 907542 905376 906748 910755 913860
1001667 912560 909744 908661 910647 912055 912560 912452 910972 910249 912560 915268 916495 908156 906062 909672 913463 916170
1011111 917109 916892 918517 920539 917795 914690 912055 915593 916603 915701 920719 921441 920719 923066 925485 921730 915268
1020556 922127 921333 912380 915195 919925 924474 926712 926604 925882 919925 918300 920033 920936 923643 923752 920322 921441
1030000 922560 922344 919708 917398 919311 923066 925160 923463 919817 919095 919022 921441 924871 923643 916676 914185 915195
1039444 914979 916098 912055 915268 913065 913968 917903 919419 921550 920827 920430 922741 920430 919600 922127 920719 921225
1048889 921622 921333 919528 918192 919528 920936 923355 925376 926893 927001 925160 919817 921838 923463 918589 919708
1057778 917795 918806 919419 922741 926279 924582 927001 921550 918192 921947 922633 923860 925376 926604 925882 921730 917614
1067222I17903L97k16K130J624l321j2058M693L610K239K599K17k311N054j949I06170
1076111I08661M404L719J119p22L033j408j011L646q30k708K311M043o86k021j09I19095
1085556I19419L719M874P22j444n06j516k89K636j733p94J299J011O14j08j192I25485
1095000I25990q30N05P22j299R02K89L25J516p22j08J227j011J842K346j949j914I29023
1105000I29961R03Q30n41o86J011J08j228j335o86I28734
$$ plain form
1067222 917903 918300 918084 920214 921838 918517 906459 911152 914762 917001 919600 919817 917506 922560 920611 906170
1076111 908661 913065 916784 917903 917181 920214 918806 917795 921441 920611 917903 920214 924257 923571 921550 921441 919095
1085556 919419 923138 928012 928734 927290 926784 925268 924979 927615 925882 925088 926387 927398 928012 927904 926712 925485
1095000 925990 925160 925665 926387 925088 925990 926279 926604 928120 927398 927290 928517 927506 929348 931694 929745 927831 929023
1105000 929961 930864 931694 931153 930467 931478 931586 930358 929023 928337 928734
1111111I28914  $$checkpoint
##END=
##TITLE=4-chloroaniline $$ Begin of the data block
##JCAMP-DX=5.00 $$ ACD/DocManager Library v 5.00
##DATA TYPE=NMR SPECTRUM
##DATA CLASS=XYDATA
##BLOCK ID=2
##ORIGIN=Dept of Chemistry, UWI, Jamaica
##OWNER=public domain
##DATE=13 Feb 2012 20:45:52
##.OBSERVE FREQUENCY=50.329
##.ACQUISITION TIME=2.608
##.ZERO FILL=0
##.OBSERVE NUCLEUS=^13C
##.ACQUISITION MODE=SIMULTANEOUS
##SPECTROMETER/DATA SYSTEM= Bruker Avance
<Models>
<ModelData id="pchloroaniline" type="MOL">
4-chloroaniline

  created with ArgusLab version 4.0.1
 14 14  0  0  0  0  0  0  0  0  0 V2000
   -0.1855   -1.2096    0.0152 C   0  0  0  0  0  0  0  0  0  0  0  0
    1.2065   -1.2032    0.0088 C   0  0  0  0  0  0  0  0  0  0  0  0
    1.9229    0.0052   -0.0001 C   0  0  0  0  0  0  0  0  0  0  0  0
    1.1995    1.2095   -0.0021 C   0  0  0  0  0  0  0  0  0  0  0  0
   -0.1925    1.2078    0.0043 C   0  0  0  0  0  0  0  0  0  0  0  0
   -0.8815   -0.0029    0.0127 C   0  0  0  0  0  0  0  0  0  0  0  0
   -2.6447   -0.0081    0.0254 Cl  0  0  0  0  0  0  0  0  0  0  0  0
    3.3190    0.0090   -0.0669 N   0  0  0  0  0  0  0  0  0  0  0  0
    3.7598    0.8478    0.2897 H   0  0  0  0  0  0  0  0  0  0  0  0
   -0.7271   -2.1499    0.0236 H   0  0  0  0  0  0  0  0  0  0  0  0
    1.7456   -2.1480    0.0056 H   0  0  0  0  0  0  0  0  0  0  0  0
    1.7330    2.1574   -0.0137 H   0  0  0  0  0  0  0  0  0  0  0  0
   -0.7397    2.1450    0.0043 H   0  0  0  0  0  0  0  0  0  0  0  0
    3.7647   -0.8238    0.2978 H   0  0  0  0  0  0  0  0  0  0  0  0
  1  2  4  0  0  0  0
  1  6  4  0  0  0  0
  1 10  1  0  0  0  0
  2  3  4  0  0  0  0
  2 11  1  0  0  0  0
  3  4  4  0  0  0  0
  3  8  4  0  0  0  0
  4  5  4  0  0  0  0
  4 12  1  0  0  0  0
  5  6  4  0  0  0  0
  5 13  1  0  0  0  0
  6  7  1  0  0  0  0
  8  9  1  0  0  0  0
  8 14  1  0  0  0  0
M  END
</ModelData>
</Models>
##$PEAKS=
<Peaks type="13CNMR" xUnits="ppm" yUnits="arbitrary units" >
<PeakData id="1" title="amine-C1 ~147" peakShape="singlet" model="pchloroaniline" atoms="3" xMax="148" xMin="146"  yMax="10000" yMin="0" />
<PeakData id="2" title="C2,C6 ~118" peakShape="multiplet" model="pchloroaniline"  atoms="2,4" xMax="119" xMin="117"  yMax="10000" yMin="0" />
<PeakData id="3" title="chloro-C4 ~124" peakShape="multiplet" model="pchloroaniline" atoms="6" xMax="125" xMin="123"  yMax="10000" yMin="0" />
<PeakData id="4" title="C3,C5 ~130" peakShape="multiplet" model="pchloroaniline" atoms="1,5" xMax="131" xMin="129"  yMax="10000" yMin="0" />
</Peaks>
##SOLVENTNAME= MeOD
##.OBSERVE FREQUENCY= 50.329
##XUNITS= HZ
##YUNITS= ARBITRARY UNITS
##XFACTOR= 1.25655834E-2
##YFACTOR= 7.37338496E-2
##FIRSTX= -172.48339836
##FIRSTY= 33.72077637
##LASTX= 12393.1
##NPOINTS= 32768
##XYDATA= (X++(Y..Y))
-13727D57A342G32a128A799B774A585b134a433C96c201f1B500a677h84A159f71
-13212i45B622G01B104D88c872b104B165I45b927I1C476C933f10b44e79D817D695
-12659A677d57g62F10B409c049I15I45a128D512A799A098C872c232A372a921B195
-12144G62B287A220c567a128C811A494a52A52E610F40C415b713d085A189b713
-11659a677G93A006i76A433b44B378f10h23A220c140f71A22A52D116B134B409
-11140a463A067D88a463b957C110A098A281e49f10C842A555a250E49D27A555a037
-10618b470b592G93B012b043a098C506C171B348D27B74B13i76B866a189b409B500
-10102b012A250C35E18a006c66F1a707b226I1B195B226I15d88A433D695b012b74
$$ plain form
-13727 457 1342 732 -1128 1799 2774 1585 -2134 -1433 396 -3201 -61 2500 -1677 -884 1159 -671
-13212 -945 2622 701 2104 488 -3872 -2104 2165 945 -2927 91 3476 3933 -610 -244 -579 4817 4695
-12659 1677 -457 -762 610 2409 -3049 915 945 -1128 4512 1799 1098 3872 -3232 1372 -1921 2195
-12144 762 2287 1220 -3567 -1128 3811 1494 -152 152 5610 640 3415 -2713 -4085 1189 -2713
-11659 -1677 793 1006 -976 1433 -244 2378 -610 -823 1220 -3140 -671 122 152 4116 2134 2409
-11140 -1463 1067 488 -1463 -2957 3110 1098 1281 -549 -610 3842 1555 -1250 549 427 1555 -1037
-10618 -2470 -2592 793 2012 -2043 -1098 3506 3171 2348 427 274 213 -976 2866 -1189 -2409 2500
-10102 -2012 1250 335 518 -1006 -366 61 -1707 -2226 91 2195 2226 915 -488 1433 4695 -2012 -274
-9547A372a890I45b713a372B774H54a220c05B012B470C66a616a22A585d787H54
-9030A250A372b317E49a402F10b744B317b835F1B988b74a128A83C66b13E214
-8511I1f40A067a616C110b043I76B622B805B713D27B226B561c689B866B531a281
-7995a982b256C598b439a281A799B74G01B988f71B653b74A738F250B500H84B927
-7478d27A52d88a555C96A281i45c96I1@F677a281a799a707b104b622E18a006
-6926B531c689a281A342a372c05e122E061A067c018c66B927A342c872F067D543
-6438b348C05a098a555a799d88H84c598A52G93F71c96A006a098A22A860G93I1
-5892A524b226a616c049c445a281a707B165C110A951C964a951C96f10b713b256
$$ plain form
-9547 1372 -1890 945 -2713 -1372 2774 854 -1220 -305 2012 2470 366 -1616 -122 1585 -4787 854
-9030 1250 1372 -2317 549 -1402 610 -2744 2317 -2835 61 2988 -274 -1128 183 366 -213 5214
-8511 91 -640 1067 -1616 3110 -2043 976 2622 2805 2713 427 2226 2561 -3689 2866 2531 -1281
-7995 -1982 -2256 3598 -2439 -1281 1799 274 701 2988 -671 2653 -274 1738 6250 2500 884 2927
-7478 -427 152 -488 -1555 396 1281 -945 -396 91 0 6677 -1281 -1799 -1707 -2104 -2622 518 -1006
-6926 2531 -3689 -1281 1342 -1372 -305 -5122 5061 1067 -3018 -366 2927 1342 -3872 6067 4543
-6438 -2348 305 -1098 -1555 -1799 -488 884 -3598 152 793 671 -396 1006 -1098 122 1860 793 91
-5892 1524 -2226 -1616 -3049 -3445 -1281 -1707 2165 3110 1951 3964 -1951 396 -610 -2713 -2256
-5398c445A83I76a067B256b13e031C66f128e49b165a494e884i1a067A585a311
-4881a524d726b409A22a982a128B500B13B439A037A83f10A463B44c35a494d27
-4365e18A342A829A128a524e18c35C750A616b988B012H84a250b44B195b835b134
-3847b44b134c476c720c96A098h84d543I45B500b805b805a159b744C66C262d27
-3323f1a768G93a402I1c96C689@B44C66A342a402b805b561a951b012C872b13
-2776C96a159a189A707a616B13e49a83A189g32C049b317A494h019I76B043A677
-2254b561A463a220A52d27B592d146a585A250E854B439c598B134A829B073C872
-1765B043b683D573b44E79c994F10F71A494B896b805A342B683b287b104b378
$$ plain form
-5398 -3445 183 976 -1067 2256 -213 -5031 366 -6128 -549 -2165 -1494 -5884 -91 -1067 1585 -1311
-4881 -1524 -4726 -2409 122 -1982 -1128 2500 213 2439 1037 183 -610 1463 244 -335 -1494 -427
-4365 -518 1342 1829 1128 -1524 -518 -335 3750 1616 -2988 2012 884 -1250 -244 2195 -2835 -2134
-3847 -244 -2134 -3476 -3720 -396 1098 -884 -4543 945 2500 -2805 -2805 -1159 -2744 366 3262 -427
-3323 -61 -1768 793 -1402 91 -396 3689 0 244 366 1342 -1402 -2805 -2561 -1951 -2012 3872 -213
-2776 396 -1159 -1189 1707 -1616 213 -549 -183 1189 -732 3049 -2317 1494 -8019 976 2043 1677
-2254 -2561 1463 -1220 152 -427 2592 -4146 -1585 1250 5854 2439 -3598 2134 1829 2073 3872
-1765 2043 -2683 4573 -244 579 -3994 610 671 1494 2896 -2805 1342 2683 -2287 -2104 -2378
-1279a342D88C811A52I1B653g134B073b043a22c35A281F40b835A829a860A281
-764b043D756C110e945b653A707D451B13B866D299g62g927D512A037A982C872
-271b835@a83a52C05C476i15c720G01c05a342c720a555g93b104a555e18h84
279a250C35c354d57G93b165b439H23I15c872a585A159A677c689g62h84a128
793a128A189D390i1a342I15a616c598C018b409H54A433I1b500a037A768F921
1309a22A402b500a189c964E49C079I76b988A159A250b805C262a342A646B896
1799C476c384B409e49C96c384B348e031d390a860c659C811f098B104C659b409
2292A463B896B866H23A738i1b805c66A83e18B073D329b500D543C384a921a22
$$ plain form
-1279 -1342 488 3811 152 91 2653 -7134 2073 -2043 -122 -335 1281 640 -2835 1829 -1860 1281
-764 -2043 4756 3110 -5945 -2653 1707 4451 213 2866 4299 -762 -7927 4512 1037 1982 3872
-271 -2835 0 -183 -152 305 3476 -915 -3720 701 -305 -1342 -3720 -1555 -793 -2104 -1555 -518 -884
279 -1250 335 -3354 -457 793 -2165 -2439 823 915 -3872 -1585 1159 1677 -3689 -762 -884 -1128
793 -1128 1189 4390 -91 -1342 915 -1616 -3598 3018 -2409 854 1433 91 -2500 -1037 1768 6921
1309 -122 1402 -2500 -1189 -3964 549 3079 976 -2988 1159 1250 -2805 3262 -1342 1646 2896
1799 3476 -3384 2409 -549 396 -3384 2348 -5031 -4390 -1860 -3659 3811 -6098 2104 3659 -2409
2292 1463 2896 2866 823 1738 -91 -2805 -366 183 -518 2073 4329 -2500 4543 3384 -1921 -122
2811a098C598e061e244C110C384B988a951d055a342c05i15a098C445b622a006
3293c659B13F71B348C66c354C994b866G62d268b043b683d665A342c323a768
3784e79A006g32A189c598i15c262c384C933d57A768A463B744a189b226a52c537
4300a555c66c66B409G01b409e79b409A433B74c567D329a524b744D360A189I76
4824c323F250a037B835A006i1a83c384A860a860d390A52b378g01A951b409H23
5343c96c05c171C018D085h689D177A098c720i45B927@B866a707d695a52e031
5857F71A921a037h84B592A738B073C720D634a281d27a768A494B043e549a707
6348B713b653B256b744C079a921D025H54A585f128B774h84c415E18a220A494
$$ plain form
2811 -1098 3598 -5061 -5244 3110 3384 2988 -1951 -4055 -1342 -305 -915 -1098 3445 -2622 -1006
3293 -3659 213 671 2348 366 -3354 3994 -2866 762 -4268 -2043 -2683 -4665 1342 -3323 -1768
3784 -579 1006 -732 1189 -3598 -915 -3262 -3384 3933 -457 1768 1463 2744 -1189 -2226 -152 -3537
4300 -1555 -366 -366 2409 701 -2409 -579 -2409 1433 274 -3567 4329 -1524 -2744 4360 1189 976
4824 -3323 6250 -1037 2835 1006 -91 -183 -3384 1860 -1860 -4390 152 -2378 -701 1951 -2409 823
5343 -396 -305 -3171 3018 4085 -8689 4177 1098 -3720 -945 2927 0 2866 -1707 -4695 -152 -5031
5857 671 1921 -1037 -884 2592 1738 2073 3720 4634 -1281 -427 -1768 1494 2043 -5549 -1707
6348 2713 -2653 2256 -2744 3079 -1921 4025 854 1585 -6128 2774 -884 -3415 518 -1220 1494
6833c96E884B653B835b13C66C659A555D573b653E701E79a311B287g93H54a006
7355a037a281C781B835b561a067d329C262a890a860b348E183D88h54b104B134
7843C66A768C201d238b378D27a921A006B287a524b073a463A768f71I76b744
8327d512D88B592b653A585c05C598B774g62b744b317G32B012A555F1a982D695
8850e79a311D57B896D695A250I1b073c628B683A250d085D146F220B195A463
9334d695A616B74E793i45a22A768a83C323b409c35A616F464f372A006D878I45
9852B927F189b531B165D27c96b348A128F10a951b927b378d238a311C628G62
10344C994b774c384A860A52D695b500a372C66A22B195c720f647B13C079a707
$$ plain form
6833 -396 5884 2653 2835 -213 366 3659 1555 4573 -2653 5701 579 -1311 2287 -793 854 -1006
7355 -1037 -1281 3781 2835 -2561 -1067 -4329 3262 -1890 -1860 -2348 5183 488 -854 -2104 2134
7843 366 1768 3201 -4238 -2378 427 -1921 1006 2287 -1524 -2073 -1463 1768 -671 976 -2744
8327 -4512 488 2592 -2653 1585 -305 3598 2774 -762 -2744 -2317 732 2012 1555 61 -1982 4695
8850 -579 -1311 457 2896 4695 1250 91 -2073 -3628 2683 1250 -4085 4146 6220 2195 1463
9334 -4695 1616 274 5793 -945 -122 1768 -183 3323 -2409 -335 1616 6464 -6372 1006 4878 945
9852 2927 6189 -2531 2165 427 -396 -2348 1128 610 -1951 -2927 -2378 -4238 -1311 3628 762
10344 3994 -2774 -3384 1860 152 4695 -2500 -1372 366 122 2195 -3720 -6647 213 3079 -1707
10828g531b896C049h54A524e762a83A037A311D512B348c293B835D27e000e579
11318F40a707a402C964C35F71c232c293d848C079a646d421a616d025c262A738
11806A22B012a52A982B896a646F1a738B744B74a250B44A22H23A067c598B195
12325F1g62a159c0F006b683E762a799A738G01H54d27b195g32D055b74b348D878
12878b896B683A982D268c35A098a006C903a342E031A768e061a372A982A616b835
13362a768C720f10C0e640A037C323a098b500A342a707i1F982c537F40b44D085
13883G653C110E092C35B531B256g62B531G62E915a189b348D390b439D756b13
14375H23b256C903A250e18A372D726h23B866A829A585A494f71G93b74A646c750
$$ plain form
10828 -7531 -2896 3049 -854 1524 -5762 -183 1037 1311 4512 2348 -3293 2835 427 -5000 -5579
11318 640 -1707 -1402 3964 335 671 -3232 -3293 -4848 3079 -1646 -4421 -1616 -4025 -3262 1738
11806 122 2012 -152 1982 2896 -1646 61 -1738 2744 274 -1250 244 122 823 1067 -3598 2195
12325 61 -762 -1159 -30 6006 -2683 5762 -1799 1738 701 854 -427 -2195 -732 4055 -274 -2348 4878
12878 -2896 2683 1982 4268 -335 1098 -1006 3903 -1342 5031 1768 -5061 -1372 1982 1616 -2835
13362 -1768 3720 -610 30 -5640 1037 3323 -1098 -2500 1342 -1707 -91 6982 -3537 640 -244 4085
13883 7653 3110 5092 335 2531 2256 -762 2531 762 5915 -1189 -2348 4390 -2439 4756 -213
14375 823 -2256 3903 1250 -518 1372 4726 -823 2866 1829 1585 1494 -671 793 -274 1646 -3750
14894b317a098d695B835b653e49i15a311a037a006e18B195E49c811b866d817
15378a921B13b531A433b622d88B653E092d329A585I1h23a281b622B44b256c66
15894c140B500a189C750B104a037H23g256B74b317g01e183a067b195a372b561
16387C66A494A463g32d512B592C66a982b134A189A22b622a006A342b44c933I76
16906A281F40c201c079H23a677I45B012A860c0B744A281C140a738A433I1g93
17422C96C323b012A250C018F1c96a098D878A281G32F10f40A707A890g93A524
17944B073d146b957b653f1A921D451b13c110c384d390A707h23D390i025c994
18426a951b713c0c842B226e762h84b561C659h23d207D634b226a463C232g592
$$ plain form
14894 -2317 -1098 -4695 2835 -2653 -549 -915 -1311 -1037 -1006 -518 2195 549 -3811 -2866 -4817
15378 -1921 213 -2531 1433 -2622 -488 2653 5092 -4329 1585 91 -823 -1281 -2622 244 -2256 -366
15894 -3140 2500 -1189 3750 2104 -1037 823 -7256 274 -2317 -701 -5183 -1067 -2195 -1372 -2561
16387 366 1494 1463 -732 -4512 2592 366 -1982 -2134 1189 122 -2622 -1006 1342 -244 -3933 976
16906 1281 640 -3201 -3079 823 -1677 945 2012 1860 -30 2744 1281 3140 -1738 1433 91 -793
17422 396 3323 -2012 1250 3018 61 -396 -1098 4878 1281 732 610 -640 1707 1890 -793 1524
17944 2073 -4146 -2957 -2653 -61 1921 4451 -213 -3110 -3384 -4390 1707 -823 4390 -9025 -3994
18426 -1951 -2713 -30 -3842 2226 -5762 -884 -2561 3659 -823 -4207 4634 -2226 -1463 3232 -7592
18917a707B866H293C140d88b500A067a829d025b195A738c140b470B195a006f525
19405B896C96A067h84A951b13A738c049a768a738D116c05C872d451B713a372
19896A037C35A555D543F40A738c720c689D573i1D390b256F40H54a22d27b957
20412b774A52A128A037B683a52a646h84a890a951c66D878H84b531C05b195A616
20927A982C0a951A799A829A250B378F71b043A616b012C232C35B256c96B226a555
21450c354b592A159a372c35G62a311A860a951b835C0b317b043c96A738e122b592
21969A951A524c110c933a83a921b378C262B74a951A799a250e366G93b561b317
22454i76B13B195c506a189a037B348a524a829b44E366c201a220C476A494a83
$$ plain form
18917 -1707 2866 8293 3140 -488 -2500 1067 -1829 -4025 -2195 1738 -3140 -2470 2195 -1006 -6525
19405 2896 396 1067 -884 1951 -213 1738 -3049 -1768 -1738 4116 -305 3872 -4451 2713 -1372
19896 1037 335 1555 4543 640 1738 -3720 -3689 4573 -91 4390 -2256 640 854 -122 -427 -2957
20412 -2774 152 1128 1037 2683 -152 -1646 -884 -1890 -1951 -366 4878 884 -2531 305 -2195 1616
20927 1982 30 -1951 1799 1829 1250 2378 671 -2043 1616 -2012 3232 335 2256 -396 2226 -1555
21450 -3354 -2592 1159 -1372 -335 762 -1311 1860 -1951 -2835 30 -2317 -2043 -396 1738 -5122 -2592
21969 1951 1524 -3110 -3933 -183 -1921 -2378 3262 274 -1951 1799 -1250 -5366 793 -2561 -2317
22454 -976 213 2195 -3506 -1189 -1037 2348 -1524 -1829 -244 5366 -3201 -1220 3476 1494 -183
22948b13A189B012b165B500a982g01F1B043b713C659B74A006b256A098a189E762
23461e49b957G93C750I1B439f71h54B561a281c842c872f10A768D88c018c689
23980E18d665C750a372D848B592A037a433E854A677e79b348b409E79B835a189
24472a83a860C781B957b287a250h23E762a220a281B988E397A037H54c750c262
24956b653a951a128G93f71e79i1B348c96C689g62D207A128A677E49A342a220
25481b073@a372a006a22b104b500c66a83G93b378B439a006c66c232a220A402
26000B500c171A433b226A433A829F982A463E976d57A006B653A22c05A433C262
26484i45b195E915C201a311a342I76a372I299c689a646i15a098B317c140B896
$$ plain form
22948 -213 1189 2012 -2165 2500 -1982 -701 61 2043 -2713 3659 274 1006 -2256 1098 -1189 5762
23461 -549 -2957 793 3750 91 2439 -671 -854 2561 -1281 -3842 -3872 -610 1768 488 -3018 -3689
23980 518 -4665 3750 -1372 4848 2592 1037 -1433 5854 1677 -579 -2348 -2409 579 2835 -1189
24472 -183 -1860 3781 2957 -2287 -1250 -823 5762 -1220 -1281 2988 5397 1037 854 -3750 -3262
24956 -2653 -1951 -1128 793 -671 -579 -91 2348 -396 3689 -762 4207 1128 1677 549 1342 -1220
25481 -2073 0 -1372 -1006 -122 -2104 -2500 -366 -183 793 -2378 2439 -1006 -366 -3232 -1220 1402
26000 2500 -3171 1433 -2226 1433 1829 6982 1463 5976 -457 1006 2653 122 -305 1433 3262
26484 -945 -2195 5915 3201 -1311 -1342 976 -1372 9299 -3689 -1646 -915 -1098 2317 -3140 2896
26974B317F1c415b44a098g62C994B866E366d238h84C66b74c262i15D025b74a921
27521b012g01E000f40A83a128a982d88a22a951A829G93b835C659b896b043i421
28043a52a037A768c018c171A829b713B835F71b043D787C201c0A860C35e884e18
28562e49d57D299@d055a921a067A311C659C079b835d88I1G93d146b835a585G62
29106c964B134d207b500I1b378b378D665e79a220B835B866B134F40b988C018
29598b957c537D512A677b195a159B835c262e183f10B287B592E549C018g01a494
30082b683h54A494a890B531b957f890i45B957c201d57c171b896B774d025B500
30574C35C567A646g01c994B988A067a220A402i45g62b287E79B561A098B439a616
$$ plain form
26974 2317 61 -3415 -244 -1098 -762 3994 2866 5366 -4238 -884 366 -274 -3262 -915 4025 -274 -1921
27521 -2012 -701 5000 -640 183 -1128 -1982 -488 -122 -1951 1829 793 -2835 3659 -2896 -2043 -9421
28043 -152 -1037 1768 -3018 -3171 1829 -2713 2835 671 -2043 4787 3201 -30 1860 335 -5884 -518
28562 -549 -457 4299 0 -4055 -1921 -1067 1311 3659 3079 -2835 -488 91 793 -4146 -2835 -1585 762
29106 -3964 2134 -4207 -2500 91 -2378 -2378 4665 -579 -1220 2835 2866 2134 640 -2988 3018
29598 -2957 -3537 4512 1677 -2195 -1159 2835 -3262 -5183 -610 2287 2592 5549 3018 -701 -1494
30082 -2683 -854 1494 -1890 2531 -2957 -6890 -945 2957 -3201 -457 -3171 -2896 2774 -4025 2500
30574 335 3567 1646 -701 -3994 2988 1067 -1220 1402 -945 -762 -2287 579 2561 1098 2439 -1616
31093G32B439a128C354b13f10a646c506c66e061c35g62f1c262A524C994D085
31614a616c232F1C628A799b409F403B134b378a220E671E701C598a342c293b226
32097b226a037a860e000c720B195e549d817c598A555F40f1b957g226A067a342
32589F40f71d27D726B287F40A707c110B713b195a829B44B592C110b988a037a220
33104B165A890B378A83a768a951D268B44D238F768a098b13A646I76C384C96B439
33625A006A524d268C903B134c476c201a463A83A494d421A585B896G073a616c903
34113B500A585c05E18A738b104c750b348B988f71b287A52C201C872a281E18G93
34628F40a402C384A006B317d360B012A372d573b74a860A494E061G01a342a098
$$ plain form
31093 732 2439 -1128 3354 -213 -610 -1646 -3506 -366 -5061 -335 -762 -61 -3262 1524 3994 4085
31614 -1616 -3232 61 3628 1799 -2409 6403 2134 -2378 -1220 5671 5701 3598 -1342 -3293 -2226
32097 -2226 -1037 -1860 -5000 -3720 2195 -5549 -4817 -3598 1555 640 -61 -2957 -7226 1067 -1342
32589 640 -671 -427 4726 2287 640 1707 -3110 2713 -2195 -1829 244 2592 3110 -2988 -1037 -1220
33104 2165 1890 2378 183 -1768 -1951 4268 244 4238 6768 -1098 -213 1646 976 3384 396 2439
33625 1006 1524 -4268 3903 2134 -3476 -3201 -1463 183 1494 -4421 1585 2896 7073 -1616 -3903
34113 2500 1585 -305 518 1738 -2104 -3750 -2348 2988 -671 -2287 152 3201 3872 -1281 518 793
34628 640 -1402 3384 1006 2317 -4360 2012 1372 -4573 -274 -1860 1494 5061 701 -1342 -1098
35121b073B012e701c506A707f1c66B043A951C018B653b470b287A189c964a22
35604b44e49C35I15c842C537c506A707a128A281I76B073f71g134D512a921f890
36122A159e18A220a433A250A311D604B104d27f10a311C720b927d665A463B531
36615A982a067c842b378e153b439i76D27E214A921h54E18e79a433i76B256D88
37136e79c354D57B927D025A646a768D421C781G93a189B835c872a646B500B317
37620I76a006a494A342b012a281a982B835A921A037b317C201a890A860d970d88
38105A83A616g62C994a921A83c781d909C66B073D482a22H54c384E79A83a52b592
38655E18A220F525B683e397D787I15C079D573g62a799B561C35b74d57b287B653
$$ plain form
35121 -2073 2012 -5701 -3506 1707 -61 -366 2043 1951 3018 2653 -2470 -2287 1189 -3964 -122
35604 -244 -549 335 915 -3842 3537 -3506 1707 -1128 1281 976 2073 -671 -7134 4512 -1921 -6890
36122 1159 -518 1220 -1433 1250 1311 4604 2104 -427 -610 -1311 3720 -2927 -4665 1463 2531
36615 1982 -1067 -3842 -2378 -5153 -2439 -976 427 5214 1921 -854 518 -579 -1433 -976 2256 488
37136 -579 -3354 457 2927 4025 1646 -1768 4421 3781 793 -1189 2835 -3872 -1646 2500 2317
37620 976 -1006 -1494 1342 -2012 -1281 -1982 2835 1921 1037 -2317 3201 -1890 1860 -4970 -488
38105 183 1616 -762 3994 -1921 183 -3781 -4909 366 2073 4482 -122 854 -3384 579 183 -152 -2592
38655 518 1220 6525 2683 -5397 4787 915 3079 4573 -762 -1799 2561 335 -274 -457 -2287 2653
39176c415a281d421I45C811e79a524A707E79C659a067a037d573b988C384C079
39667C476A524f71c018d390c05C262b165a829b256G93D57a098@@a311A128b866
40213i76D025b073a616g93c232F647i15e79D88a342b348A524@f525C66B622D299
40767A342c0A890F10C05C140a860e945A890A829g32b622C384B74a22b348b13
41282b073B104D634a128A159B13b012F189B653d695e79B74C872B073C201A860
41770b13a433C415I360C66A128@C96a463A921b74A524b835A585c66d207H84A52
42317a585F128A402B073e518c96A159B043G32d177F1D817C0b256B195C96d299
42839A52c598a768g378c933A860C537A098a52c35e153A799a982b561A037F10
$$ plain form
39176 -3415 -1281 -4421 945 3811 -579 -1524 1707 579 3659 -1067 -1037 -4573 -2988 3384 3079
39667 3476 1524 -671 -3018 -4390 -305 3262 -2165 -1829 -2256 793 457 -1098 0 0 -1311 1128 -2866
40213 -976 4025 -2073 -1616 -793 -3232 6647 -915 -579 488 -1342 -2348 1524 0 -6525 366 2622 4299
40767 1342 -30 1890 610 305 3140 -1860 -5945 1890 1829 -732 -2622 3384 274 -122 -2348 -213
41282 -2073 2104 4634 -1128 1159 213 -2012 6189 2653 -4695 -579 274 3872 2073 3201 1860
41770 -213 -1433 3415 9360 366 1128 0 396 -1463 1921 -274 1524 -2835 1585 -366 -4207 884 152
42317 -1585 6128 1402 2073 -5518 -396 1159 2043 732 -4177 61 4817 30 -2256 2195 396 -4299
42839 152 -3598 -1768 -7378 -3933 1860 3537 1098 -152 -335 -5153 1799 -1982 -2561 1037 610
43323A829E275b012B561A098A037b409B957D207b44e18B74F067f1C933b317c049
43842e549c96C201b012c171a281H23d085a402c293a402e549A067H84F250A342
44333a83d146h84C171c0B13c05D116a982b470h201B896I1c537b835A037a311
44849A463A738d88a006B226F71C140B653d329f1A311h54D57H54B226f342a159
45371B74A890A52b896E640f10C110c567B226a067a768b500C750B13g93D27B44
45887B44b683d025c201f1I45e18a616e336A951d57D27a098a067A494g01D055
46406C476B13a463i1a311B470@a982b805d025a951b805a067C994b287h84b774
46928c415B012B531D543b927C964d756e640b226e701B256c66H54A006B561C201
$$ plain form
43323 1829 5275 -2012 2561 1098 1037 -2409 2957 4207 -244 -518 274 6067 -61 3933 -2317 -3049
43842 -5549 -396 3201 -2012 -3171 -1281 823 -4085 -1402 -3293 -1402 -5549 1067 884 6250 1342
44333 -183 -4146 -884 3171 -30 213 -305 4116 -1982 -2470 -8201 2896 91 -3537 -2835 1037 -1311
44849 1463 1738 -488 -1006 2226 671 3140 2653 -4329 -61 1311 -854 457 854 2226 -6342 -1159
45371 274 1890 152 -2896 5640 -610 3110 -3567 2226 -1067 -1768 -2500 3750 213 -793 427 244
45887 244 -2683 -4025 -3201 -61 945 -518 -1616 -5336 1951 -457 427 -1098 -1067 1494 -701 4055
46406 3476 213 -1463 -91 -1311 2470 0 -1982 -2805 -4025 -1951 -2805 -1067 3994 -2287 -884 -2774
46928 -3415 2012 2531 4543 -2927 3964 -4756 -5640 -2226 -5701 2256 -366 854 1006 2561 3201
47419A860A067D451e457A006A159b317C018B561B866B592b74D27b653B561B500
47903A402a768A067A342a250b226d909G93i15C049c720c415d57a646a067a067
48389h84b226a220B988c262a128A585b287F71b744c35H54B348b043A829b774
48877E49A738a250B622d27B622b74h54a342a799D360B744A494D329b195e610
49368b104D177A555B927e061A22a799C781c323G01b683I45b104D726b195a006
49860c66i330b409a067d88i76C110e49G62a921a524B896B317A128A372A159d451
50374G93A220e49E18A311b409d177C96F1a402e79B104B043H84G226a037A189
50893D390b165b012E183c750B683c232D025A250c018A616a555B13C537b073f1
$$ plain form
47419 1860 1067 4451 -5457 1006 1159 -2317 3018 2561 2866 2592 -274 427 -2653 2561 2500
47903 1402 -1768 1067 1342 -1250 -2226 -4909 793 -915 3049 -3720 -3415 -457 -1646 -1067 -1067
48389 -884 -2226 -1220 2988 -3262 -1128 1585 -2287 671 -2744 -335 854 2348 -2043 1829 -2774
48877 549 1738 -1250 2622 -427 2622 -274 -854 -1342 -1799 4360 2744 1494 4329 -2195 -5610
49368 -2104 4177 1555 2927 -5061 122 -1799 3781 -3323 701 -2683 945 -2104 4726 -2195 -1006
49860 -366 -9330 -2409 -1067 -488 -976 3110 -549 762 -1921 -1524 2896 2317 1128 1372 1159 -4451
50374 793 1220 -549 518 1311 -2409 -4177 396 61 -1402 -579 2104 2043 884 7226 -1037 1189
50893 4390 -2165 -2012 5183 -3750 2683 -3232 4025 1250 -3018 1616 -1555 213 3537 -2073 -61
51386c689c0H23C445c35@f10E244C415c628d88D482a006b165g62A220E49C720
51931e18c384h54I76A342b44A768c110B13b683A738D634g62b012c384d57C567
52453b012D085A037a494D909a311e79D88b043E701c262a83B561h23a951B226
52937a83A006e305B988b104b13d482b622b988b348D27c964e000c293f1b470f71
53456f799c293B74a677c842a890B988a860A281E49c811C110B317b500F1c0c293
53978a585I76F250B805A646a768H84b348c35A555e49H84F768d268b835a555E18
54493C903B073a768a402I1c323D634A585I1i76D27E945c05C537A22A768A585
55015A006A707B896b104A982d268b500e488A250b835G01c689b500b835b104A128
$$ plain form
51386 -3689 -30 823 3445 -335 0 -610 5244 3415 -3628 -488 4482 -1006 -2165 -762 1220 549 3720
51931 -518 -3384 -854 976 1342 -244 1768 -3110 213 -2683 1738 4634 -762 -2012 -3384 -457 3567
52453 -2012 4085 1037 -1494 4909 -1311 -579 488 -2043 5701 -3262 -183 2561 -823 -1951 2226
52937 -183 1006 -5305 2988 -2104 -213 -4482 -2622 -2988 -2348 427 -3964 -5000 -3293 -61 -2470 -671
53456 -6799 -3293 274 -1677 -3842 -1890 2988 -1860 1281 549 -3811 3110 2317 -2500 61 -30 -3293
53978 -1585 976 6250 2805 1646 -1768 884 -2348 -335 1555 -549 884 6768 -4268 -2835 -1555 518
54493 3903 2073 -1768 -1402 91 -3323 4634 1585 91 -976 427 5945 -305 3537 122 1768 1585
55015 1006 1707 2896 -2104 1982 -4268 -2500 -5488 1250 -2835 701 -3689 -2500 -2835 -2104 1128
55499a707B287C201A677c201B927B744c476f1a006B683D848I1a463h23f71B226
56018A707e183c750a128h23c354D970b988A799C96i45g32f71a037F71f860b957
56539I1a555D573e18A463e18D604a951B774A646b957b409F40a616f71b043b988
57055b744a799B44C049e18c262d27f921d57A83a52E610H54a159c323a006f098
57578G01@B165E79A738a220A463G32c445a037G958B012c445a037b104b927h293
58099B165C354E762a585c354C66D756A159b744A738B927a159C66B531H84C35
58582D57c659D116c018H84A555d57A22H84C262b622A890A982F098C384a311D177
59101B531b592a555c872B896A585i15c323a799b713g93D085f71a799B470A250
$$ plain form
55499 -1707 2287 3201 1677 -3201 2927 2744 -3476 -61 -1006 2683 4848 91 -1463 -823 -671 2226
56018 1707 -5183 -3750 -1128 -823 -3354 4970 -2988 1799 396 -945 -732 -671 -1037 671 -6860 -2957
56539 91 -1555 4573 -518 1463 -518 4604 -1951 2774 1646 -2957 -2409 640 -1616 -671 -2043 -2988
57055 -2744 -1799 244 3049 -518 -3262 -427 -6921 -457 183 -152 5610 854 -1159 -3323 -1006 -6098
57578 701 0 2165 579 1738 -1220 1463 732 -3445 -1037 7958 2012 -3445 -1037 -2104 -2927 -8293
58099 2165 3354 5762 -1585 -3354 366 4756 1159 -2744 1738 2927 -1159 366 2531 884 335
58582 457 -3659 4116 -3018 884 1555 -457 122 884 3262 -2622 1890 1982 6098 3384 -1311 4177
59101 2531 -2592 -1555 -3872 2896 1585 -915 -3323 -1799 -2713 -793 4085 -671 -1799 2470 1250
59593c079a646A677C049B74D88a250F464E518a921b439b653A067a707A921e366
60077a951h23b13f006G32C018c415c689g62C66b195B74G32A22D146G32A83E79
60631C506f71a281a067C201B774A494c35C476F1A829A220b073F10a402a83d146
61146f220C110B988c567D116A006G62C933b592e244a159A220B896A83c689a799
61634c66E79D146d27A159A463c140f1B13i45a585A402b44C0A342A037B378c171
62182D57A281a738b378B74a098c232E945B13a585d025G93C415a220e18C537B439
62703A098C079d27c05C598H23A921B866B317C66b74A646C110a646B409H54a006
63226i15B988a128c262d848B226i1h23B561E18C66b378E854a006c05d726f006
$$ plain form
59593 -3079 -1646 1677 3049 274 488 -1250 6464 5518 -1921 -2439 -2653 1067 -1707 1921 -5366
60077 -1951 -823 -213 -6006 732 3018 -3415 -3689 -762 366 -2195 274 732 122 4146 732 183 579
60631 3506 -671 -1281 -1067 3201 2774 1494 -335 3476 61 1829 1220 -2073 610 -1402 -183 -4146
61146 -6220 3110 2988 -3567 4116 1006 762 3933 -2592 -5244 -1159 1220 2896 183 -3689 -1799
61634 -366 579 4146 -427 1159 1463 -3140 -61 213 -945 -1585 1402 -244 30 1342 1037 2378 -3171
62182 457 1281 -1738 -2378 274 -1098 -3232 5945 213 -1585 -4025 793 3415 -1220 -518 3537 2439
62703 1098 3079 -427 -305 3598 823 1921 2866 2317 366 -274 1646 3110 -1646 2409 854 -1006
63226 -915 2988 -1128 -3262 -4848 2226 -91 -823 2561 518 366 -2378 5854 -1006 -305 -4726 -6006
63740g93A372a342E214A098A281b409f40H84A83a555F1b531E762C171C140B74
64259c201F037B44c415a006G62A311c05D878a738d848c079a585i1b287A281a585
64775b13d238d329b74A250A52f677i15a037G62f71G470a982c05a220b957i45
65297G62b226f40B348I1B805A982D329G500B317D238a433B104b44E031B256A189
65812b104A616B134e640f10b439c05C781C262B256a372g32b348C750A616E79
66300F1A372a52B988G01d238A067B835F768b134E793a585b378b104B531b988
66791c445e000A281d329D146b531c659C842B653A52D27f71I15D025a83a52d329
67307e49D88A52A098A707a189A128B256C35c354H23B866B713b896b44E457A921
$$ plain form
63740 -793 1372 -1342 5214 1098 1281 -2409 -640 884 183 -1555 61 -2531 5762 3171 3140 274
64259 -3201 6037 244 -3415 -1006 762 1311 -305 4878 -1738 -4848 -3079 -1585 -91 -2287 1281 -1585
64775 -213 -4238 -4329 -274 1250 152 -6677 -915 -1037 762 -671 7470 -1982 -305 -1220 -2957 -945
65297 762 -2226 -640 2348 91 2805 1982 4329 7500 2317 4238 -1433 2104 -244 5031 2256 1189
65812 -2104 1616 2134 -5640 -610 -2439 -305 3781 3262 2256 -1372 -732 -2348 3750 1616 579
66300 61 1372 -152 2988 701 -4238 1067 2835 6768 -2134 5793 -1585 -2378 -2104 2531 -2988
66791 -3445 -5000 1281 -4329 4146 -2531 -3659 3842 2653 152 427 -671 915 4025 -183 -152 -4329
67307 -549 488 152 1098 1707 -1189 1128 2256 335 -3354 823 2866 2713 -2896 -244 5457 1921
67829G01F403F037C0c384E397B165A555b866C476a433a616B44A281a829B226
68319b348A402C811b531d421c750B439c354C384D604A494a646a372B348D756
68776a159f890F40a52c811C018f1E153A646A128E823a402C262I76f10b439a098
69291b287A250G93A342d025A433d451F555C903E18d604f159C476a189G32A829
69782A128D57b805a159a311B043e976c0b226b348a707b683c354b805b531b866
70267b043A585c96B073c781g01A83F10C35E793a646a52b531a646a128A677d390
70790E49g317a250c903a738a128b896e49b165a860A555d665a585A250E79A128
71278B378a342A311c293C35B74A402B13i76a189B470A281e49c659a463b500E092
$$ plain form
67829 701 6403 6037 30 -3384 5397 2165 1555 -2866 3476 -1433 -1616 244 1281 -1829 2226
68319 -2348 1402 3811 -2531 -4421 -3750 2439 -3354 3384 4604 1494 -1646 -1372 2348 4756
68776 -1159 -6890 640 -152 -3811 3018 -61 5153 1646 1128 5823 -1402 3262 976 -610 -2439 -1098
69291 -2287 1250 793 1342 -4025 1433 -4451 6555 3903 518 -4604 -6159 3476 -1189 732 1829
69782 1128 457 -2805 -1159 -1311 2043 -5976 -30 -2226 -2348 -1707 -2683 -3354 -2805 -2531 -2866
70267 -2043 1585 -396 2073 -3781 -701 183 610 335 5793 -1646 -152 -2531 -1646 -1128 1677 -4390
70790 549 -7317 -1250 -3903 -1738 -1128 -2896 -549 -2165 -1860 1555 -4665 -1585 1250 579 1128
71278 2378 -1342 1311 -3293 335 274 1402 213 -976 -1189 2470 1281 -549 -3659 -1463 -2500 5092
71793C323g32B165C110a52b470e153b592B317b317B043A921d390A402e336c0
72285e18g93D88b713e49a738b317H84c110A220a921D055A616i543b195a342b653
72799B500a951B683b104a463c0d055c05E092d390F10a037A220a281E122a463
73287A006a921C567d146f1c537b012B104c720b44B043D268b226b073f71c689
73780A921d604A890B622A616c903C506C171a22a982B988A52E49C384D085C232
74272B74d27B500A524f494@B409H54b287C872B774c354b195D88b104a402a159
74786A799B470b866b74a524C049A281A189A707B470B439g62A311f006B317B073
75277B774C201C35A585c781A250C933b957F1g93c66b256e153b439E183c171A494
$$ plain form
71793 3323 -732 2165 3110 -152 -2470 -5153 -2592 2317 -2317 2043 1921 -4390 1402 -5336 -30
72285 -518 -793 488 -2713 -549 -1738 -2317 884 -3110 1220 -1921 4055 1616 -9543 -2195 -1342 -2653
72799 2500 -1951 2683 -2104 -1463 -30 -4055 -305 5092 -4390 610 -1037 1220 -1281 5122 -1463
73287 1006 -1921 3567 -4146 -61 -3537 -2012 2104 -3720 -244 2043 4268 -2226 -2073 -671 -3689
73780 1921 -4604 1890 2622 1616 -3903 3506 3171 -122 -1982 2988 152 549 3384 4085 3232
74272 274 -427 2500 1524 -6494 0 2409 854 -2287 3872 2774 -3354 -2195 488 -2104 -1402 -1159
74786 1799 2470 -2866 -274 -1524 3049 1281 1189 1707 2470 2439 -762 1311 -6006 2317 2073
75277 2774 3201 335 1585 -3781 1250 3933 -2957 61 -793 -366 -2256 -5153 -2439 5183 -3171 1494
75796A281C445d787a524E79F1b348E49B256C232c384a921a463a921B470a524
76281B165A463A83b866A524@A128A707C140A52e49d055@c110a585a159b744c659
76833c079a83g988c110C293g104D177G32A250d909G32I299b073I1i45B165c506
77346B744B744A098C659b957e153B805a494D207e549h23C537c537B74c506A098
77837d848E061C262G62b134a951B287e122a037a799b866b073d88e092B439A555
78325D268e000c66A860e79a311c598b896c05C323e79b927g93b500D756c0B287
78848C140h84i76b226d756e610C628@e79G93D634c35a098B927G256A402A037
79361C720f1c567b866A311a342B866C384B592e732a555a585H54d939B043a311
$$ plain form
75796 1281 3445 -4787 -1524 579 61 -2348 549 2256 3232 -3384 -1921 -1463 -1921 2470 -1524
76281 2165 1463 183 -2866 1524 0 1128 1707 3140 152 -549 -4055 0 -3110 -1585 -1159 -2744 -3659
76833 -3079 -183 -7988 -3110 3293 -7104 4177 732 1250 -4909 732 9299 -2073 91 -945 2165 -3506
77346 2744 2744 1098 3659 -2957 -5153 2805 -1494 4207 -5549 -823 3537 -3537 274 -3506 1098
77837 -4848 5061 3262 762 -2134 -1951 2287 -5122 -1037 -1799 -2866 -2073 -488 -5092 2439 1555
78325 4268 -5000 -366 1860 -579 -1311 -3598 -2896 -305 3323 -579 -2927 -793 -2500 4756 -30 2287
78848 3140 -884 -976 -2226 -4756 -5610 3628 0 -579 793 4634 -335 -1098 2927 7256 1402 1037
79361 3720 -61 -3567 -2866 1311 -1342 2866 3384 2592 -5732 -1555 -1585 854 -4939 2043 -1311
79852B531B957H23c476H84E183g32C659C537B805a951D57C811E79A067c445a982
80372a006E427g01c079A494F372a189A281b378C476g043d939F10c171A037g62
80862B348A342B957b500a555b744c201e49c659C781A250G317I15a220A921a159
81351c689d970C110c964h23C0A463E762c0A433c659C05A616a342D482A52a616
81864c0d390c598B927C354b957e610G62D27a585b439F464C0b226C049a768A982
82385F10B012b195a738B409C354G62e762a707b531b134d390c994i1C35C05f128
82906A128A220a616A951C110d543A646F71g62B805b409c750d57b988a433F40
83389A646h23B409A677c66A52C201F250e336B988B348b226G01H54D055c110c964
$$ plain form
79852 2531 2957 823 -3476 884 5183 -732 3659 3537 2805 -1951 457 3811 579 1067 -3445 -1982
80372 -1006 5427 -701 -3079 1494 6372 -1189 1281 -2378 3476 -7043 -4939 610 -3171 1037 -762
80862 2348 1342 2957 -2500 -1555 -2744 -3201 -549 -3659 3781 1250 7317 915 -1220 1921 -1159
81351 -3689 -4970 3110 -3964 -823 30 1463 5762 -30 1433 -3659 305 1616 -1342 4482 152 -1616
81864 -30 -4390 -3598 2927 3354 -2957 -5610 762 427 -1585 -2439 6464 30 -2226 3049 -1768 1982
82385 610 2012 -2195 -1738 2409 3354 762 -5762 -1707 -2531 -2134 -4390 -3994 -91 335 305 -6128
82906 1128 1220 -1616 1951 3110 -4543 1646 671 -762 2805 -2409 -3750 -457 -2988 -1433 640
83389 1646 -823 2409 1677 -366 152 3201 6250 -5336 2988 2348 -2226 701 854 4055 -3110 -3964
83910H54C96G01C018A311e49C354H84b774b470b104e275C018D88A646d543C933
84429C018I1c66f159A707A342e49B866a311d27B592d573g470B74c079C415C140
84950C445F1C05B195d573B988a098g01I76b348a22A585D146C018A189a463a555
85466C079C96A616C35B104B835A128B13F128a738b744E49f586C110F1b713C171
85987C537c323a006B774A982C415B439b561a83C964f1b226c323F40f71B409c96
86502D27B378A677i76b531A768c05B561A646f71b561c018d207e397b74a311i45
87023b774e061A281b713a311B470A738E244a951b653A494C842d543a159A220
87481b13D543a524B470A524B713c598I15B378a646a463a494b195i15c659D025
$$ plain form
83910 854 396 701 3018 1311 -549 3354 884 -2774 -2470 -2104 -5275 3018 488 1646 -4543 3933
84429 3018 91 -366 -6159 1707 1342 -549 2866 -1311 -427 2592 -4573 -7470 274 -3079 3415 3140
84950 3445 61 305 2195 -4573 2988 -1098 -701 976 -2348 -122 1585 4146 3018 1189 -1463 -1555
85466 3079 396 1616 335 2104 2835 1128 213 6128 -1738 -2744 549 -6586 3110 61 -2713 3171
85987 3537 -3323 -1006 2774 1982 3415 2439 -2561 -183 3964 -61 -2226 -3323 640 -671 2409 -396
86502 427 2378 1677 -976 -2531 1768 -305 2561 1646 -671 -2561 -3018 -4207 -5397 -274 -1311 -945
87023 -2774 -5061 1281 -2713 -1311 2470 1738 5244 -1951 -2653 1494 3842 -4543 -1159 1220
87481 -213 4543 -1524 2470 1524 2713 -3598 915 2378 -1646 -1463 -1494 -2195 -915 -3659 4025
87972b378C079a524A707D512b774b195a067C018b378C35E031A921A829C628D665
88453b744D695g104A646A433e732A585i15G01a921f372a982d177e79c079B531
88944a067c476C964C964B195d27a006B74F71B165e915e214f1G32D848c293d787
89465D207f71A006i1C96e18E18b774e061b348b470B713d177C171a83a921F10
89984C445a494D57F1D695D421C35A646B74h84B531a250A585B13b348C201A494
90500a524I45B13H23c018a006c201A52B134i45C994B44A220B744b287d88c262
91022b835c872B317a189C96A585A707B988b74b866C171b74C933A555E79g62a463
91536I15c323f159d025b500G01C476a951b13A555A128b683f10A982@B195G409
$$ plain form
87972 -2378 3079 -1524 1707 4512 -2774 -2195 -1067 3018 -2378 335 5031 1921 1829 3628 4665
88453 -2744 4695 -7104 1646 1433 -5732 1585 -915 701 -1921 -6372 -1982 -4177 -579 -3079 2531
88944 -1067 -3476 3964 3964 2195 -427 -1006 274 671 2165 -5915 -5214 -61 732 4848 -3293 -4787
89465 4207 -671 1006 -91 396 -518 518 -2774 -5061 -2348 -2470 2713 -4177 3171 -183 -1921 610
89984 3445 -1494 457 61 4695 4421 335 1646 274 -884 2531 -1250 1585 213 -2348 3201 1494
90500 -1524 945 213 823 -3018 -1006 -3201 152 2134 -945 3994 244 1220 2744 -2287 -488 -3262
91022 -2835 -3872 2317 -1189 396 1585 1707 2988 -274 -2866 3171 -274 3933 1555 579 -762 -1463
91536 915 -3323 -6159 -4025 -2500 701 3476 -1951 -213 1555 1128 -2683 -610 1982 0 2195 7409
92057b988C445b744F1A463c35A707c110b988C201D88b866c079c781B317A311
92549B500i1B043I45D055A220d482a067a463A037B165A281B13A799c171b622
93037I15B287A098b043a067D57d146g62A463A524a159C537A83e000D27d025I147
93552f10A982B439A281C262i1A22a372A402a067A52c96I45B104C994a128b531
94068D329F067b835f1a52A768a829f1c201B226e18a006a067c842C598B957A372
94588c933a707D543A220c903F40A799a555f128b774f40C415C293C018a372B439
95080F799D787a982e18C96c354d421G62c964I45B226b195B439A921A738B287
95568C0b348I1E18B927c415C201e549b012B470B896A768b835a463D573a22B44
$$ plain form
92057 -2988 3445 -2744 61 1463 -335 1707 -3110 -2988 3201 488 -2866 -3079 -3781 2317 1311
92549 2500 -91 2043 945 4055 1220 -4482 -1067 -1463 1037 2165 1281 213 1799 -3171 -2622
93037 915 2287 1098 -2043 -1067 457 -4146 -762 1463 1524 -1159 3537 183 -5000 427 -4025 9147
93552 -610 1982 2439 1281 3262 -91 122 -1372 1402 -1067 152 -396 945 2104 3994 -1128 -2531
94068 4329 6067 -2835 -61 -152 1768 -1829 -61 -3201 2226 -518 -1006 -1067 -3842 3598 2957 1372
94588 -3933 -1707 4543 1220 -3903 640 1799 -1555 -6128 -2774 -640 3415 3293 3018 -1372 2439
95080 6799 4787 -1982 -518 396 -3354 -4421 762 -3964 945 2226 -2195 2439 1921 1738 2287
95568 30 -2348 91 518 2927 -3415 3201 -5549 -2012 2470 2896 1768 -2835 -1463 4573 -122 244
96083c110A52A646b74a646c415D27c293F1C0f1G62F494e49b622b896b44A006
96637a250C262C079a890B74B256a799e79a067A311A860d27F71c232a067a342
97124e18A52a585A22A281A890@a524b287A494A128G62F1a52i76c964c018e18
97673b805H84a189b256E549A921b13H54a799C933A585c140f10b774a860D878
98164A189b653g01B744D634b104e061C171c720a037B043c628A402a585A707C35
98645D573e18F40c750C354A982C872b165a83a799A342G93B592d268A951f71b378
99168C079I76b165A433A067c842i15b988I45f71a677A006a494c201d27a52a006
99682C415F1B744F829B378a768D116c66c323I45a799c96c293C628b256B683A22
$$ plain form
96083 -3110 152 1646 -274 -1646 -3415 427 -3293 61 30 -61 762 6494 -549 -2622 -2896 -244 1006
96637 -1250 3262 3079 -1890 274 2256 -1799 -579 -1067 1311 1860 -427 671 -3232 -1067 -1342
97124 -518 152 -1585 122 1281 1890 0 -1524 -2287 1494 1128 762 61 -152 -976 -3964 -3018 -518
97673 -2805 884 -1189 -2256 5549 1921 -213 854 -1799 3933 1585 -3140 -610 -2774 -1860 4878
98164 1189 -2653 -701 2744 4634 -2104 -5061 3171 -3720 -1037 2043 -3628 1402 -1585 1707 335
98645 4573 -518 640 -3750 3354 1982 3872 -2165 -183 -1799 1342 793 2592 -4268 1951 -671 -2378
99168 3079 976 -2165 1433 1067 -3842 -915 -2988 945 -671 -1677 1006 -1494 -3201 -427 -152 -1006
99682 3415 61 2744 6829 2378 -1768 4116 -366 -3323 945 -1799 -396 -3293 3628 -2256 2683 122
100205B561a921a311d207b74A098C05c476b043i45A677A220b195c201c872A159
100693A311b073a22d085B713E18G622g439F1B256a951g01D57b439c842D88a159
101214a311f128g561A372a189F10a311a098C0A524d27f71A890D451A250A372@
101728B988C049c689C567D909a616A646A281a433d88c476C842D573A402a372b470
102218A585H54c415c628f40h54e79I15d543A220b500a768h84b866H54b134B439
102740C628B683B317C05C659B195c0A799B378C66a433B957h23c201c96C750D57
103258d055h23d695A52G93A52b073e518A707d085H23B012a951F677E18d939f40
103772E183A52c262G62A829I15a951B988d085A707C262H54B683B653A159a189
$$ plain form
100205 2561 -1921 -1311 -4207 -274 1098 305 -3476 -2043 -945 1677 1220 -2195 -3201 -3872 1159
100693 1311 -2073 -122 -4085 2713 518 7622 -7439 61 2256 -1951 -701 457 -2439 -3842 488 -1159
101214 -1311 -6128 -7561 1372 -1189 610 -1311 -1098 30 1524 -427 -671 1890 4451 1250 1372 0
101728 2988 3049 -3689 3567 4909 -1616 1646 1281 -1433 -488 -3476 3842 4573 1402 -1372 -2470
102218 1585 854 -3415 -3628 -640 -854 -579 915 -4543 1220 -2500 -1768 -884 -2866 854 -2134 2439
102740 3628 2683 2317 305 3659 2195 -30 1799 2378 366 -1433 2957 -823 -3201 -396 3750 457
103258 -4055 -823 -4695 152 793 152 -2073 -5518 1707 -4085 823 2012 -1951 6677 518 -4939 -640
103772 5183 152 -3262 762 1829 915 -1951 2988 -4085 1707 3262 854 2683 2653 1159 -1189
104264I1D27B683A22A921d055a799C537C35a707F494A738A616B439B409b470e49
104785a342D57f738c0E122C903c811c567D848A799I76D88a860f10F40d817e061
105298b317I15A494D878c66a707b592B13c171E823a372D27B134c781C171D573
105789d512a646a372A037a768a707c201e945a738d57C66A707b409F1a067B957
106277B439D482h23C567a067c323f372B44A646a555d116A463C05D27A22e79E457
106792A22B896b134C903b439B470A982a281C110g93B561a250a83a22a159A098
107285c750a83b043a52A402c781F951G32A555b256c96A281a128D57B866b835F71
107806c659D878A860d756a860C0G93a799C66d665A098D116B256f71A128e18g62
$$ plain form
104264 91 427 2683 122 1921 -4055 -1799 3537 335 -1707 6494 1738 1616 2439 2409 -2470 -549
104785 -1342 457 -6738 -30 5122 3903 -3811 -3567 4848 1799 976 488 -1860 -610 640 -4817 -5061
105298 -2317 915 1494 4878 -366 -1707 -2592 213 -3171 5823 -1372 427 2134 -3781 3171 4573
105789 -4512 -1646 -1372 1037 -1768 -1707 -3201 -5945 -1738 -457 366 1707 -2409 61 -1067 2957
106277 2439 4482 -823 3567 -1067 -3323 -6372 244 1646 -1555 -4116 1463 305 427 122 -579 5457
106792 122 2896 -2134 3903 -2439 2470 1982 -1281 3110 -793 2561 -1250 -183 -122 -1159 1098
107285 -3750 -183 -2043 -152 1402 -3781 6951 732 1555 -2256 -396 1281 -1128 457 2866 -2835 671
107806 -3659 4878 1860 -4756 -1860 30 793 -1799 366 -4665 1098 4116 2256 -671 1128 -518 -762
108320F067a982g62c750C293d27b226a829c445b256I76H54C476g93a128C079a707
108838C140a250G073c96i15A250e18B744B74a006c323f10a098C96c35a463a768
109361D512f71A006A22a921D299a128C0A159A159a799g62B653a402A829a707b287
109875A799A768c96a128A006A555G93C201e305I15B713D57e49e579a860a860a22
110398E49a037A646B896B165a921C201a494A342H84a159f494a616B896c96i76
110883a372a799F71@B287a52c384f1A433i1A52C079g348B653E671D756A585E79
111433e49A707B713D025a951a372C842B073B043B622A067A555d878f1C140D88
111925a067g01b317A128a494I15@B805C933A311c628f159b653c96B835A921a616
$$ plain form
108320 6067 -1982 -762 -3750 3293 -427 -2226 -1829 -3445 -2256 976 854 3476 -793 -1128 3079 -1707
108838 3140 -1250 7073 -396 -915 1250 -518 2744 274 -1006 -3323 -610 -1098 396 -335 -1463 -1768
109361 4512 -671 1006 122 -1921 4299 -1128 30 1159 1159 -1799 -762 2653 -1402 1829 -1707 -2287
109875 1799 1768 -396 -1128 1006 1555 793 3201 -5305 915 2713 457 -549 -5579 -1860 -1860 -122
110398 549 -1037 1646 2896 2165 -1921 3201 -1494 1342 884 -1159 -6494 -1616 2896 -396 -976
110883 -1372 -1799 671 0 2287 -152 -3384 -61 1433 -91 152 3079 -7348 2653 5671 4756 1585 579
111433 -549 1707 2713 4025 -1951 -1372 3842 2073 2043 2622 1067 1555 -4878 -61 3140 488
111925 -1067 -701 -2317 1128 -1494 915 0 2805 3933 1311 -3628 -6159 -2653 -396 2835 1921 -1616
112438D878e79b012c567D88I45c140d57b774i76c140A22A189A83C66f951a494
112959i76D604e915G500c354d390a311a921H54D27b287c964C079b835G62B744
113450b287A311E732G01d543F71c049B134C05c201a067f71C598A921e49c96a220
113966A250C628c0B470I45B378B74D27b256B439c598A22a220b287b927C0a189
114485a768G01b195d055D329d57D573f098B622G32A829B256B866B287i1B317a616
115006a738A524b622D390F586A707B592d207I45C842A52b134C049B561c079C384
115489I45a006b866C35B439a951g744C018c384a220G62d57D57a982g01F220f860
116011g01D329B74h84b622b348B165C567i15a52c018@C96c171f71c049B073g01
$$ plain form
112438 4878 -579 -2012 -3567 488 945 -3140 -457 -2774 -976 -3140 122 1189 183 366 -6951 -1494
112959 -976 4604 -5915 7500 -3354 -4390 -1311 -1921 854 427 -2287 -3964 3079 -2835 762 2744
113450 -2287 1311 5732 701 -4543 671 -3049 2134 305 -3201 -1067 -671 3598 1921 -549 -396 -1220
113966 1250 3628 -30 2470 945 2378 274 427 -2256 2439 -3598 122 -1220 -2287 -2927 30 -1189
114485 -1768 701 -2195 -4055 4329 -457 4573 -6098 2622 732 1829 2256 2866 2287 -91 2317 -1616
115006 -1738 1524 -2622 4390 6586 1707 2592 -4207 945 3842 152 -2134 3049 2561 -3079 3384
115489 945 -1006 -2866 335 2439 -1951 -7744 3018 -3384 -1220 762 -457 457 -1982 -701 6220 -6860
116011 -701 4329 274 -884 -2622 -2348 2165 3567 -915 -152 -3018 0 396 -3171 -671 -3049 2073 -701
116556a555A799A372a463c262C05a677B927a951a860B683A677A22B744A159B927
117045B500c323a646b043a707A189C66d238i1B713i15E49b835a52C05C689a250
117567b165b409d238F555a037A585b592c445b165A342B226H23A220a707B44b409
118058B957d116i15b988d116d27c110B653A128C659c628A402D726a463f311I15
118541B500c140A921a707a982a555D756G01C018b774c66b226G62c140B805C66
119031B896a402C720a22G32d695D88B561A738a189a982F71D146e457c018D177
119520C35A768D116D88A372B44I76A037B500G32B622b287h54A006E214C384G32
120041h84c262a524E884d177g01b74b165B226B531E427A342A524g62A524b805
$$ plain form
116556 -1555 1799 1372 -1463 -3262 305 -1677 2927 -1951 -1860 2683 1677 122 2744 1159 2927
117045 2500 -3323 -1646 -2043 -1707 1189 366 -4238 -91 2713 -915 549 -2835 -152 305 3689 -1250
117567 -2165 -2409 -4238 6555 -1037 1585 -2592 -3445 -2165 1342 2226 823 1220 -1707 244 -2409
118058 2957 -4116 -915 -2988 -4116 -427 -3110 2653 1128 3659 -3628 1402 4726 -1463 -6311 915
118541 2500 -3140 1921 -1707 -1982 -1555 4756 701 3018 -2774 -366 -2226 762 -3140 2805 366
119031 2896 -1402 3720 -122 732 -4695 488 2561 1738 -1189 -1982 671 4146 -5457 -3018 4177
119520 335 1768 4116 488 1372 244 976 1037 2500 732 2622 -2287 -854 1006 5214 3384 732
120041 -884 -3262 -1524 5884 -4177 -701 -274 -2165 2226 2531 5427 1342 1524 -762 1524 -2805
120525H84e884b988A890b378A311i76b470E18C415b592c262B13c05c201d177i1
121042a982A921a524C537a52h23i1A250@B348b165I1B713c994c0f1d207f311B683
121626a250a22b927C506a433H54C171a372B713e153A616D085D88i1b439b653A037
122144a189c781A738a616B896B561B073d451f10C140B317a067I76a189F40d025
122635c293C354b988a52A006f40A098D695c445E640B622A128H54b500a494C35
123118F40E000a524c933B44f1H84D238b287e49A860C96c0b44a677c964A494B13
123671f098C628A189B226b74b195B957c537E366B012c96e305a951c842C35a799
124156b74C079C476D27I76B226A982B653C262A677c415a311A372B226a281a342
$$ plain form
120525 884 -5884 -2988 1890 -2378 1311 -976 -2470 518 3415 -2592 -3262 213 -305 -3201 -4177 -91
121042 -1982 1921 -1524 3537 -152 -823 -91 1250 0 2348 -2165 91 2713 -3994 -30 -61 -4207 -6311 2683
121626 -1250 -122 -2927 3506 -1433 854 3171 -1372 2713 -5153 1616 4085 488 -91 -2439 -2653 1037
122144 -1189 -3781 1738 -1616 2896 2561 2073 -4451 -610 3140 2317 -1067 976 -1189 640 -4025
122635 -3293 3354 -2988 -152 1006 -640 1098 4695 -3445 5640 2622 1128 854 -2500 -1494 335
123118 640 5000 -1524 -3933 244 -61 884 4238 -2287 -549 1860 396 -30 -244 -1677 -3964 1494 213
123671 -6098 3628 1189 2226 -274 -2195 2957 -3537 5366 2012 -396 -5305 -1951 -3842 335 -1799
124156 -274 3079 3476 427 976 2226 1982 2653 3262 1677 -3415 -1311 1372 2226 -1281 -1342
124645g93E49c0c140a951c171B470a342h54b470b500f433i76d27d665c05A463
125166A555a616a555A677C35C262A646A52D146A281G93a281a433a616A616i76
125651g62C842i15H84@a829d878b531@G32B713a829A037c293B195b104c994A402
126204b713c35d88b13b439i76F40c537g93f10A311a52C872i76a037C659A128a128
126750B896c720b774a037A616F1C171b774I15b012g165a342B134B74E49B226A738
127268a250B012c964B74D207a555A646f40c293C66a890d451a402b744A402i1C66
127791A52D543A372a433D909b531A921a098d88A220c354B835C96b165D238I1D268
128304d360A677I15a037E79A067D27C445b561A250F71G32e49c964D909a677A250
$$ plain form
124645 -793 549 -30 -3140 -1951 -3171 2470 -1342 -854 -2470 -2500 -6433 -976 -427 -4665 -305 1463
125166 1555 -1616 -1555 1677 335 3262 1646 152 4146 1281 793 -1281 -1433 -1616 1616 -976
125651 -762 3842 -915 884 0 -1829 -4878 -2531 0 732 2713 -1829 1037 -3293 2195 -2104 -3994 1402
126204 -2713 -335 -488 -213 -2439 -976 640 -3537 -793 -610 1311 -152 3872 -976 -1037 3659 1128 -1128
126750 2896 -3720 -2774 -1037 1616 61 3171 -2774 915 -2012 -7165 -1342 2134 274 549 2226 1738
127268 -1250 2012 -3964 274 4207 -1555 1646 -640 -3293 366 -1890 -4451 -1402 -2744 1402 -91 366
127791 152 4543 1372 -1433 4909 -2531 1921 -1098 -488 1220 -3354 2835 396 -2165 4238 91 4268
128304 -4360 1677 915 -1037 579 1067 427 3445 -2561 1250 671 732 -549 -3964 4909 -1677 1250
128825E640e244D57i15B653b470c05b866a982e18b409a037b378a921b195b134
129311I1A951C049a890c323A524B44A616g93b44b378a220c415c842a555A311d055
129832C05A738b470C689a585A494C506B683e275I45b134E762b378A311g93G01
130320C354a890b348A006c415B774i1b500c750f71I1B500b896c0c05F037a738
130843G93E457d57b561G93E18H506C994B561B134b805B134A159A555A646E79A707
131356D360E49d756B470a707e518D421F677e18b683E031c872c415A677D878g195
131847e18A433C35b44e183C05b470d970B805B226A463a707E49C0d57C659i45e092
132399e884d848C66B439B287A250D27A037a006a677E305h23B622a829b44b653
$$ plain form
128825 5640 -5244 457 -915 2653 -2470 -305 -2866 -1982 -518 -2409 -1037 -2378 -1921 -2195 -2134
129311 91 1951 3049 -1890 -3323 1524 244 1616 -793 -244 -2378 -1220 -3415 -3842 -1555 1311 -4055
129832 305 1738 -2470 3689 -1585 1494 3506 2683 -5275 945 -2134 5762 -2378 1311 -793 701
130320 3354 -1890 -2348 1006 -3415 2774 -91 -2500 -3750 -671 91 2500 -2896 -30 -305 6037 -1738
130843 793 5457 -457 -2561 793 518 8506 3994 2561 2134 -2805 2134 1159 1555 1646 579 1707
131356 4360 549 -4756 2470 -1707 -5518 4421 6677 -518 -2683 5031 -3872 -3415 1677 4878 -7195
131847 -518 1433 335 -244 -5183 305 -2470 -4970 2805 2226 1463 -1707 549 30 -457 3659 -945 -5092
132399 -5884 -4848 366 2439 2287 1250 427 1037 -1006 -1677 5305 -823 2622 -1829 -244 -2653
132887C110b592b835A098b073b043B805h84C96D27B835C872a463F71e031A128
133370e000c537B866A890A738c262d116a585c232A677A067d329C689a890D27C598
133859a83c659b44D025c110B317a128C842i45d88D817G93A829a372b805a951F829
134380B104a860C96e183B043A067C964A220C720b073I1E884A250a555B653C933
134871D207F1C384g348B317D27H23E49b744A524a128C05e49i45a951f006c506
135386a006A585A189A799b012E49c66h23E49I1i45B653C66b592c354B896F1e092
135935D88E305I1c354A524B043h23c35d177a524a890A921c415b592B957A982B653
136457B531A799E214A311a524B531b470i76a616A951A463c66d360c66B134C384
$$ plain form
132887 3110 -2592 -2835 1098 -2073 -2043 2805 -884 396 427 2835 3872 -1463 671 -5031 1128
133370 -5000 -3537 2866 1890 1738 -3262 -4116 -1585 -3232 1677 1067 -4329 3689 -1890 427 3598
133859 -183 -3659 -244 4025 -3110 2317 -1128 3842 -945 -488 4817 793 1829 -1372 -2805 -1951 6829
134380 2104 -1860 396 -5183 2043 1067 3964 1220 3720 -2073 91 5884 1250 -1555 2653 3933
134871 4207 61 3384 -7348 2317 427 823 549 -2744 1524 -1128 305 -549 -945 -1951 -6006 -3506
135386 -1006 1585 1189 1799 -2012 549 -366 -823 549 91 -945 2653 366 -2592 -3354 2896 61 -5092
135935 488 5305 91 -3354 1524 2043 -823 -335 -4177 -1524 -1890 1921 -3415 -2592 2957 1982 2653
136457 2531 1799 5214 1311 -1524 2531 -2470 -976 -1616 1951 1463 -366 -4360 -366 2134 3384
136947a281e79B866e305c110c964C628f220c537A067d634D604a402a585B104c293
137430B195A22C415f829c415c66b13b774A951C05c781b470d177F10E49D27C110
137951c049G32b012c750a311c35D970a677b195f40f860a646A951C66C994C811
138440F829b805c476D634A372I45c628B713A006D88B012C964a128B012C781E000
138928i76H23d27c018h23I1B653B195D57a494a494c201A951c66B256h23b44b622
139475c05b104d207a860A494a951C049A494b104b073D756A342D207b378e244A982
139966a524a616g470c110a524B317C201i76A372f71d482c567b348A83B866A067
140450A829D57B896f1b470a951h811C964f10i15H84A342b195b043C0A067A128
$$ plain form
136947 -1281 -579 2866 -5305 -3110 -3964 3628 -6220 -3537 1067 -4634 4604 -1402 -1585 2104 -3293
137430 2195 122 3415 -6829 -3415 -366 -213 -2774 1951 305 -3781 -2470 -4177 610 549 427 3110
137951 -3049 732 -2012 -3750 -1311 -335 4970 -1677 -2195 -640 -6860 -1646 1951 366 3994 3811
138440 6829 -2805 -3476 4634 1372 945 -3628 2713 1006 488 2012 3964 -1128 2012 3781 5000
138928 -976 823 -427 -3018 -823 91 2653 2195 457 -1494 -1494 -3201 1951 -366 2256 -823 -244 -2622
139475 -305 -2104 -4207 -1860 1494 -1951 3049 1494 -2104 -2073 4756 1342 4207 -2378 -5244 1982
139966 -1524 -1616 -7470 -3110 -1524 2317 3201 -976 1372 -671 -4482 -3567 -2348 183 2866 1067
140450 1829 457 2896 -61 -2470 -1951 -8811 3964 -610 -915 884 1342 -2195 -2043 30 1067 1128
140971B409a982E18E18C323C05b927e336h262b774C293a646G439a372a860C05
141459f10C537B043b287i76a921G93E79A311a921A494G01c049d939a982A006A83
141982H54D390d268e793c476a189b348B073C567a829a829A829h54B957C140a037
142466a220a707D604b317B043G93I45d88d238G62B256b713B195d57A524a890b866
142988h54c323B44C232a006B195I1I45G32A037b470c537C750B256F71d909C018
143503A83c66a433b866B409b043c05A707F40G32B988A22e366a067C659a067d57
144022B713c96b470C415G958a677a342B713C262B866f40C293a311D27G32A128
144512C781B165a494c0A494E79a921C35D817D88b531d238a22C66b226E18h23b226
$$ plain form
140971 2409 -1982 518 518 3323 305 -2927 -5336 -8262 -2774 3293 -1646 7439 -1372 -1860 305
141459 -610 3537 2043 -2287 -976 -1921 793 579 1311 -1921 1494 701 -3049 -4939 -1982 1006 183
141982 854 4390 -4268 -5793 -3476 -1189 -2348 2073 3567 -1829 -1829 1829 -854 2957 3140 -1037
142466 -1220 -1707 4604 -2317 2043 793 945 -488 -4238 762 2256 -2713 2195 -457 1524 -1890 -2866
142988 -854 -3323 244 3232 -1006 2195 91 945 732 1037 -2470 -3537 3750 2256 671 -4909 3018
143503 183 -366 -1433 -2866 2409 -2043 -305 1707 640 732 2988 122 -5366 -1067 3659 -1067 -457
144022 2713 -396 -2470 3415 7958 -1677 -1342 2713 3262 2866 -640 3293 -1311 427 732 1128
144512 3781 2165 -1494 -30 1494 579 -1921 335 4817 488 -2531 -4238 -122 366 -2226 518 -823 -2226
145056g32a677c476G01C415I76A189d025f10a128B470C720c171d116A402b470
145547a433E579D604a098C66b348A860b226B13a281b74d512E49A555H84A707f1
146070A006B195a006E823A555D451b500B409b012h84e18B744C659c506B957b44
146552A555A159B256c66c842C415f40a951a037a860E79C018b44a22H049F71B348
147071d970c598D299B073c628d27i45a52c567f1f40g62a524B409e336@d238A006
147625I76b805B13b592a677C96b226a890G775b927b531c354b927a951B592a890
148108c232C872A463B927c018a372A738@a281C232b043e854B653b226b988C232
148600C35a707a037D848C781d57B74A067F1e732D27b774d116B774b256e275B653
$$ plain form
145056 -732 -1677 -3476 701 3415 976 1189 -4025 -610 -1128 2470 3720 -3171 -4116 1402 -2470
145547 -1433 5579 4604 -1098 366 -2348 1860 -2226 213 -1281 -274 -4512 549 1555 884 1707 -61
146070 1006 2195 -1006 5823 1555 4451 -2500 2409 -2012 -884 -518 2744 3659 -3506 2957 -244
146552 1555 1159 2256 -366 -3842 3415 -640 -1951 -1037 -1860 579 3018 -244 -122 8049 671 2348
147071 -4970 -3598 4299 2073 -3628 -427 -945 -152 -3567 -61 -640 -762 -1524 2409 -5336 0 -4238 1006
147625 976 -2805 213 -2592 -1677 396 -2226 -1890 7775 -2927 -2531 -3354 -2927 -1951 2592 -1890
148108 -3232 3872 1463 2927 -3018 -1372 1738 0 -1281 3232 -2043 -5854 2653 -2226 -2988 3232
148600 335 -1707 -1037 4848 3781 -457 274 1067 61 -5732 427 -2774 -4116 2774 -2256 -5275 2653
149116i15f1A860B531A982A311e732a463D27e18f10B74I45c201b317D329G01C66
149665b74f1d543e854D57B835D299e183A921c35F71a616i1e397e976c323f10B957
150217C35b713C96I45c781b165b378C05C506e18C0c354A463A250d604e336c781
150738B165D27B988e49b195B378C05a982c96A250C110G32e18d57F71B409B195
151252h84c964D88d085D88A220b927c689B896B104e49A646I299E49A738c66G073
151773e366b409b195B226d57b744c66i76B531A555a006E640C354f159a006b195
152257a128a311f067D604c018C903c445B165A646B805a22b74A402b927F40A220
152745E031f71B439a311A799A83d116A677E000C689E457b104B774c994b104A52
$$ plain form
149116 -915 -61 1860 2531 1982 1311 -5732 -1463 427 -518 -610 274 945 -3201 -2317 4329 701 366
149665 -274 -61 -4543 -5854 457 2835 4299 -5183 1921 -335 671 -1616 -91 -5397 -5976 -3323 -610 2957
150217 335 -2713 396 945 -3781 -2165 -2378 305 3506 -518 30 -3354 1463 1250 -4604 -5336 -3781
150738 2165 427 2988 -549 -2195 2378 305 -1982 -396 1250 3110 732 -518 -457 671 2409 2195
151252 -884 -3964 488 -4085 488 1220 -2927 -3689 2896 2104 -549 1646 9299 549 1738 -366 7073
151773 -5366 -2409 -2195 2226 -457 -2744 -366 -976 2531 1555 -1006 5640 3354 -6159 -1006 -2195
152257 -1128 -1311 -6067 4604 -3018 3903 -3445 2165 1646 2805 -122 -274 1402 -2927 640 1220
152745 5031 -671 2439 -1311 1799 183 -4116 1677 5000 3689 5457 -2104 2774 -3994 -2104 152
153236D878A463d970d756B165A402b165b165a372B835c201C750A83B13E336a707
153728B653E061b439B44b13F738C110A616E79h84E49B835B226d27c171d451b226
154248c110d238g32c171c049b561C66A829G93h23a555a220C903c964d207G01F40
154761B683d88a738I76E762A524A982b44B44H23b561c262b957A128d939d482F433
155283b439B470D27B195b988D268d543b073c079B927b470I76a159h54b226c354
155771D57b317e79A311B104C232d025A585a372b195I76C506C05B713h23B835h84
156292c598H23A372b348a006c049E153I76D085e183f1a585B74C079E945A402b622
156807g01C05A83E153a189b317f10f1E79e122@a52c05C933b805a890B622d726
$$ plain form
153236 4878 1463 -4970 -4756 2165 1402 -2165 -2165 -1372 2835 -3201 3750 183 213 5336 -1707
153728 2653 5061 -2439 244 -213 6738 3110 1616 579 -884 549 2835 2226 -427 -3171 -4451 -2226
154248 -3110 -4238 -732 -3171 -3049 -2561 366 1829 793 -823 -1555 -1220 3903 -3964 -4207 701 640
154761 2683 -488 -1738 976 5762 1524 1982 -244 244 823 -2561 -3262 -2957 1128 -4939 -4482 6433
155283 -2439 2470 427 2195 -2988 4268 -4543 -2073 -3079 2927 -2470 976 -1159 -854 -2226 -3354
155771 457 -2317 -579 1311 2104 3232 -4025 1585 -1372 -2195 976 3506 305 2713 -823 2835 -884
156292 -3598 823 1372 -2348 -1006 -3049 5153 976 4085 -5183 -61 -1585 274 3079 5945 1402 -2622
156807 -701 305 183 5153 -1189 -2317 -610 -61 579 -5122 0 -152 -305 3933 -2805 -1890 2622 -4726
157358D025i1C445B683c811I45c476a890a281E671a83A799B896A067B592I45E579
157872C232A83C293b134C659a585I15a220B287B744A829b104f1d025G32D939b622
158393E915a585B012a799b287C96a921B317d27b683A829e427B012A738A707f10
158881a037C201F433e275C171C598a890a982G93a006a83B104C35A128D909h23
159372b287d695c293a799a52A890d268d146a52a159d055B195c0d146a342A159
159863C994a83h54C720A768A951c140C35F037C262c018e518a677b744d025c171
160348h23a067A52A83A281f1d299a707C05a555A098b165a159C35a250e488A098
160869b622a220D390g32a402C201d177F10a860c96F40c720d726a585B44c171C35
$$ plain form
157358 4025 -91 3445 2683 -3811 945 -3476 -1890 -1281 5671 -183 1799 2896 1067 2592 945 5579
157872 3232 183 3293 -2134 3659 -1585 915 -1220 2287 2744 1829 -2104 -61 -4025 732 4939 -2622
158393 5915 -1585 2012 -1799 -2287 396 -1921 2317 -427 -2683 1829 -5427 2012 1738 1707 -610
158881 -1037 3201 6433 -5275 3171 3598 -1890 -1982 793 -1006 -183 2104 335 1128 4909 -823
159372 -2287 -4695 -3293 -1799 -152 1890 -4268 -4146 -152 -1159 -4055 2195 -30 -4146 -1342 1159
159863 3994 -183 -854 3720 1768 1951 -3140 335 6037 3262 -3018 -5518 -1677 -2744 -4025 -3171
160348 -823 -1067 152 183 1281 -61 -4299 -1707 305 -1555 1098 -2165 -1159 335 -1250 -5488 1098
160869 -2622 -1220 4390 -732 -1402 3201 -4177 610 -1860 -396 640 -3720 -4726 -1585 244 -3171 335
161388A006D055a524e18B226C0E457a159B287A098b439B317b622A52i45A067h506
161904B927C262A677a159B165c018A22I76c232c96g62B774i45g32f71a067F10
162420h23B713F1e49c537a433A52f10E18a006G104h84B957i76i45B134A402d207
162973b835d57B073A281B13b256A768D726D27e457C171a799D177I1a250b012c872
163489A829c0@C872a860C66a494a585A433a677a646c66F40a616D695B165b073
164007e701c66D482A159f433I15f1G93b713d817i76A372D57A982A037b165a433
164530a433c0c445a037b744e397G01f40a616a829A707A585A250B470C384I1B805
165045b866A555a860A921e031a311h84a159d025E336a555B287a890b592G93A52
$$ plain form
161388 1006 4055 -1524 -518 2226 30 5457 -1159 2287 1098 -2439 2317 -2622 152 -945 1067 -8506
161904 2927 3262 1677 -1159 2165 -3018 122 976 -3232 -396 -762 2774 -945 -732 -671 -1067 610
162420 -823 2713 61 -549 -3537 -1433 152 -610 518 -1006 7104 -884 2957 -976 -945 2134 1402 -4207
162973 -2835 -457 2073 1281 213 -2256 1768 4726 427 -5457 3171 -1799 4177 91 -1250 -2012 -3872
163489 1829 -30 0 3872 -1860 366 -1494 -1585 1433 -1677 -1646 -366 640 -1616 4695 2165 -2073
164007 -5701 -366 4482 1159 -6433 915 -61 793 -2713 -4817 -976 1372 457 1982 1037 -2165 -1433
164530 -1433 -30 -3445 -1037 -2744 -5397 701 -640 -1616 -1829 1707 1585 1250 2470 3384 91 2805
165045 -2866 1555 -1860 1921 -5031 -1311 -884 -1159 -4025 5336 -1555 2287 -1890 -2592 793 152
165535E244b13a22B988d695C445e18c628d787B805D207A646D146e49C506a585
166020b713a83h23d512c018C0b531B957g592F403B866D57G62A951f40a494A585
166538b896C66F311a738g134A768e79c262C781I1I15c598a738A83A067d177C66
167061f71c476C66D27h54c384b74a433A646G32E640E79c933B561b774b378i76
167575a677I1a433D390B439c598B226b043c0d085A52h23a372b805A098C05A677
168098a738c293C171H23A220c049g62D57b683B866A128c354a768D57a585B348
168582B195b13D543a402B165a281A402B439B317b744d482b988b134b195d268A585
169070f464D421E610a646e49E79f494e49b774g62f71a250a22A982b470i76G32
$$ plain form
165535 5244 -213 -122 2988 -4695 3445 -518 -3628 -4787 2805 4207 1646 4146 -549 3506 -1585
166020 -2713 -183 -823 -4512 -3018 30 -2531 2957 -7592 6403 2866 457 762 1951 -640 -1494 1585
166538 -2896 366 6311 -1738 -7134 1768 -579 -3262 3781 91 915 -3598 -1738 183 1067 -4177 366
167061 -671 -3476 366 427 -854 -3384 -274 -1433 1646 732 5640 579 -3933 2561 -2774 -2378 -976
167575 -1677 91 -1433 4390 2439 -3598 2226 -2043 -30 -4085 152 -823 -1372 -2805 1098 305 1677
168098 -1738 -3293 3171 823 1220 -3049 -762 457 -2683 2866 1128 -3354 -1768 457 -1585 2348
168582 2195 -213 4543 -1402 2165 -1281 1402 2439 2317 -2744 -4482 -2988 -2134 -2195 -4268 1585
169070 -6464 4421 5610 -1646 -549 579 -6494 -549 -2774 -762 -671 -1250 -122 1982 -2470 -976 732
169592A128C476e640a982D634g01c079c537C659b592c018G32d665e427a83I1A250
170106E79a037c323i025a829B134A402A067c35D88I76a646E701d543E79f250b774
170627e49A768b622F1a281c872a646c750f372B073D634a006D27A159C476a311
171113c96A22E79C598a220E18c35@A220b104E79f71B44a555A799I45A128A829
171662A250e244A83c903b439b256A433I15g01b012D909G01A250b561F1c66A006
172185A890I45c96g93E061C66E79A646c049H54a982e183A037C05a951f40d482
172706B805B043F1H23C781b043b622A037a799E915B74a22E49B927B896A159A52
173222E000d177A159A098F71e610A524A037b592b409b774d27A281H54a250b774
$$ plain form
169592 1128 3476 -5640 -1982 4634 -701 -3079 -3537 3659 -2592 -3018 732 -4665 -5427 -183 91 1250
170106 579 -1037 -3323 -9025 -1829 2134 1402 1067 -335 488 976 -1646 5701 -4543 579 -6250 -2774
170627 -549 1768 -2622 61 -1281 -3872 -1646 -3750 -6372 2073 4634 -1006 427 1159 3476 -1311
171113 -396 122 579 3598 -1220 518 -335 0 1220 -2104 579 -671 244 -1555 1799 945 1128 1829
171662 1250 -5244 183 -3903 -2439 -2256 1433 915 -701 -2012 4909 701 1250 -2561 61 -366 1006
172185 1890 945 -396 -793 5061 366 579 1646 -3049 854 -1982 -5183 1037 305 -1951 -640 -4482
172706 2805 2043 61 823 3781 -2043 -2622 1037 -1799 5915 274 -122 549 2927 2896 1159 152
173222 5000 -4177 1159 1098 671 -5610 1524 1037 -2592 -2409 -2774 -427 1281 854 -1250 -2774
173706c018a311a037C66a22C293c659A463a067h84f708c781C66a402F40e18c628
174225I15D88c35D88b134g226b774b531a0793B195C05C476G62B835D88A433A707
174746f921B44a281c66d787c293d756f40d207A006c35c506d451D085d116F098
175235f71a311c994C323c96B866A52e762H354D512i15B317a707b439b683B13B13
175751b988a768a372i1E275B287E18b774A890d787B470A524I15c35B256b287C506
176272G01D482F1a951b561C354I15A83c476D299A616a037C05a555b713D025d177
176786B256a555C201A433d573b012I76i45B165F311a220d57A677d512A982D27
177274a372A189A524b043D573c05F860B44a006A189c659c35b927B896d634A250
$$ plain form
173706 -3018 -1311 -1037 366 -122 3293 -3659 1463 -1067 -884 -6708 -3781 366 -1402 640 -518 -3628
174225 915 488 -335 488 -2134 -7226 -2774 -2531 -10793 2195 305 3476 762 2835 488 1433 1707
174746 -6921 244 -1281 -366 -4787 -3293 -4756 -640 -4207 1006 -335 -3506 -4451 4085 -4116 6098
175235 -671 -1311 -3994 3323 -396 2866 152 -5762 8354 4512 -915 2317 -1707 -2439 -2683 213 213
175751 -2988 -1768 -1372 -91 5275 2287 518 -2774 1890 -4787 2470 1524 915 -335 2256 -2287 3506
176272 701 4482 61 -1951 -2561 3354 915 183 -3476 4299 1616 -1037 305 -1555 -2713 4025 -4177
176786 2256 -1555 3201 1433 -4573 -2012 976 -945 2165 6311 -1220 -457 1677 -4512 1982 427
177274 -1372 1189 1524 -2043 4573 -305 6860 244 -1006 1189 -3659 -335 -2927 2896 -4634 1250
177765a494I45G897g01a524A494A159c781b592B653a189b44b74a250d665b74b378
178287E305E092f1e610a738H54B439C567G01b043e884A677A860c567B226a829
178770C232e366h84d451a220E18a463A311E061b13h23c506g93B195A189a433B439
179291e732C476b531d634d085d512b531a83C171h54B683B653c66b835d57g01A281
179810a951d329a189a555a921a494A098b317c994c598A585a098g62C872A860D27
180301e397f281g012d57H23F40h54B134b896f1H54F71A555C140b317b043A707
180815c262B073a159a52f40D329b256f71b835A128C750B622E18C415D695A768
181307D27A098b470b378a494e79B531d970C0A555a311B256e49b622a463i421C659
$$ plain form
177765 -1494 945 7897 -701 -1524 1494 1159 -3781 -2592 2653 -1189 -244 -274 -1250 -4665 -274 -2378
178287 5305 5092 -61 -5610 -1738 854 2439 3567 701 -2043 -5884 1677 1860 -3567 2226 -1829
178770 3232 -5366 -884 -4451 -1220 518 -1463 1311 5061 -213 -823 -3506 -793 2195 1189 -1433 2439
179291 -5732 3476 -2531 -4634 -4085 -4512 -2531 -183 3171 -854 2683 2653 -366 -2835 -457 -701 1281
179810 -1951 -4329 -1189 -1555 -1921 -1494 1098 -2317 -3994 -3598 1585 -1098 -762 3872 1860 427
180301 -5397 -6281 -7012 -457 823 640 -854 2134 -2896 -61 854 671 1555 3140 -2317 -2043 1707
180815 -3262 2073 -1159 -152 -640 4329 -2256 -671 -2835 1128 3750 2622 518 3415 4695 1768
181307 427 1098 -2470 -2378 -1494 -579 2531 -4970 30 1555 -1311 2256 -549 -2622 -1463 -9421 3659
181819C049C140a098A220E854B287D146B134g62b287G93b74C201A707d177f40
182307h23b713D970c96B195a83B165c35a707D57a982g62i76B378D88a860D57A128
182861f71a250c628d726C35I76b287c05A524a890H23a52C476b073C689b287G93
183375d543c781A616a524A524a860a037h54A982b592A433B683a799D970a006B44
183867c201H54F189E153a189C0a829a128e031D909A585B653f1D573C415b500B653
184382A402A372g01b287A006C293i15f10a890b774b44D573h84C567d878a250E732
184904a616D27c049B470c872d085d939g01D360a982c0c96g62A494F71A890b531
185423b774A52b988A921c689a433A22A159A067A52B500B287a768c354b317A311
$$ plain form
181819 3049 3140 -1098 1220 5854 2287 4146 2134 -762 -2287 793 -274 3201 1707 -4177 -640
182307 -823 -2713 4970 -396 2195 -183 2165 -335 -1707 457 -1982 -762 -976 2378 488 -1860 457 1128
182861 -671 -1250 -3628 -4726 335 976 -2287 -305 1524 -1890 823 -152 3476 -2073 3689 -2287 793
183375 -4543 -3781 1616 -1524 1524 -1860 -1037 -854 1982 -2592 1433 2683 -1799 4970 -1006 244
183867 -3201 854 6189 5153 -1189 30 -1829 -1128 -5031 4909 1585 2653 -61 4573 3415 -2500 2653
184382 1402 1372 -701 -2287 1006 3293 -915 -610 -1890 -2774 -244 4573 -884 3567 -4878 -1250 5732
184904 -1616 427 -3049 2470 -3872 -4085 -4939 -701 4360 -1982 -30 -396 -762 1494 671 1890 -2531
185423 -2774 152 -2988 1921 -3689 -1433 122 1159 1067 152 2500 2287 -1768 -3354 -2317 1311
185907C96h84b195F067A342B805c05B653g32B317A22c750A220c05C628b470g93
186432a433a799H23f1b13c05B256g01A494g32c018a951a524E49a281C171A52B317
186978b287C35a006e854b317D573G01B866a829b409A921f067C994a646c232@D88
187496D543e549B226A982D482I15E18c262F71B683h23G01C05b74A037A281B653
188019B348B744F1a342B957A128b713b317c933D57f616b256H537d177H84c66B104
188532b866A342a128d909B470b317B13I15C140a768d27B317b287C415A281C079
189023A098D146A311B195b561a890b195b378c049d848b44c323H23b713A037A463
189514c96b470C018b134C689G32C994c445b470a189A677D695c018a738a799A921
$$ plain form
185907 396 -884 -2195 6067 1342 2805 -305 2653 -732 2317 122 -3750 1220 -305 3628 -2470 -793
186432 -1433 -1799 823 -61 -213 -305 2256 -701 1494 -732 -3018 -1951 -1524 549 -1281 3171 152 2317
186978 -2287 335 -1006 -5854 -2317 4573 701 2866 -1829 -2409 1921 -6067 3994 -1646 -3232 0 488
187496 4543 -5549 2226 1982 4482 915 518 -3262 671 2683 -823 701 305 -274 1037 1281 2653
188019 2348 2744 61 -1342 2957 1128 -2713 -2317 -3933 457 -6616 -2256 8537 -4177 884 -366 2104
188532 -2866 1342 -1128 -4909 2470 -2317 213 915 3140 -1768 -427 2317 -2287 3415 1281 3079
189023 1098 4146 1311 2195 -2561 -1890 -2195 -2378 -3049 -4848 -244 -3323 823 -2713 1037 1463
189514 -396 -2470 3018 -2134 3689 732 3994 -3445 -2470 -1189 1677 4695 -3018 -1738 -1799 1921
189998A281I15c872d604C140d27d390A220b13a067E18a281D848a52C354A250c96
190516B439B439a22I15C293I45C659A189F006d116A372a463a402e18c35b531I76
191038C781G62C415A677B348b409A799A616H84b470c415b957d909a128b195a951
191520d604b927A220F860A220a220B13d27C293C96a159c232B622C96g439B348
192012B744B073A22A555f71d27c720A83A585A402F40f006H54E49a951c659E457
192526B835A677B561C293B317C018A829D177E427B531b012d634B713G62b226d57
193014B012A128b774f10i1d57c811a646C415C689A52B256E671b165A83g93D146
193535D787A921B256B683d421b470C811a22a707H54d573B134A22c262A921F281
$$ plain form
189998 1281 915 -3872 -4604 3140 -427 -4390 1220 -213 -1067 518 -1281 4848 -152 3354 1250 -396
190516 2439 2439 -122 915 3293 945 3659 1189 6006 -4116 1372 -1463 -1402 -518 -335 -2531 976
191038 3781 762 3415 1677 2348 -2409 1799 1616 884 -2470 -3415 -2957 -4909 -1128 -2195 -1951
191520 -4604 -2927 1220 6860 1220 -1220 213 -427 3293 396 -1159 -3232 2622 396 -7439 2348
192012 2744 2073 122 1555 -671 -427 -3720 183 1585 1402 640 -6006 854 549 -1951 -3659 5457
192526 2835 1677 2561 3293 2317 3018 1829 4177 5427 2531 -2012 -4634 2713 762 -2226 -457
193014 2012 1128 -2774 -610 -91 -457 -3811 -1646 3415 3689 152 2256 5671 -2165 183 -793 4146
193535 4787 1921 2256 2683 -4421 -2470 3811 -122 -1707 854 -4573 2134 122 -3262 1921 6281
194027b287b713f10d756A463a860a463C05e79B409A860A189E336G470A4147A2531
194509A3202A799C811D634B957A83a585a250C232e49b774a555a555f281C05b592
195002c354E092a433d88c476F71a768b44a555d57B835a83F1B409B439a402b957
195521A646A890c66B896G93A159i15c720C079c628B256C110b439f1E031F1B774
196041C872E915A2074A6494B9422B5001B2775A2988I238E488C506a067a342A921
196461b44A250G744d88A006A281b592A250B683e397D299I45a585B744C262A372
196952B531A098C140e18H994d451d025a006A524F40b012G317B348C35c811c842
197440G93c049I76c872B74A342B134G012e49b500E305F829A2104B2348C2410C3568
$$ plain form
194027 -2287 -2713 -610 -4756 1463 -1860 -1463 305 -579 2409 1860 1189 5336 7470 14147 12531
194509 13202 1799 3811 4634 2957 183 -1585 -1250 3232 -549 -2774 -1555 -1555 -6281 305 -2592
195002 -3354 5092 -1433 -488 -3476 671 -1768 -244 -1555 -457 2835 -183 61 2409 2439 -1402 -2957
195521 1646 1890 -366 2896 793 1159 -915 -3720 3079 -3628 2256 3110 -2439 -61 5031 61 2774
196041 3872 5915 12074 16494 29422 25001 22775 12988 9238 5488 3506 -1067 -1342 1921
196461 -244 1250 7744 -488 1006 1281 -2592 1250 2683 -5397 4299 945 -1585 2744 3262 1372
196952 2531 1098 3140 -518 8994 -4451 -4025 -1006 1524 640 -2012 7317 2348 335 -3811 -3842
197440 793 -3049 976 -3872 274 1342 2134 7012 -549 -2500 5305 6829 12104 22348 32410 33568
197928B1738A2927F250G348a128F006G62c110B043C415b44F250G01F159C96C598
198416C232b378I45B256a281h23b835I1B500B531B653B043d27H54D604a921a372
198939E915d878A22e79A220a067B531b592B896A342a799b713B957C66A83b653
199420I76D025B439G256A2195C1281B7836A8537A3659I208F098A250C293d27A311
199879H23D848E18d268c171B317B195C598E49B409A829e79a494b195h54a616A037
200402G195B988a189c66B226A768a006b592E122c35I15i1B866e000A799f40g32
200922b653a342c018D421C0A402C933e18G32B683D238A1372A5336A3202A0488
201379F220C872C628B317D116B470a738e092B561E244A067d055c66f40B348I1
$$ plain form
197928 21738 12927 6250 7348 -1128 6006 762 -3110 2043 3415 -244 6250 701 6159 396 3598
198416 3232 -2378 945 2256 -1281 -823 -2835 91 2500 2531 2653 2043 -427 854 4604 -1921 -1372
198939 5915 -4878 122 -579 1220 -1067 2531 -2592 2896 1342 -1799 -2713 2957 366 183 -2653
199420 976 4025 2439 7256 12195 31281 27836 18537 13659 9208 6098 1250 3293 -427 1311
199879 823 4848 518 -4268 -3171 2317 2195 3598 549 2409 1829 -579 -1494 -2195 -854 -1616 1037
200402 7195 2988 -1189 -366 2226 1768 -1006 -2592 5122 -335 915 -91 2866 -5000 1799 -640 -732
200922 -2653 -1342 -3018 4421 30 1402 3933 -518 732 2683 4238 11372 15336 13202 10488
201379 6220 3872 3628 2317 4116 2470 -1738 -5092 2561 5244 1067 -4055 -366 -640 2348 91
201862A067C750c720A128a524g32A372b44A829F40c598A433C415D177i15a829
202354B195a006A098B165b13A829c781d878F10i1b470I1e061d207c35e275B835
202874a860A52E153B195I543D177A0000E823A402A372I45i45b409C201h23I15
203357d57a159E18F1b592b043F525D360c598I15I1D146G805B622a311A250C96
203876c567B683F006d88F10a890a220c0C262d238B927b744h84a52a281B256F40
204398a951F10C598A829a555A829C293D299C415D27A433H54E884E49A768A006
204888B348b653B957e945C476B043b713b805c445D27i76a098A098i45A372e457
205372a83a982A098d88B287d665A311A311c140C659A707c96d88A159G62B683A585
$$ plain form
201862 1067 3750 -3720 1128 -1524 -732 1372 -244 1829 640 -3598 1433 3415 4177 -915 -1829
202354 2195 -1006 1098 2165 -213 1829 -3781 -4878 610 -91 -2470 91 -5061 -4207 -335 -5275 2835
202874 -1860 152 5153 2195 9543 4177 10000 5823 1402 1372 945 -945 -2409 3201 -823 915
203357 -457 -1159 518 61 -2592 -2043 6525 4360 -3598 915 91 4146 7805 2622 -1311 1250 396
203876 -3567 2683 6006 -488 610 -1890 -1220 -30 3262 -4238 2927 -2744 -884 -152 -1281 2256 640
204398 -1951 610 3598 1829 -1555 1829 3293 4299 3415 427 1433 854 5884 549 1768 1006
204888 2348 -2653 2957 -5945 3476 2043 -2713 -2805 -3445 427 -976 -1098 1098 -945 1372 -5457
205372 -183 -1982 1098 -488 2287 -4665 1311 1311 -3140 3659 1707 -396 -488 1159 762 2683 1585
205893F006B409D116a402E18a707H84g32E945E671B988a006b470e79C964A281
206381C0C96B74b043c049E49e549d116e18B683g93B13D88g62d207G01a646B653
206926D88B988d421e18A006c659d878I15c018I45b165a707G62I15I76a494C018
207449H23D268g93c35i76b134d27C0a22A159A433D604C110C293a463C842i76D055
207993A463H23C415c323f40b13c598I76F10b561B226a402A281C567c110a524f189
208513D634E214A098c445a037D451F71c96e214b378B287A646B713D055G01a52
209005A433a829b073B043B683C018B195a524B104a616c232c842F71d360a738g62
209493F1b44A951a311B043C750a860@D085d573f71B805c354A52b74A829d146A189
$$ plain form
205893 6006 2409 4116 -1402 518 -1707 884 -732 5945 5671 2988 -1006 -2470 -579 3964 1281
206381 30 396 274 -2043 -3049 549 -5549 -4116 -518 2683 -793 213 488 -762 -4207 701 -1646 2653
206926 488 2988 -4421 -518 1006 -3659 -4878 915 -3018 945 -2165 -1707 762 915 976 -1494 3018
207449 823 4268 -793 -335 -976 -2134 -427 30 -122 1159 1433 4604 3110 3293 -1463 3842 -976 4055
207993 1463 823 3415 -3323 -640 -213 -3598 976 610 -2561 2226 -1402 1281 3567 -3110 -1524 -6189
208513 4634 5214 1098 -3445 -1037 4451 671 -396 -5214 -2378 2287 1646 2713 4055 701 -152
209005 1433 -1829 -2073 2043 2683 3018 2195 -1524 2104 -1616 -3232 -3842 671 -4360 -1738 -762
209493 61 -244 1951 -1311 2043 3750 -1860 0 4085 -4573 -671 2805 -3354 152 -274 1829 -4146 1189
210038f40c66C96C506a768a463B348c140B896a067B713b470a616C171d390d177
210529f40C445a585B195B348F342B74a616C476c66C0a342C140a128C781b592B13
211043H54B592G62E945F40a829G93H23C781d878B226A220a677D146b622A52C598
211566B134A707C171i76b104A616e366B500a616@E488b073B256c35g93c05A52
212079A342A159G32d116c872G01C842C293g01d88I76c720a220D27b195d88D268
212598b470b134D177a799B683d604A829A098b683A128B104i15a250b835A83c659
213090D27a006D88H84b44A067A098C384b44a829a555a860B012B165E000c35a067
213605A098g01A921A037B500F1D27d268E031A921b317D116B195B13B44c720B195
$$ plain form
210038 -640 -366 396 3506 -1768 -1463 2348 -3140 2896 -1067 2713 -2470 -1616 3171 -4390 -4177
210529 -640 3445 -1585 2195 2348 6342 274 -1616 3476 -366 30 -1342 3140 -1128 3781 -2592 213
211043 854 2592 762 5945 640 -1829 793 823 3781 -4878 2226 1220 -1677 4146 -2622 152 3598
211566 2134 1707 3171 -976 -2104 1616 -5366 2500 -1616 0 5488 -2073 2256 -335 -793 -305 152
212079 1342 1159 732 -4116 -3872 701 3842 3293 -701 -488 976 -3720 -1220 427 -2195 -488 4268
212598 -2470 -2134 4177 -1799 2683 -4604 1829 1098 -2683 1128 2104 -915 -1250 -2835 183 -3659
213090 427 -1006 488 884 -244 1067 1098 3384 -244 -1829 -1555 -1860 2012 2165 5000 -335 -1067
213605 1098 -701 1921 1037 2500 61 427 -4268 5031 1921 -2317 4116 2195 213 244 -3720 2195
214126D421G93c05g32B531g62d817f464E031e49C537I76b073c567B774E79A890
214648a402h84E79B927C201c415B74b622A220a738a982A22a890d543h23B592H23
215167B043b622a982d573c293C811a281A189D695I1I45A402e762C262e092c96
215649a098b073f708B561g470D482a220b74c110C018D787B74C96b988C049a677
216141b043a372d970B409B592D756A951a52b74B744A189g01a159b500D268E610
216631C903c293A616a494I76A037a524d27E488D27b226c964a433A067E79B13C201
217147I1b073D329B470b13B896a707A707B348a067A220B165c35B592B653d57a250
217666F10d451A128a585h54A372F10C201d27G93g01b439c384b226a52b439B348
$$ plain form
214126 4421 793 -305 -732 2531 -762 -4817 -6464 5031 -549 3537 976 -2073 -3567 2774 579 1890
214648 -1402 -884 579 2927 3201 -3415 274 -2622 1220 -1738 -1982 122 -1890 -4543 -823 2592 823
215167 2043 -2622 -1982 -4573 -3293 3811 -1281 1189 4695 91 945 1402 -5762 3262 -5092 -396
215649 -1098 -2073 -6708 2561 -7470 4482 -1220 -274 -3110 3018 4787 274 396 -2988 3049 -1677
216141 -2043 -1372 -4970 2409 2592 4756 1951 -152 -274 2744 1189 -701 -1159 -2500 4268 5610
216631 3903 -3293 1616 -1494 976 1037 -1524 -427 5488 427 -2226 -3964 -1433 1067 579 213 3201
217147 91 -2073 4329 2470 -213 2896 -1707 1707 2348 -1067 1220 2165 -335 2592 2653 -457 -1250
217666 610 -4451 1128 -1585 -854 1372 610 3201 -427 793 -701 -2439 -3384 -2226 -152 -2439 2348
218181a281a83A921D27b287a555B744A159@e031b713b592c35E18C476A646c0G134
218736b256@c35d27b470A768a524a83B713A677E031a037g93c35B470E397a555
219250G01A250B317g62C049H293a890c171e701E000A921b805h54c628C05C66a524
219772G32B592a342E49c445I1b439C567B012H84e18b683B409c232A83A555d970
220287b866f10c445E915i76i1B165b134A037g93C720D573a433a250F71b74a83
220805f10A189a921A738A372C842b592b500c933e336G62B134A646d787A067A555
221296c96B927b317e18b256c96f311C262I45C0E18C628D726A006b195G62a006
221810A52d360D085b378E79E153a159d665C415a982f677E18A159E579b74H54h23
$$ plain form
218181 -1281 -183 1921 427 -2287 -1555 2744 1159 0 -5031 -2713 -2592 -335 518 3476 1646 -30 7134
218736 -2256 0 -335 -427 -2470 1768 -1524 -183 2713 1677 5031 -1037 -793 -335 2470 5397 -1555
219250 701 1250 2317 -762 3049 8293 -1890 -3171 -5701 5000 1921 -2805 -854 -3628 305 366 -1524
219772 732 2592 -1342 549 -3445 91 -2439 3567 2012 884 -518 -2683 2409 -3232 183 1555 -4970
220287 -2866 -610 -3445 5915 -976 -91 2165 -2134 1037 -793 3720 4573 -1433 -1250 671 -274 -183
220805 -610 1189 -1921 1738 1372 3842 -2592 -2500 -3933 -5336 762 2134 1646 -4787 1067 1555
221296 -396 2927 -2317 -518 -2256 -396 -6311 3262 945 30 518 3628 4726 1006 -2195 762 -1006
221810 152 -4360 4085 -2378 579 5153 -1159 -4665 3415 -1982 -6677 518 1159 5579 -274 854 -823
222332b774a890a463C781b012e122G62b13C537i15i45a738e79g62a22B012A281
222853A402c659a311A585h84B13a159c964C628D329a159g01B927a921C049D085
223342A128h54c964E549A555A707A433A890b683A433h54C35A707c933b195B927
223824d299B409i1E854c05A768D88c66C293b226f860c018F1D695c66a768B44B622
224376B165D177E122A159a037A860B592D329a159A281d512b531b74i1A616F586
224860C964a250A128i086C96g01b470F1G93A250E000c842b957a860a372E18B683
225383a402b957f494g62i848d57B927g32g683B073B134b74D27G01a707b195d57
225904b073A52C171a402C140c628A433b287c96A768C140b988g32F71e122C903
$$ plain form
222332 -2774 -1890 -1463 3781 -2012 -5122 762 -213 3537 -915 -945 -1738 -579 -762 -122 2012 1281
222853 1402 -3659 -1311 1585 -884 213 -1159 -3964 3628 4329 -1159 -701 2927 -1921 3049 4085
223342 1128 -854 -3964 5549 1555 1707 1433 1890 -2683 1433 -854 335 1707 -3933 -2195 2927
223824 -4299 2409 -91 5854 -305 1768 488 -366 3293 -2226 -6860 -3018 61 4695 -366 -1768 244 2622
224376 2165 4177 5122 1159 -1037 1860 2592 4329 -1159 1281 -4512 -2531 -274 -91 1616 6586
224860 3964 -1250 1128 -9086 396 -701 -2470 61 793 1250 5000 -3842 -2957 -1860 -1372 518 2683
225383 -1402 -2957 -6494 -762 -9848 -457 2927 -732 -7683 2073 2134 -274 427 701 -1707 -2195 -457
225904 -2073 152 3171 -1402 3140 -3628 1433 -2287 -396 1768 3140 -2988 -732 671 -5122 3903
226392b134C567A494B470H84d695B073A982a463E671D27f71b378i1B653B287g01
226907A677F10g01c781A098a799g62a585a616a494B439E49d57E305a433A159g01
227429C476A281d085A83D482B134b104f1c201a890B774a006b683C415i299g62
227912C354D390C293a616a83A159a433a83f10c537a738B073d421A677B74G01A220
228435a006D756@b287b74a951D695e762A768a281B44C872a83C110B13D146b043
228953b713C171b134b256D421c110I1A281D573b134C140A037a037c049c415a921
229436d543b805D573A52C0A555c354a494a098C140D604d268b927c0D88D482C628
229957A616d146@a677e214D665C201c506a22b348b988A067B74a037I1A585c35
$$ plain form
226392 -2134 3567 1494 2470 884 -4695 2073 1982 -1463 5671 427 -671 -2378 -91 2653 2287 -701
226907 1677 610 -701 -3781 1098 -1799 -762 -1585 -1616 -1494 2439 549 -457 5305 -1433 1159 -701
227429 3476 1281 -4085 183 4482 2134 -2104 -61 -3201 -1890 2774 -1006 -2683 3415 -9299 -762
227912 3354 4390 3293 -1616 -183 1159 -1433 -183 -610 -3537 -1738 2073 -4421 1677 274 701 1220
228435 -1006 4756 0 -2287 -274 -1951 4695 -5762 1768 -1281 244 3872 -183 3110 213 4146 -2043
228953 -2713 3171 -2134 -2256 4421 -3110 91 1281 4573 -2134 3140 1037 -1037 -3049 -3415 -1921
229436 -4543 -2805 4573 152 30 1555 -3354 -1494 -1098 3140 4604 -4268 -2927 -30 488 4482 3628
229957 1616 -4146 0 -1677 -5214 4665 3201 -3506 -122 -2348 -2988 1067 274 -1037 91 1585 -335
230473A585a982f71E488b134C811a098a524b74f40F40B896b927f71B195B957A524
230996a311H994A799a524a311h84b409g32i45B653a52E49B896D88d970B073C018
231515F10b287C659C933B287E18F067c35d421c232D543C35A098B195b317a006
232005c0a707A372a159E214c05b104a067b622B744a52b683a372a463a250C323
232492b409b988B713D177B043h84c0a829b317e79b256b44H23A006B44b774B44
233007a189C110a189G32C293A646c476d634D88c140i45b287c384a189A250a52
233495D665b13a22B226b165A402C323d177E549B531b287A555F10A372A524a128
233987a524C293a22D329I76B835a281a585C872d329A250c384C0C66i45C415h84
$$ plain form
230473 1585 -1982 -671 5488 -2134 3811 -1098 -1524 -274 -640 640 2896 -2927 -671 2195 2957 1524
230996 -1311 8994 1799 -1524 -1311 -884 -2409 -732 -945 2653 -152 549 2896 488 -4970 2073 3018
231515 610 -2287 3659 3933 2287 518 6067 -335 -4421 -3232 4543 335 1098 2195 -2317 -1006
232005 -30 -1707 1372 -1159 5214 -305 -2104 -1067 -2622 2744 -152 -2683 -1372 -1463 -1250 3323
232492 -2409 -2988 2713 4177 2043 -884 -30 -1829 -2317 -579 -2256 -244 823 1006 244 -2774 244
233007 -1189 3110 -1189 732 3293 1646 -3476 -4634 488 -3140 -945 -2287 -3384 -1189 1250 -152
233495 4665 -213 -122 2226 -2165 1402 3323 -4177 5549 2531 -2287 1555 610 1372 1524 -1128
233987 -1524 3293 -122 4329 976 2835 -1281 -1585 3872 -4329 1250 -3384 30 366 -945 3415 -884
234500c354c781A52c96a281a372a829C659G62a738A159H54a83B622f1a951B439
235024g01b378C384a128C659C0b44g01C05E610D146d695a890@B13D421c964f71
235569E671e49c323A951D268A860a677i1a098a402i1c66b592A829B74i1D116f1
236120a311d939a463c171A921B439c476a220A159D573H84D726D939f860C689b348
236608b744a067b713a799C323b74b744F616B012A128f40d299a52a982d878b896
237092B165d27A646b317D88b927a067e823A83B348B561A616h84c35d57D726i604
237615B774c171b287d57b13a860E793A52g01b561b287B165b256e49A890H54B287
238136a646A22e18A311a189D055d116E427C35a829D604b683B835f708a128C842
$$ plain form
234500 -3354 -3781 152 -396 -1281 -1372 -1829 3659 762 -1738 1159 854 -183 2622 -61 -1951 2439
235024 -701 -2378 3384 -1128 3659 30 -244 -701 305 5610 4146 -4695 -1890 0 213 4421 -3964 -671
235569 5671 -549 -3323 1951 4268 1860 -1677 -91 -1098 -1402 -91 -366 -2592 1829 274 -91 4116 -61
236120 -1311 -4939 -1463 -3171 1921 2439 -3476 -1220 1159 4573 884 4726 4939 -6860 3689 -2348
236608 -2744 -1067 -2713 -1799 3323 -274 -2744 6616 2012 1128 -640 -4299 -152 -1982 -4878 -2896
237092 2165 -427 1646 -2317 488 -2927 -1067 -5823 183 2348 2561 1616 -884 -335 -457 4726 -9604
237615 2774 -3171 -2287 -457 -213 -1860 5793 152 -701 -2561 -2287 2165 -2256 -549 1890 854 2287
238136 -1646 122 -518 1311 -1189 4055 -4116 5427 335 -1829 4604 -2683 2835 -6708 -1128 3842
238619C018D116D146A463a281i45A281b653B683B531H23A921a494h84b409D878
239107E18f098C0C689a128C872A281A921I76C293A829D116a006g32G01a372G165
239628B531b927d604a311a281B622a890A677e275b13B043D88a402a829A83A189
240112F281F40c354g62A220E762c079B13H84b774A128B256B104D88C445F10b104
240636A768D025C0A494a494B012f1a067h84A22a311E762B470a463A52b561A860
241149a311b13A707C811c811c35I15H476a311B104G012b043c903C842I45a768
241638f10b043f1f10c110A433b74B256d57A52i1A524B44a281f189f006H23B165
242192E49C903F1A159h54c994E49c964a159b744a189d726b439F71B957f71D695
$$ plain form
238619 3018 4116 4146 1463 -1281 -945 1281 -2653 2683 2531 823 1921 -1494 -884 -2409 4878
239107 518 -6098 30 3689 -1128 3872 1281 1921 976 3293 1829 4116 -1006 -732 701 -1372 7165
239628 2531 -2927 -4604 -1311 -1281 2622 -1890 1677 -5275 -213 2043 488 -1402 -1829 183 1189
240112 6281 640 -3354 -762 1220 5762 -3079 213 884 -2774 1128 2256 2104 488 3445 610 -2104
240636 1768 4025 30 1494 -1494 2012 -61 -1067 -884 122 -1311 5762 2470 -1463 152 -2561 1860
241149 -1311 -213 1707 3811 -3811 -335 915 8476 -1311 2104 7012 -2043 -3903 3842 945 -1768
241638 -610 -2043 -61 -610 -3110 1433 -274 2256 -457 152 -91 1524 244 -1281 -6189 -6006 823 2165
242192 549 3903 61 1159 -854 -3994 549 -3964 -1159 -2744 -1189 -4726 -2439 671 2957 -671 4695
242707B44D787A494e49c96c354a311B13F71a768B104h110F128e610a585i45A646
243228a006d787A189B835B104e854C018c0h23C445e49A342a433B683d57b896B073
243749c750F40a402H54a22g01A463F1C35a128f098c720C415D970d268a646c262
244265c35c05A22B988d146B683A555A311b134b348H54a250A616A372b805A951
244753c96C415g32A829A433c232a098b378A982c96C415C232d360A860B043E79
245237c689I76B073I45A890G32b043@g32a006I15b866B653g531D27C018i45c140
245789C811e18a372C35A311D085B13A189C079C35A555C628a921C018c628E49A372
246310c933A951b378A707C750a524D299b74C232F10A494g93B988e79a921F220
$$ plain form
242707 244 4787 1494 -549 -396 -3354 -1311 213 671 -1768 2104 -8110 6128 -5610 -1585 -945 1646
243228 -1006 -4787 1189 2835 2104 -5854 3018 -30 -823 3445 -549 1342 -1433 2683 -457 -2896 2073
243749 -3750 640 -1402 854 -122 -701 1463 61 335 -1128 -6098 -3720 3415 4970 -4268 -1646 -3262
244265 -335 -305 122 2988 -4146 2683 1555 1311 -2134 -2348 854 -1250 1616 1372 -2805 1951
244753 -396 3415 -732 1829 1433 -3232 -1098 -2378 1982 -396 3415 3232 -4360 1860 2043 579
245237 -3689 976 2073 945 1890 732 -2043 0 -732 -1006 915 -2866 2653 -7531 427 3018 -945 -3140
245789 3811 -518 -1372 335 1311 4085 213 1189 3079 335 1555 3628 -1921 3018 -3628 549 1372
246310 -3933 1951 -2378 1707 3750 -1524 4299 -274 3232 610 1494 -793 2988 -579 -1921 6220
246793a524B012b744A189a951C384c079g62e031d116F71B226c05c903f677E79
247281B226D116F1e49F1C66B927f1A585F10a159b531B774a281B195a494B165f71
247836a006c537A677a860f10a829a768d909c506b348f40G62f1b835b073A067b012
248350h84C567a921b835d482C903a402A829a189e18A342B226h23A646i1A829C66
248874a463i45C811A616c567C66b195A128b13A189b835F71b500H23A982E153C964
249386C110B409c323c537i45b653a220a372C628B44e610C232D146b195d299B012
249874e18b957c933B012c598F1A799A220c171B74c750c079H84c35B012B13C66
250396c66a189D634D238A037A311C35C323a829C018b531d88c933f71C171a067
$$ plain form
246793 -1524 2012 -2744 1189 -1951 3384 -3079 -762 -5031 -4116 671 2226 -305 -3903 -6677 579
247281 2226 4116 61 -549 61 366 2927 -61 1585 610 -1159 -2531 2774 -1281 2195 -1494 2165 -671
247836 -1006 -3537 1677 -1860 -610 -1829 -1768 -4909 -3506 -2348 -640 762 -61 -2835 -2073 1067 -2012
248350 -884 3567 -1921 -2835 -4482 3903 -1402 1829 -1189 -518 1342 2226 -823 1646 -91 1829 366
248874 -1463 -945 3811 1616 -3567 366 -2195 1128 -213 1189 -2835 671 -2500 823 1982 5153 3964
249386 3110 2409 -3323 -3537 -945 -2653 -1220 -1372 3628 244 -5610 3232 4146 -2195 -4299 2012
249874 -518 -2957 -3933 2012 -3598 61 1799 1220 -3171 274 -3750 -3079 884 -335 2012 213 366
250396 -366 -1189 4634 4238 1037 1311 335 3323 -1829 3018 -2531 -488 -3933 -671 3171 -1067
250888B44B409A982A098C415A250e610b317c445b74b713b805H232b134A585a494
251372B287E488@E732A646b256A738E366D878A342D238B165A677b043a555B835
251857a281B195b195I1G93c96C323I15a646G62b226A982A098h84b134a098c96
252376f71g62B317b409e061a006g93c96b104A098A799b012A555c05i45A555D025
252898A22G32B835d482a677a311H84h23e823b774a372f677B348A860b74f1b44
253416i15b134a52@A159e061I45D055B256B74@E214B012a189a829F159a342b348
253967B439c079b835b073C66a250B988@C110c689D665C994C933e275a402F951
254450a037f982A159A677H54f40G32A311F71B195c598d451B531A372d604c018
$$ plain form
250888 244 2409 1982 1098 3415 1250 -5610 -2317 -3445 -274 -2713 -2805 8232 -2134 1585 -1494
251372 2287 5488 0 5732 1646 -2256 1738 5366 4878 1342 4238 2165 1677 -2043 -1555 2835
251857 -1281 2195 -2195 91 793 -396 3323 915 -1646 762 -2226 1982 1098 -884 -2134 -1098 -396
252376 -671 -762 2317 -2409 -5061 -1006 -793 -396 -2104 1098 1799 -2012 1555 -305 -945 1555 4025
252898 122 732 2835 -4482 -1677 -1311 884 -823 -5823 -2774 -1372 -6677 2348 1860 -274 -61 -244
253416 -915 -2134 -152 0 1159 -5061 945 4055 2256 274 0 5214 2012 -1189 -1829 6159 -1342 -2348
253967 2439 -3079 -2835 -2073 366 -1250 2988 0 3110 -3689 4665 3994 3933 -5275 -1402 6951
254450 -1037 -6982 1159 1677 854 -640 732 1311 671 2195 -3598 -4451 2531 1372 -4604 -3018
254938a768d512B957b653G62f71a524A281B043a067I76A006A585C598d909B74
255429b866C66a646C689D543g93c323A402C415A159c720A646e18e18G01a463d360
255949C659C689b287e79a128c079B439g32g01d421a006E457d177I15d726C445
256438C476b866c415A707b500a555f1B653A921d451a220A707d848e18C35c0D57
256954b439H84D665f10b44a799a829D238a22a098C445A890b74a52a281C96A098
257473c811B74A738h54i1H84A067e79d390A52d27B835B44b256A646B256A890A067
258020A372a494B104a921d025b348h23H598b073E18h54I1e18a22b470b866C262
258542G93C35D909f647A433A189f250a52d848d27@D88B531H54D329A006G01A067
$$ plain form
254938 -1768 -4512 2957 -2653 762 -671 -1524 1281 2043 -1067 976 1006 1585 3598 -4909 274
255429 -2866 366 -1646 3689 4543 -793 -3323 1402 3415 1159 -3720 1646 -518 -518 701 -1463 -4360
255949 3659 3689 -2287 -579 -1128 -3079 2439 -732 -701 -4421 -1006 5457 -4177 915 -4726 3445
256438 3476 -2866 -3415 1707 -2500 -1555 -61 2653 1921 -4451 -1220 1707 -4848 -518 335 -30 457
256954 -2439 884 4665 -610 -244 -1799 -1829 4238 -122 -1098 3445 1890 -274 -152 -1281 396 1098
257473 -3811 274 1738 -854 -91 884 1067 -579 -4390 152 -427 2835 244 -2256 1646 2256 1890 1067
258020 1372 -1494 2104 -1921 -4025 -2348 -823 8598 -2073 518 -854 91 -518 -122 -2470 -2866 3262
258542 793 335 4909 -6647 1433 1189 -6250 -152 -4848 -427 0 488 2531 854 4329 1006 701 1067
259087B226C354C079A585C66b622C05c781b774B713@A860e854F10G01B74G01B073
259642g93b805e457B74a555a52b073H54F10A189B13D116b592D299b896c628b957
260158b74c35I1A829b531g62E000G01A189c05b317f71i45B866g104a677e49F10
260707g93b835b165a707a067a342B896F189A83d57a22B622A067b012a555a402
261192c049B13B774e79E061H84G01i15F71A951f71d848d88B13e000A83a494C628
261744c628G62h23D970a128D695a402b165c750G93c628d665d57b500B134a159
262229H54G32b439I76C05B256A494I45a22C66h23C598B866b470I15B104B988i1
262780C445E275c201D848H23B500c537C506a677b44e183b622A463C659d329a646
$$ plain form
259087 2226 3354 3079 1585 366 -2622 305 -3781 -2774 2713 0 1860 -5854 610 701 274 701 2073
259642 -793 -2805 -5457 274 -1555 -152 -2073 854 610 1189 213 4116 -2592 4299 -2896 -3628 -2957
260158 -274 -335 91 1829 -2531 -762 5000 701 1189 -305 -2317 -671 -945 2866 -7104 -1677 -549 610
260707 -793 -2835 -2165 -1707 -1067 -1342 2896 6189 183 -457 -122 2622 1067 -2012 -1555 -1402
261192 -3049 213 2774 -579 5061 884 701 -915 671 1951 -671 -4848 -488 213 -5000 183 -1494 3628
261744 -3628 762 -823 4970 -1128 4695 -1402 -2165 -3750 793 -3628 -4665 -457 -2500 2134 -1159
262229 854 732 -2439 976 305 2256 1494 945 -122 366 -823 3598 2866 -2470 915 2104 2988 -91
262780 3445 5275 -3201 4848 823 2500 -3537 3506 -1677 -244 -5183 -2622 1463 3659 -4329 -1646
263268E640a555b134f40f647A220a951D177g32h23C689i45a585A311I1d88A555
263791A83C049A067a006d085g62D482a159C689a524g62d27D025e336a006C506
264273b74c96G62g01B439g01A616g93A281A402C354@e854d604C903A463b378A707
264826b13d299e79a52c476B44F10d909C35B043a768F464C0e49c872B592i1A128
265373h54B74a220C476b866A372A921A768d025C05E579C0a159h54C0b896a037
265889I76a860b74a921b957c05B287B439g32e49B134A982b409g62A890a707c35
266408a311A159d848A220g32C415C05c872d390C476c415D360a768b896b287h23
266897A159F433C476B866a646A037D207A037B043A342B866b44b134G32a128a494
$$ plain form
263268 5640 -1555 -2134 -640 -6647 1220 -1951 4177 -732 -823 3689 -945 -1585 1311 91 -488 1555
263791 183 3049 1067 -1006 -4085 -762 4482 -1159 3689 -1524 -762 -427 4025 -5336 -1006 3506
264273 -274 -396 762 -701 2439 -701 1616 -793 1281 1402 3354 0 -5854 -4604 3903 1463 -2378 1707
264826 -213 -4299 -579 -152 -3476 244 610 -4909 335 2043 -1768 6464 30 -549 -3872 2592 -91 1128
265373 -854 274 -1220 3476 -2866 1372 1921 1768 -4025 305 5579 30 -1159 -854 30 -2896 -1037
265889 976 -1860 -274 -1921 -2957 -305 2287 2439 -732 -549 2134 1982 -2409 -762 1890 -1707 -335
266408 -1311 1159 -4848 1220 -732 3415 305 -3872 -4390 3476 -3415 4360 -1768 -2896 -2287 -823
266897 1159 6433 3476 2866 -1646 1037 4207 1037 2043 1342 2866 -244 -2134 732 -1128 -1494
267389f433a585D787b622H54a067B44A951d329b317I76b226b043C964@F40C35
267909f220a494C506F098C720B012h23D421A342I15e092B073c384d88d88b561
268392A463I45a037g01c171C506A616G134A372b744C018c750a799I45A433d695
268880A402c96A982A159a037A128C201B774b683f71B073b287B988e18a037B195
269371b165c384e092F220F71b653C049f890E549D055E49c415E701b287C96D146
269860f10I1d329B073b957D177A677d726e061E18A829f281G01A250F10C0B74c659
270405f40E18c05b470I76b104B592a402f525b439C872C354H84B104b744G01C96
270928b134b226c05f71d57A738c323b835B957D27b713A83E275a768D421b561e122
$$ plain form
267389 -6433 -1585 4787 -2622 854 -1067 244 1951 -4329 -2317 976 -2226 -2043 3964 0 640 335
267909 -6220 -1494 3506 6098 3720 2012 -823 4421 1342 915 -5092 2073 -3384 -488 -488 -2561
268392 1463 945 -1037 -701 -3171 3506 1616 7134 1372 -2744 3018 -3750 -1799 945 1433 -4695
268880 1402 -396 1982 1159 -1037 1128 3201 2774 -2683 -671 2073 -2287 2988 -518 -1037 2195
269371 -2165 -3384 -5092 6220 671 -2653 3049 -6890 5549 4055 549 -3415 5701 -2287 396 4146
269860 -610 91 -4329 2073 -2957 4177 1677 -4726 -5061 518 1829 -6281 701 1250 610 30 274 -3659
270405 -640 518 -305 -2470 976 -2104 2592 -1402 -6525 -2439 3872 3354 884 2104 -2744 701 396
270928 -2134 -2226 -305 -671 -457 1738 -3323 -2835 2957 427 -2713 183 5275 -1768 4421 -2561 -5122
271442C689F006D57C384b348f40A890G836C35B957b500A067A646b226a768d57
271931G62I45A524D88a921H54b195B44B622B470G62C445E49a159a494C05A402
272453E244a433C171c96B409A220G93A829E18H23E366a799E79A799a311a159B073
272968d27a372a220d726F1c933c35a677a22b592b195A768d88B622g348B317A616
273490b44D787a921c537A433C323b927b165A067a738b561i1c66b043B531h54B409
274004C537f10G01e488A799b134g62f40A250c96a677b256i76c323I15c079D268
274522A433a524b012I76b409f40A951e49B561A799a433B896F71a433h080B713
275014C964c079b13D482a52F1e18A677D299h54e79C476E397A098b713a829d025
$$ plain form
271442 3689 6006 457 3384 -2348 -640 1890 7836 335 2957 -2500 1067 1646 -2226 -1768 -457
271931 762 945 1524 488 -1921 854 -2195 244 2622 2470 762 3445 549 -1159 -1494 305 1402
272453 5244 -1433 3171 -396 2409 1220 793 1829 518 823 5366 -1799 579 1799 -1311 -1159 2073
272968 -427 -1372 -1220 -4726 61 -3933 -335 -1677 -122 -2592 -2195 1768 -488 2622 -7348 2317 1616
273490 -244 4787 -1921 -3537 1433 3323 -2927 -2165 1067 -1738 -2561 -91 -366 -2043 2531 -854 2409
274004 3537 -610 701 -5488 1799 -2134 -762 -640 1250 -396 -1677 -2256 -976 -3323 915 -3079 4268
274522 1433 -1524 -2012 976 -2409 -640 1951 -549 2561 1799 -1433 2896 671 -1433 -8080 2713
275014 3964 -3079 -213 4482 -152 61 -518 1677 4299 -854 -579 3476 5397 1098 -2713 -1829 -4025
275529A738a829E79C0I15a281b195D27d421g01B74e061c96@B653A189E49A311
276083A220A098A860b622A616B043c445f951A860b713b104E18A463B409c35I1
276566A951C05A524F1C96a006b957d177f40D299a829A555c66c96F006i45C171
277085d421C35A494B165b378a220B104I15C96a951I15F71b409a951b44c872b165
277609C994b622b104c994A890b317h23b409b500B653D970d299E000I15d27A067
278090c171B531a067F006D726C415B226B896e214A585A829d634c110b470g378
278550a067b561b531A707c354c66A921A768I1C628c659b835F1B713f098A372D817
279073d848c323B683a372B713c96b622A372C323e79B774f311A067B13B44c537
$$ plain form
275529 1738 -1829 579 30 915 -1281 -2195 427 -4421 -701 274 -5061 -396 0 2653 1189 549 1311
276083 1220 1098 1860 -2622 1616 2043 -3445 -6951 1860 -2713 -2104 518 1463 2409 -335 91
276566 1951 305 1524 61 396 -1006 -2957 -4177 -640 4299 -1829 1555 -366 -396 6006 -945 3171
277085 -4421 335 1494 2165 -2378 -1220 2104 915 396 -1951 915 671 -2409 -1951 -244 -3872 -2165
277609 3994 -2622 -2104 -3994 1890 -2317 -823 -2409 -2500 2653 4970 -4299 5000 915 -427 1067
278090 -3171 2531 -1067 6006 4726 3415 2226 2896 -5214 1585 1829 -4634 -3110 -2470 -7378
278550 -1067 -2561 -2531 1707 -3354 -366 1921 1768 91 3628 -3659 -2835 61 2713 -6098 1372 4817
279073 -4848 -3323 2683 -1372 2713 -396 -2622 1372 3323 -579 2774 -6311 1067 213 244 -3537
279561C445a799E49A951b409B134c049C689A342d238e549A83A860E549b073F250
280043D543F10b683e366D299B957E732b073E366G93G62c66F006D177B500G93f829
280563a982g93a616C537D970b165B957b957C232a342B256E732D27A402B74A159
281056a250a067a128B409E640b713b896a372d451c0a463H84a555e49d634c262
281539C079G32B896F10a738f40H54b195E336a189b531b44A037E79A829@C628C079
282088C445a799D27f708B500a22A646a829C96B74I1g01A524B561c171A951B409
282612b683I45d390c110G62a52c018A159D512a311c66D27d512c079A250a494a677
283126C232A402I1C0b531F40a342c049A311h54c628I45B805G93C05b104a128c537
$$ plain form
279561 3445 -1799 549 1951 -2409 2134 -3049 3689 1342 -4238 -5549 183 1860 5549 -2073 6250
280043 4543 610 -2683 -5366 4299 2957 5732 -2073 5366 793 762 -366 6006 4177 2500 793 -6829
280563 -1982 -793 -1616 3537 4970 -2165 2957 -2957 3232 -1342 2256 5732 427 1402 274 1159
281056 -1250 -1067 -1128 2409 5640 -2713 -2896 -1372 -4451 -30 -1463 884 -1555 -549 -4634 -3262
281539 3079 732 2896 610 -1738 -640 854 -2195 5336 -1189 -2531 -244 1037 579 1829 0 3628 3079
282088 3445 -1799 427 -6708 2500 -122 1646 -1829 396 274 91 -701 1524 2561 -3171 1951 2409
282612 -2683 945 -4390 -3110 762 -152 -3018 1159 4512 -1311 -366 427 -4512 -3079 1250 -1494 -1677
283126 3232 1402 91 30 -2531 640 -1342 -3049 1311 -854 -3628 945 2805 793 305 -2104 -1128 -3537
283678C66g32C66b195C811e366a342b653D177B653G32B805A220c96c232b561f40
284190D878C933C0d512b622d512e762c994c598B134b256D939a433C842c750a372
284681B134b226B073C35c201B165i45c476B226A52D27B622C903D055a128H84g01
285200C506B439C201B348e823E79c35b744a402D27c384b74E79A402h54d665g62
285721C659D207D604f71c506C201C110g988c567c0d817H54a982A555d909c628
286210a616D116b043d939A677F40A402c628B256b348B409a982C842a250d27b439
286694C262A768C567h23A829a098C506b13e79F10E18A006a677A83b134A463A189
287216B012C05d482H84A799g32a555e518d329c781B073C720c171G32c018H84G01
$$ plain form
283678 366 -732 366 -2195 3811 -5366 -1342 -2653 4177 2653 732 2805 1220 -396 -3232 -2561 -640
284190 4878 3933 30 -4512 -2622 -4512 -5762 -3994 -3598 2134 -2256 4939 -1433 3842 -3750 -1372
284681 2134 -2226 2073 335 -3201 2165 -945 -3476 2226 152 427 2622 3903 4055 -1128 884 -701
285200 3506 2439 3201 2348 -5823 579 -335 -2744 -1402 427 -3384 -274 579 1402 -854 -4665 -762
285721 3659 4207 4604 -671 -3506 3201 3110 -7988 -3567 -30 -4817 854 -1982 1555 -4909 -3628
286210 -1616 4116 -2043 -4939 1677 640 1402 -3628 2256 -2348 2409 -1982 3842 -1250 -427 -2439
286694 3262 1768 3567 -823 1829 -1098 3506 -213 -579 610 518 1006 -1677 183 -2134 1463 1189
287216 2012 305 -4482 884 1799 -732 -1555 -5518 -4329 -3781 2073 3720 -3171 732 -3018 884 701
287730d299b409b835H84C872A22B348E79C05c262B561C35A311d57a372A555d909
288249H23E18a006A799b256I15a494F10g62a860d88G01D116C476b165E214I45
288770D238D27f1E488b287a799a524B256b500b409a677B256b866d116B805C537
289261C96A707A433B805c323C232a768F71g226H019c598b317B896b470f037c66
289744G134g93A098b866h23A83b622f40C0D848d695f40a372c171D634a707B927
290265D390b561C079d817b012A646C476D88C567b317b287b744a067B744a22a799
290754D848c323A677i45D421E549b409a098a585f586a524d604C445f372D085a738
291243A707A037f40C750b317A677a250C232a982B378c110b104c293I15d390E49
$$ plain form
287730 -4299 -2409 -2835 884 3872 122 2348 579 305 -3262 2561 335 1311 -457 -1372 1555 -4909
288249 823 518 -1006 1799 -2256 915 -1494 610 -762 -1860 -488 701 4116 3476 -2165 5214 945
288770 4238 427 -61 5488 -2287 -1799 -1524 2256 -2500 -2409 -1677 2256 -2866 -4116 2805 3537
289261 396 1707 1433 2805 -3323 3232 -1768 671 -7226 8019 -3598 -2317 2896 -2470 -6037 -366
289744 7134 -793 1098 -2866 -823 183 -2622 -640 30 4848 -4695 -640 -1372 -3171 4634 -1707 2927
290265 4390 -2561 3079 -4817 -2012 1646 3476 488 3567 -2317 -2287 -2744 -1067 2744 -122 -1799
290754 4848 -3323 1677 -945 4421 5549 -2409 -1098 -1585 -6586 -1524 -4604 3445 -6372 4085 -1738
291243 1707 1037 -640 3750 -2317 1677 -1250 3232 -1982 2378 -3110 -2104 -3293 915 -4390 549
291732D329G93B470c384h23A890B470b683A83B561a524C872d329c384b13A433
292215D88i45B165c933e275A159a524E18F586B500C018A22D329C0a616b561A281
292737a463a707B988A677E092E214e518a524c171c0A555h54C0D88a159I1b195
293253B74a524b134G01C35A616b500a372A738A646G683b835D055g01h84a860B104
293772B805h84a829B134e732C415C903a402B44I76B165D421a799e49e18A463B896
294293E640C049E79g927B988B195b165a159D817B744A829c689D055d909a281C35
294783H23C201C35B439c05d543d634A707a860G62d27i76b653a890A372d787e061
295297A006b012A220b378G01I76a463b683a281F40H84I15G073B622B348b622a860
$$ plain form
291732 4329 793 2470 -3384 -823 1890 2470 -2683 183 2561 -1524 3872 -4329 -3384 -213 1433
292215 488 -945 2165 -3933 -5275 1159 -1524 518 6586 2500 3018 122 4329 30 -1616 -2561 1281
292737 -1463 -1707 2988 1677 5092 5214 -5518 -1524 -3171 -30 1555 -854 30 488 -1159 91 -2195
293253 274 -1524 -2134 701 335 1616 -2500 -1372 1738 1646 7683 -2835 4055 -701 -884 -1860 2104
293772 2805 -884 -1829 2134 -5732 3415 3903 -1402 244 976 2165 4421 -1799 -549 -518 1463 2896
294293 5640 3049 579 -7927 2988 2195 -2165 -1159 4817 2744 1829 -3689 4055 -4909 -1281 335
294783 823 3201 335 2439 -305 -4543 -4634 1707 -1860 762 -427 -976 -2653 -1890 1372 -4787 -5061
295297 1006 -2012 1220 -2378 701 976 -1463 -2683 -1281 640 884 915 7073 2622 2348 -2622 -1860
295817c110d390c110e49G01d695b409D116a128C903a707f71C689b44c445a768
296308a281D299C35a982A342B226d268a098A250C628F10A555B653a189B012h84
296796I76a494b470B957a585B470a098B531A768a22c140C262i76b622b470b74
297282b622b622A524A799c689A22a52A524B927b988b317e79f159C0B439A189B74
297796h84b927H23b744G897E610E49c476B774b195c018C994a555A951a220a585
298287b378B378F403B13d451A555C110c140c35g195A067d57C842c049a83d025
298778B348f1c96F311b439A738b805A707A311a220b531A342b256C415c476A463
299266f40D970E305C354f1a494A829b74a22D268c35D025C05B378E49B592B957
$$ plain form
295817 -3110 -4390 -3110 -549 701 -4695 -2409 4116 -1128 3903 -1707 -671 3689 -244 -3445 -1768
296308 -1281 4299 335 -1982 1342 2226 -4268 -1098 1250 3628 610 1555 2653 -1189 2012 -884
296796 976 -1494 -2470 2957 -1585 2470 -1098 2531 1768 -122 -3140 3262 -976 -2622 -2470 -274
297282 -2622 -2622 1524 1799 -3689 122 -152 1524 2927 -2988 -2317 -579 -6159 30 2439 1189 274
297796 -884 -2927 823 -2744 7897 5610 549 -3476 2774 -2195 -3018 3994 -1555 1951 -1220 -1585
298287 -2378 2378 6403 213 -4451 1555 3110 -3140 -335 -7195 1067 -457 3842 -3049 -183 -4025
298778 2348 -61 -396 6311 -2439 1738 -2805 1707 1311 -1220 -2531 1342 -2256 3415 -3476 1463
299266 -640 4970 5305 3354 -61 -1494 1829 -274 -122 4268 -335 4025 305 2378 549 2592 2957
299782b134h54C872b134c05a037c567a829f71B896A52C171D451d57c598a433b287
300303B012A372A311D88A159A189A555D543@C567e397f71e701b713a829b012e457
300818H54A098i45A982A250f586e49b409B805f40a006a037b13B439A372a342C05
301339a220A067a006C384B13G01e122A890c140b561d634A52B378G043C994C476
301827d88B287b165C140D88A829b470b13d025C05B073A829c35H54B713C0C35B073
302372b713B470d116f189B988c750c842B226E49A555b622c171a067H23a707b165
302863E732E18B835f494f555a524E915d360B74B44G470b44B531A22A281c567A433
303378B561F098F433F1F10A128b835F1b500B927B774d116a463H23H23D817a220
$$ plain form
299782 -2134 -854 3872 -2134 -305 -1037 -3567 -1829 -671 2896 152 3171 4451 -457 -3598 -1433 -2287
300303 2012 1372 1311 488 1159 1189 1555 4543 0 3567 -5397 -671 -5701 -2713 -1829 -2012 -5457
300818 854 1098 -945 1982 1250 -6586 -549 -2409 2805 -640 -1006 -1037 -213 2439 1372 -1342 305
301339 -1220 1067 -1006 3384 213 701 -5122 1890 -3140 -2561 -4634 152 2378 7043 3994 3476
301827 -488 2287 -2165 3140 488 1829 -2470 -213 -4025 305 2073 1829 -335 854 2713 30 335 2073
302372 -2713 2470 -4116 -6189 2988 -3750 -3842 2226 549 1555 -2622 -3171 -1067 823 -1707 -2165
302863 5732 518 2835 -6494 -6555 -1524 5915 -4360 274 244 7470 -244 2531 122 1281 -3567 1433
303378 2561 6098 6433 61 610 1128 -2835 61 -2500 2927 2774 -4116 -1463 823 823 4817 -1220
303899a524e49G62D27B988e793A433a372H54b348G93C354a982B256C323a463H54
304421c628f1b866C0d88e397b134D57b317D88E092h659b348a890A281C872B012
304940b896f71b561e031C842A402d88D27f647a921b256A524B774B012a982c05
305424D543b622C66@F372@B13I45b896d207F40b134e49D57a982a982D360A250
305976g93C964a006C659e671H84e397F40A037c415A006b622C35B348c933d604
306460I1C079A098a646b713d909a037B13a128A372B073b500b439a189B927C445
306952A555@C232a311b713h23c262B774A646i76b13e79e18b74D57E79A677e823
307501B317c110b317a402C445C96C659c323D512c415e18d88A311F738C66C171
$$ plain form
303899 -1524 -549 762 427 2988 -5793 1433 -1372 854 -2348 793 3354 -1982 2256 3323 -1463 854
304421 -3628 -61 -2866 30 -488 -5397 -2134 457 -2317 488 5092 -8659 -2348 -1890 1281 3872 2012
304940 -2896 -671 -2561 -5031 3842 1402 -488 427 -6647 -1921 -2256 1524 2774 2012 -1982 -305
305424 4543 -2622 366 0 6372 0 213 945 -2896 -4207 640 -2134 -549 457 -1982 -1982 4360 1250
305976 -793 3964 -1006 3659 -5671 884 -5397 640 1037 -3415 1006 -2622 335 2348 -3933 -4604
306460 91 3079 1098 -1646 -2713 -4909 -1037 213 -1128 1372 2073 -2500 -2439 -1189 2927 3445
306952 1555 0 3232 -1311 -2713 -823 -3262 2774 1646 -976 -213 -579 -518 -274 457 579 1677 -5823
307501 2317 -3110 -2317 -1402 3445 396 3659 -3323 4512 -3415 -518 -488 1311 6738 366 3171
307991d939F10D88C354e79I76B957H54B653i1B13A799b866a463A738b409h54a768
308537D88A402A52c0d512d329C811c66A311I45A342b805c323d878A433G62A067
309058C05e275b774a037c110D756B165g01A098A098a22c537C964C445A402B744
309543A799F921D299B134B592a677b134h23G93b561F799a311B287a220a616f10
310031B561B317e18A037b439A433d299E79E79A951B104a402H23b896A982d573
310521B957A281c079C171D817b226A738C96a890D695D27b805a433a281h23a52
311006a189D025f71c506A982E061b622B256B44A189c994A52c140B653a524B348
311498c354b866c171C506B774B378a159B13b653B683A281a738B683h84B165B165
$$ plain form
307991 -4939 610 488 3354 -579 976 2957 854 2653 -91 213 1799 -2866 -1463 1738 -2409 -854 -1768
308537 488 1402 152 -30 -4512 -4329 3811 -366 1311 945 1342 -2805 -3323 -4878 1433 762 1067
309058 305 -5275 -2774 -1037 -3110 4756 2165 -701 1098 1098 -122 -3537 3964 3445 1402 2744
309543 1799 6921 4299 2134 2592 -1677 -2134 -823 793 -2561 6799 -1311 2287 -1220 -1616 -610
310031 2561 2317 -518 1037 -2439 1433 -4299 579 579 1951 2104 -1402 823 -2896 1982 -4573
310521 2957 1281 -3079 3171 4817 -2226 1738 396 -1890 4695 427 -2805 -1433 -1281 -823 -152
311006 -1189 4025 -671 -3506 1982 5061 -2622 2256 244 1189 -3994 152 -3140 2653 -1524 2348
311498 -3354 -2866 -3171 3506 2774 2378 -1159 213 -2653 2683 1281 -1738 2683 -884 2165 2165
311987a311C201A098c628d665c720C384i1D390i45i15B256A433h84d726D451C933
312506d756c66E610g62e579G62E18C018c0h84B927A524a52C445b195i15i15a585
313053e336B74E18a982H54@h23f281H84a098b744c0D88a372c201A677a951d451
313599e061A463a372A524f921a83i45C811B317c079c445b500A738d116a555c354
314091F372F71a22c750i15B012a52C384G01C96a494a951A494b13B043e49a646
314605b592D329A372C171B470D543A22A860f40A890b043c903a524B561C232A006
315093e79F1B805A646a037A189C323a22D57A22G01B134a768a494a707D878B470
315609i45A738a189b348A159b866B866C96f403c598C872A890A83A250e305c96
$$ plain form
311987 -1311 3201 1098 -3628 -4665 -3720 3384 -91 4390 -945 -915 2256 1433 -884 -4726 4451 3933
312506 -4756 -366 5610 -762 -5579 762 518 3018 -30 -884 2927 1524 -152 3445 -2195 -915 -915 -1585
313053 -5336 274 518 -1982 854 0 -823 -6281 884 -1098 -2744 -30 488 -1372 -3201 1677 -1951 -4451
313599 -5061 1463 -1372 1524 -6921 -183 -945 3811 2317 -3079 -3445 -2500 1738 -4116 -1555 -3354
314091 6372 671 -122 -3750 -915 2012 -152 3384 701 396 -1494 -1951 1494 -213 2043 -549 -1646
314605 -2592 4329 1372 3171 2470 4543 122 1860 -640 1890 -2043 -3903 -1524 2561 3232 1006
315093 -579 61 2805 1646 -1037 1189 3323 -122 457 122 701 2134 -1768 -1494 -1707 4878 2470
315609 -945 1738 -1189 -2348 1159 -2866 2866 396 -6403 -3598 3872 1890 183 1250 -5305 -396
316100c903A677B622e153c35a921a342h54g32A433E49C0D57A677c262D299a098
316621D543d329e183c018c872A677A067f71C232a52a281c96A250b805g01C201
317105b073c811i15C628A250a311b134I45a067a006e18b561a037a616A128a677
317594D88B74f10H84b470F1c66F71C05A524c018a738B073C96A189A189c750b073
318147C567A921d268b774c567C66i45c110C933e640b348i15c537b012C903I76
318630a616G93c96A189b561B988A006C537a433A616H54c05c05A52b13E031f128
319152G32a311d848b927A494A128A037b44d421b073A311A067b13C293f40c720
319643B13C018C537A128D848A768C079i76B500H23D787C0a128B073B988b744B073
$$ plain form
316100 -3903 1677 2622 -5153 -335 -1921 -1342 -854 -732 1433 549 30 457 1677 -3262 4299 -1098
316621 4543 -4329 -5183 -3018 -3872 1677 1067 -671 3232 -152 -1281 -396 1250 -2805 -701 3201
317105 -2073 -3811 -915 3628 1250 -1311 -2134 945 -1067 -1006 -518 -2561 -1037 -1616 1128 -1677
317594 488 274 -610 884 -2470 61 -366 671 305 1524 -3018 -1738 2073 396 1189 1189 -3750 -2073
318147 3567 1921 -4268 -2774 -3567 366 -945 -3110 3933 -5640 -2348 -915 -3537 -2012 3903 976
318630 -1616 793 -396 1189 -2561 2988 1006 3537 -1433 1616 854 -305 -305 152 -213 5031 -6128
319152 732 -1311 -4848 -2927 1494 1128 1037 -244 -4421 -2073 1311 1067 -213 3293 -640 -3720
319643 213 3018 3537 1128 4848 1768 3079 -976 2500 823 4787 30 -1128 2073 2988 -2744 2073
320162A067e031B988E549A402A921B866D57A494a037g93i15D329A402C781c628
320644A707d878b896C079b13c079b348A555e49A342E366C598d27d88C537c445
321136f1H84B073a342a768e18b592B805B713a22C384D360e031a22e000a585I1
321650E214d421b835b44C659A982A342e79C659A250I15F037C201a890a128E793
322140f1C354b592c079E457a311B683F71i76A646A281c35e49A342B256I45d207
322659b957I45b927D27b805A067a372a707D604b439B44A006f006g988A037i1B256
323182a677f525I45A220D482B500c96C445@c323@C110a1494d57a22c415g32b500
323727F71a250C628C05c0A83b409F464B74C05H54a250a707C476E18b317B531E79
$$ plain form
320162 1067 -5031 2988 5549 1402 1921 2866 457 1494 -1037 -793 -915 4329 1402 3781 -3628
320644 1707 -4878 -2896 3079 -213 -3079 -2348 1555 -549 1342 5366 3598 -427 -488 3537 -3445
321136 -61 884 2073 -1342 -1768 -518 -2592 2805 2713 -122 3384 4360 -5031 -122 -5000 -1585 91
321650 5214 -4421 -2835 -244 3659 1982 1342 -579 3659 1250 915 6037 3201 -1890 -1128 5793
322140 -61 3354 -2592 -3079 5457 -1311 2683 671 -976 1646 1281 -335 -549 1342 2256 945 -4207
322659 -2957 945 -2927 427 -2805 1067 -1372 -1707 4604 -2439 244 1006 -6006 -7988 1037 -91 2256
323182 -1677 -6525 945 1220 4482 2500 -396 3445 0 -3323 0 3110 -11494 -457 -122 -3415 -732 -2500
323727 671 -1250 3628 305 -30 183 -2409 6464 274 305 854 -1250 -1707 3476 518 -2317 2531 579
324280C0d482i45A921A463A250F40c811d57h23f708c35a799E214A281a402A616
324795B927A281b287a281F1B073a342A982A829G62B774A037d512D27E000A372
325280a494C506C323e488A463a281A22A098c994b44a281A951e79b683a037c0d57
325799h54H23d512g93B043c598B073B74c598a402b165c05A128A738B957C0c567
326323b13h84C689B348a524a342A22A006A067c05B896a555e549A829f1a921b226
326837c384a738E18i15H54A616a707b012B622c537A159C0d238C110D27E427A067
327360c018h54b744c659a067a890e336A52d390a921@D27C05a707a342A433c323
327880d177C750G988d57B287g32d421G32d360h54f067B043A921D177D27i45D482
$$ plain form
324280 30 -4482 -945 1921 1463 1250 640 -3811 -457 -823 -6708 -335 -1799 5214 1281 -1402 1616
324795 2927 1281 -2287 -1281 61 2073 -1342 1982 1829 762 2774 1037 -4512 427 5000 1372
325280 -1494 3506 3323 -5488 1463 -1281 122 1098 -3994 -244 -1281 1951 -579 -2683 -1037 -30 -457
325799 -854 823 -4512 -793 2043 -3598 2073 274 -3598 -1402 -2165 -305 1128 1738 2957 30 -3567
326323 -213 -884 3689 2348 -1524 -1342 122 1006 1067 -305 2896 -1555 -5549 1829 -61 -1921 -2226
326837 -3384 -1738 518 -915 854 1616 -1707 -2012 2622 -3537 1159 30 -4238 3110 427 5427 1067
327360 -3018 -854 -2744 -3659 -1067 -1890 -5336 152 -4390 -1921 0 427 305 -1707 -1342 1433 -3323
327880 -4177 3750 7988 -457 2287 -732 -4421 732 -4360 -854 -6067 2043 1921 4177 427 -945 4482
328398B44I45c842D512b043i76H23F71b653A768b134a768B74e640e49C0b226b622
328945B957a22b073e79A524D88h84a677a220c354d055C0E031a098C262h689a524
329465C171b348C079f708b713d268C110b713C35A646F311b409A799E366B531C079
329950c689a463a281B927A52B195g62e49D57E518E153c0b44a22a433A128d756
330471i15A342c35F159A677A707c445c079b378A799I45c0b835h445B470a281A006
330986h23G62B866F220a433D57A982A128C018D27c323A83a555c872g32b744A677
331505b409c96B226b317g866B287C689a738A646i1a738B073c567I086i76G62G01
332027a250A585d909f71a22C720F10c66d207a799A860f40H54a799c232b44c964
$$ plain form
328398 244 945 -3842 4512 -2043 -976 823 671 -2653 1768 -2134 -1768 274 -5640 -549 30 -2226 -2622
328945 2957 -122 -2073 -579 1524 488 -884 -1677 -1220 -3354 -4055 30 5031 -1098 3262 -8689 -1524
329465 3171 -2348 3079 -6708 -2713 -4268 3110 -2713 335 1646 6311 -2409 1799 5366 2531 3079
329950 -3689 -1463 -1281 2927 152 2195 -762 -549 457 5518 5153 -30 -244 -122 -1433 1128 -4756
330471 -915 1342 -335 6159 1677 1707 -3445 -3079 -2378 1799 945 -30 -2835 -8445 2470 -1281 1006
330986 -823 762 2866 6220 -1433 457 1982 1128 3018 427 -3323 183 -1555 -3872 -732 -2744 1677
331505 -2409 -396 2226 -2317 -7866 2287 3689 -1738 1646 -91 -1738 2073 -3567 9086 -976 762 701
332027 -1250 1585 -4909 -671 -122 3720 610 -366 -4207 -1799 1860 -640 854 -1799 -3232 -244 -3964
332542d329b073A189b74D27G01b653b104D57B317a342B470D787A433a433A951
333033a342a463g62c232h84G01a372b13C903a006E915A646C262c506B866b44a83
333547c781d116I76A646B043D482i15a22a433B043B378D207H23C110a463C659
334035a433G01I1C0H84a281d848C0B134A52B195E793b470a22a494b470a555d146
334588A311c354d88c171B957a098B104B713B531b470C66e579a128A159C140c232
335071d299C05b896B988C140c35A829a799d27h019B134i45c323a677A311a616
335562A342B561D27c537G93C201a433E18i1f433a616d055a890e732H23b74a311
336085B165a281c598b44b805A22d085i15H628a250B348A402b988B774d025c018
$$ plain form
332542 -4329 -2073 1189 -274 427 701 -2653 -2104 457 2317 -1342 2470 4787 1433 -1433 1951
333033 -1342 -1463 -762 -3232 -884 701 -1372 -213 3903 -1006 5915 1646 3262 -3506 2866 -244 -183
333547 -3781 -4116 976 1646 2043 4482 -915 -122 -1433 2043 2378 4207 823 3110 -1463 3659
334035 -1433 701 91 30 884 -1281 -4848 30 2134 152 2195 5793 -2470 -122 -1494 -2470 -1555 -4146
334588 1311 -3354 -488 -3171 2957 -1098 2104 2713 2531 -2470 366 -5579 -1128 1159 3140 -3232
335071 -4299 305 -2896 2988 3140 -335 1829 -1799 -427 -8019 2134 -945 -3323 -1677 1311 -1616
335562 1342 2561 427 -3537 793 3201 -1433 518 -91 -6433 -1616 -4055 -1890 -5732 823 -274 -1311
336085 2165 -1281 -3598 -244 -2805 122 -4085 -915 8628 -1250 2348 1402 -2988 2774 -4025 -3018
336573d025f098i15d543A220C445b988A128i76d57a220B592A067A677h84A220
337057d848b653a982b317b896C049h54a524g01C140A342d573H84a616a738b13
337549a982H84C05d817A037B256A22a281A098B409C384A281d817a250A738B592
338033a555a52E701A982d299A677b592E915E945b104E18a677C720a494I15b988
338521B104b44g93c293a402d88b988b805B74a159c140F037a250C872e427a22E49
339044D177b622c05a524f1b195A006A646I1a159D939G93C05A067b226g93D27A189
339590a555a799B74B134D27B896e976B043A890A890A738f40b866c079d390h23
340074C018B866a433a311A738B317h23A067d055A067A281c0B74c659B713a037
$$ plain form
336573 -4025 -6098 -915 -4543 1220 3445 -2988 1128 -976 -457 -1220 2592 1067 1677 -884 1220
337057 -4848 -2653 -1982 -2317 -2896 3049 -854 -1524 -701 3140 1342 -4573 884 -1616 -1738 -213
337549 -1982 884 305 -4817 1037 2256 122 -1281 1098 2409 3384 1281 -4817 -1250 1738 2592
338033 -1555 -152 5701 1982 -4299 1677 -2592 5915 5945 -2104 518 -1677 3720 -1494 915 -2988
338521 2104 -244 -793 -3293 -1402 -488 -2988 -2805 274 -1159 -3140 6037 -1250 3872 -5427 -122 549
339044 4177 -2622 -305 -1524 -61 -2195 1006 1646 91 -1159 4939 793 305 1067 -2226 -793 427 1189
339590 -1555 -1799 274 2134 427 2896 -5976 2043 1890 1890 1738 -640 -2866 -3079 -4390 -823
340074 3018 2866 -1433 -1311 1738 2317 -823 1067 -4055 1067 1281 -30 274 -3659 2713 -1037
340566a890c567A890A311d57B44F1e000B439d756F10b622a098A524A951D756c537
341085B957A402F40B957B988A707A738C476A098B043a921b378b622c201D27B44
341569D878B957d421B683b683a311A220A768A677a098c628B226D573b104b195
342029I45a890D085b74A52a707d146A189A159a677d939G01c781C354E49A616A067
342551b592d57C354F40b805A433A524e79a342c232A189d57A220a585D695a342
343037b622h84B74a982a342c842B317B561b896a738i1C0B835f10b439A22E49C415
343587A860a281f1C66f1g01B592A159B073c018H23b348c05B44c384d451A311a799
344132c232B774c293F10b287d57a159b713A311d329b774d27a738A829A006B470
$$ plain form
340566 -1890 -3567 1890 1311 -457 244 61 -5000 2439 -4756 610 -2622 -1098 1524 1951 4756 -3537
341085 2957 1402 640 2957 2988 1707 1738 3476 1098 2043 -1921 -2378 -2622 -3201 427 244
341569 4878 2957 -4421 2683 -2683 -1311 1220 1768 1677 -1098 -3628 2226 4573 -2104 -2195
342029 945 -1890 4085 -274 152 -1707 -4146 1189 1159 -1677 -4939 701 -3781 3354 549 1616 1067
342551 -2592 -457 3354 640 -2805 1433 1524 -579 -1342 -3232 1189 -457 1220 -1585 4695 -1342
343037 -2622 -884 274 -1982 -1342 -3842 2317 2561 -2896 -1738 -91 30 2835 -610 -2439 122 549 3415
343587 1860 -1281 -61 366 -61 -701 2592 1159 2073 -3018 823 -2348 -305 244 -3384 -4451 1311 -1799
344132 -3232 2774 -3293 610 -2287 -457 -1159 -2713 1311 -4329 -2774 -427 -1738 1829 1006 2470
344622C96G62A006d085c659f799C872A982a738C415a951a52a616a890B500c079
345113D970A646d268c293i1c964a098a951f037b439B165C323D025C750a83c0D055
345628B165B439A982b957A677A555a646A250A006c0f555d390B13b500D116C05
346116B378A463a52a494a799i1F40c506H84d878a250b470f037b957D055D787F220
346636D482I76b439G409G073A006a006a829C720c201b317f1a921a585B927C0A067
347152a768D512C781a677G93A037G32I45I1B348E061b13a463f1a982b043c750
347673c049A006d909b713H54C96A585b226B774d055a890e031i15C628b348I1C140
348194F1b134B287g01C811b896e061A463D573C811B744G93A281A677e366C05A982
$$ plain form
344622 396 762 1006 -4085 -3659 -6799 3872 1982 -1738 3415 -1951 -152 -1616 -1890 2500 -3079
345113 4970 1646 -4268 -3293 -91 -3964 -1098 -1951 -6037 -2439 2165 3323 4025 3750 -183 -30 4055
345628 2165 2439 1982 -2957 1677 1555 -1646 1250 1006 -30 -6555 -4390 213 -2500 4116 305
346116 2378 1463 -152 -1494 -1799 -91 640 -3506 884 -4878 -1250 -2470 -6037 -2957 4055 4787 6220
346636 4482 976 -2439 7409 7073 1006 -1006 -1829 3720 -3201 -2317 -61 -1921 -1585 2927 30 1067
347152 -1768 4512 3781 -1677 793 1037 732 945 91 2348 5061 -213 -1463 -61 -1982 -2043 -3750
347673 -3049 1006 -4909 -2713 854 396 1585 -2226 2774 -4055 -1890 -5031 -915 3628 -2348 91 3140
348194 61 -2134 2287 -701 3811 -2896 -5061 1463 4573 3811 2744 793 1281 1677 -5366 305 1982
348709E79B74c476A646g409F40i45A524a067b561b287A372a342b988C628d88a890
349228F40A799c05f1a768c0A494A799c0A189h84A83B896A311A22b13e000C201
349775A22A189a555a585E671b13A159h54A372A22B348D482c05b226b683f40C96
350298d025a220f1B409g93I76D025A951b622B713B44E092e79a616a646d543B317
350813F10c964A372A52A128A951c506b378F10h23d543A951h84i45c66I76h23a494
351364B896g01C445B348C171C384D57g62C384A738C384B012C659D116E49E610
351853A402B744b592f10F586A52a281C35c537D268c689i1B226a555c506c933f71
352367D939g62G93b317c0C628a646A585b13B500d390C05a463A677E18C628b348
$$ plain form
348709 579 274 -3476 1646 -7409 640 -945 1524 -1067 -2561 -2287 1372 -1342 -2988 3628 -488 -1890
349228 640 1799 -305 -61 -1768 -30 1494 1799 -30 1189 -884 183 2896 1311 122 -213 -5000 3201
349775 122 1189 -1555 -1585 5671 -213 1159 -854 1372 122 2348 4482 -305 -2226 -2683 -640 396
350298 -4025 -1220 -61 2409 -793 976 4025 1951 -2622 2713 244 5092 -579 -1616 -1646 -4543 2317
350813 610 -3964 1372 152 1128 1951 -3506 -2378 610 -823 -4543 1951 -884 -945 -366 976 -823 -1494
351364 2896 -701 3445 2348 3171 3384 457 -762 3384 1738 3384 2012 3659 4116 549 5610
351853 1402 2744 -2592 -610 6586 152 -1281 335 -3537 4268 -3689 -91 2226 -1555 -3506 -3933 -671
352367 4939 -762 793 -2317 -30 3628 -1646 1585 -213 2500 -4390 305 -1463 1677 518 3628 -2348
352890B713A677A52B774b500B012c079d299a250B927b226f951e79A707c659c35
353381B378D970g32d848b348b561A067B13b13C201a281A860a890i15d634A128
353865A829h84a890E18A890d146B073b622i15A707D88B835b805g62A951f1g93
354383g93C659c262h23h84a250f10B317d878e79I76d238A52B104A006G32A494
354906h23f1c079e427b043E49A433b012C0D238a128A768C018G01d57H54d390d238
355451@I15b74a433C720c598D57A890B13D27B653b012g01b592h964c110B13A128
356004g988C0A768B592C872H598a524e122e214b13c018b805B378g32g01A768A829
356517D848C659B317D939C903b256G01a250d88A037e49C598C110a83A83G317c689
$$ plain form
352890 2713 1677 152 2774 -2500 2012 -3079 -4299 -1250 2927 -2226 -6951 -579 1707 -3659 -335
353381 2378 4970 -732 -4848 -2348 -2561 1067 213 -213 3201 -1281 1860 -1890 -915 -4634 1128
353865 1829 -884 -1890 518 1890 -4146 2073 -2622 -915 1707 488 2835 -2805 -762 1951 -61 -793
354383 -793 3659 -3262 -823 -884 -1250 -610 2317 -4878 -579 976 -4238 152 2104 1006 732 1494
354906 -823 -61 -3079 -5427 -2043 549 1433 -2012 30 4238 -1128 1768 3018 701 -457 854 -4390 -4238
355451 0 915 -274 -1433 3720 -3598 457 1890 213 427 2653 -2012 -701 -2592 -8964 -3110 213 1128
356004 -7988 30 1768 2592 3872 8598 -1524 -5122 -5214 -213 -3018 -2805 2378 -732 -701 1768 1829
356517 4848 3659 2317 4939 3903 -2256 701 -1250 -488 1037 -549 3598 3110 -183 183 7317 -3689
357039a829a159a220A22g32f006D360a646a006A189a159a768B500g714b317H54
357527A799c720b287A281c66E244C445b409C0A402H84B043b317E18@c171b348
358041E122A860F40g32e336f71e79a890B713E549d27d451B74A189a159B317I15
358564B317c0C964a006G32c35C506C598A311i76E49C110a799B317B744F128A037
359085b683c903B835B713a83d939d88C079H23A250A707B531A128C171C476a433
359569h84a738F40G93b439a890a829a982f1a037h354a220a22C232a250b622d665
360088C018c262i45F403c903C903B195C96e214c049I1b44C476C0a281b195b835
360609h23a585c262b287B043f40e945C262a768g93C05A372B348E000C476D299
$$ plain form
357039 -1829 -1159 -1220 122 -732 -6006 4360 -1646 -1006 1189 -1159 -1768 2500 -7714 -2317 854
357527 1799 -3720 -2287 1281 -366 5244 3445 -2409 30 1402 884 2043 -2317 518 0 -3171 -2348
358041 5122 1860 640 -732 -5336 -671 -579 -1890 2713 5549 -427 -4451 274 1189 -1159 2317 915
358564 2317 -30 3964 -1006 732 -335 3506 3598 1311 -976 549 3110 -1799 2317 2744 6128 1037
359085 -2683 -3903 2835 2713 -183 -4939 -488 3079 823 1250 1707 2531 1128 3171 3476 -1433
359569 -884 -1738 640 793 -2439 -1890 -1829 -1982 -61 -1037 -8354 -1220 -122 3232 -1250 -2622 -4665
360088 3018 -3262 -945 6403 -3903 3903 2195 396 -5214 -3049 91 -244 3476 30 -1281 -2195 -2835
360609 -823 -1585 -3262 -2287 2043 -640 -5945 3262 -1768 -793 305 1372 2348 5000 3476 4299
361099B256b500C415e000e397B13E031H54c66I1a067i76B287d88B896G32b622
361613D390b44b012b561d634d604A83C079E79c994i15A311b317b378A738B561
362097B927C05i15C415@A860e79A22B104c110E49g01b195C05a220a342c140A738
362651d177B104b256G32a037A098c96b622B317B805C872A067G043a22C140a951
363139c0a433b470d57B043a281c445b317b073E305B348C35a982a585D57B44H54
363660F098i1g01c140d177B653D482h23D085a768A799F10a159A921C110b896f10
364175B439A220C35B195f10b470B561E18a402B835f1B378c262A890c964F71e031
364695C537G93G470I45h54E092C96C994B470A189E336D573c018C140c049a433
$$ plain form
361099 2256 -2500 3415 -5000 -5397 213 5031 854 -366 91 -1067 -976 2287 -488 2896 732 -2622
361613 4390 -244 -2012 -2561 -4634 -4604 183 3079 579 -3994 -915 1311 -2317 -2378 1738 2561
362097 2927 305 -915 3415 0 1860 -579 122 2104 -3110 549 -701 -2195 305 -1220 -1342 -3140 1738
362651 -4177 2104 -2256 732 -1037 1098 -396 -2622 2317 2805 3872 1067 7043 -122 3140 -1951
363139 -30 -1433 -2470 -457 2043 -1281 -3445 -2317 -2073 5305 2348 335 -1982 -1585 457 244 854
363660 6098 -91 -701 -3140 -4177 2653 4482 -823 4085 -1768 1799 610 -1159 1921 3110 -2896 -610
364175 2439 1220 335 2195 -610 -2470 2561 518 -1402 2835 -61 2378 -3262 1890 -3964 671 -5031
364695 3537 793 7470 945 -854 5092 396 3994 2470 1189 5336 4573 -3018 3140 -3049 -1433
365185A799C964G62B74a220A768b866e732C66F40E092D085a951C689a220B653
365673I1I15H84A829G93b44B13e336D207B378c96B44a768B256c628B500c05a555
366220A707A250E79d88A342A677c567C079C811A402e000a799F006d543b13a585
366709D116F159h54C476c293a433e49a006C96A83d543e244E18c262a372a982A037
367224D177b134g62b622b348i15A220A83A982a768f037b226a982e275C323a951
367713c049b195b104a768D207E640D451D146b744b561B165c66c05A707c720b835
368204g32c232E457D299A311B165H23b256e49D57A585b195C628b439I45f71b348
368723a006c628C35b866A006B256C384c079d88b653C96e854a524C872f40F342
$$ plain form
365185 1799 3964 762 274 -1220 1768 -2866 -5732 366 640 5092 4085 -1951 3689 -1220 2653
365673 91 915 884 1829 793 -244 213 -5336 4207 2378 -396 244 -1768 2256 -3628 2500 -305 -1555
366220 1707 1250 579 -488 1342 1677 -3567 3079 3811 1402 -5000 -1799 6006 -4543 -213 -1585
366709 4116 6159 -854 3476 -3293 -1433 -549 -1006 396 183 -4543 -5244 518 -3262 -1372 -1982 1037
367224 4177 -2134 -762 -2622 -2348 -915 1220 183 1982 -1768 -6037 -2226 -1982 -5275 3323 -1951
367713 -3049 -2195 -2104 -1768 4207 5640 4451 4146 -2744 -2561 2165 -366 -305 1707 -3720 -2835
368204 -732 -3232 5457 4299 1311 2165 823 -2256 -549 457 1585 -2195 3628 -2439 945 -671 -2348
368723 -1006 -3628 335 -2866 1006 2256 3384 -3079 -488 -2653 396 -5854 -1524 3872 -640 6342
369206C35b44a555a616G958c323A860d390c66e884a52b622a738e49b378d939e214
369727B988B378h54a494a037f037B470b622d146A159D787d146A646h54a524a463
370216b774B256A52A250g62d543C537c384c354b805c262f037f71C262A768A22
370700a098b74A342B409a738C811d604i15A220A616I15c506B805B957b104I76
371188A860D421B531C110A463e092b195g62D57a494C567E000G93B13C781A342
371679A037A402b561B378C384D055B256b134C567H23c689C994b073c323b774C66
372170A463e79b44g01B44d695H54f1c567a037A067i15a22G01A829D482b134G01
372716c140B317A555C66c811A52H23B134a524g62B13C049a890E457a890C079B256
$$ plain form
369206 335 -244 -1555 -1616 7958 -3323 1860 -4390 -366 -5884 -152 -2622 -1738 -549 -2378 -4939 -5214
369727 2988 2378 -854 -1494 -1037 -6037 2470 -2622 -4146 1159 4787 -4146 1646 -854 -1524 -1463
370216 -2774 2256 152 1250 -762 -4543 3537 -3384 -3354 -2805 -3262 -6037 -671 3262 1768 122
370700 -1098 -274 1342 2409 -1738 3811 -4604 -915 1220 1616 915 -3506 2805 2957 -2104 976
371188 1860 4421 2531 3110 1463 -5092 -2195 -762 457 -1494 3567 5000 793 213 3781 1342
371679 1037 1402 -2561 2378 3384 4055 2256 -2134 3567 823 -3689 3994 -2073 -3323 -2774 366
372170 1463 -579 -244 -701 244 -4695 854 -61 -3567 -1037 1067 -915 -122 701 1829 4482 -2134 701
372716 -3140 2317 1555 366 -3811 152 823 2134 -1524 -762 213 3049 -1890 5457 -1890 3079 2256
373238b835c384I76c018@A250d177E183b073a311a52C445b348a372c598b226b13
373752F40h23b957B988F067H23A433A067b592h54A860a128d848B774E000a098
374240a189b561d88b165A768b195d27B378F464a433D329B896a646@f189D695d27
374762D665a555A768C140b622b531c842D451c964f768A707D025B531g62b043d543
375252c018e305h23D57b866a494A433A220E79a524a829g62D482d27D025A616a22
375766G93C567A159C232h84a829a52c903A037F799C445a067D055A189D421D88
376258d27A463f403B592A860a738h54G32b409A402D88D146H54B134a250F1a189
376777i76a494b256B287B104a22D329b012e976d238b256I1A707e49a799c35A006
$$ plain form
373238 -2835 -3384 976 -3018 0 1250 -4177 5183 -2073 -1311 -152 3445 -2348 -1372 -3598 -2226 -213
373752 640 -823 -2957 2988 6067 823 1433 1067 -2592 -854 1860 -1128 -4848 2774 5000 -1098
374240 -1189 -2561 -488 -2165 1768 -2195 -427 2378 6464 -1433 4329 2896 -1646 0 -6189 4695 -427
374762 4665 -1555 1768 3140 -2622 -2531 -3842 4451 -3964 -6768 1707 4025 2531 -762 -2043 -4543
375252 -3018 -5305 -823 457 -2866 -1494 1433 1220 579 -1524 -1829 -762 4482 -427 4025 1616 -122
375766 793 3567 1159 3232 -884 -1829 -152 -3903 1037 6799 3445 -1067 4055 1189 4421 488
376258 -427 1463 -6403 2592 1860 -1738 -854 732 -2409 1402 488 4146 854 2134 -1250 61 -1189
376777 -976 -1494 -2256 2287 2104 -122 4329 -2012 -5976 -4238 -2256 91 1707 -549 -1799 -335 1006
377291B470b073b74D756a159d482E549a921E49c0c018A646c689E18H23C232I1
377812B927c66D543b713a494D146e945d085a52A250A006A433A159B805d512b287
378296b378d634e457A707C35b317D27I76I45a83B896b622@B622c994b470b713
378818A128D207A829C201E518B500d970A951a890a982A128C293c66b134b134I15
379306a402A311A921b13c018b378G93a951g134c628A22B043a342a22G01A220b165
379822A372D27H964b256b500F1B74F1A951a52D116B531B348B378e366A250b988
380346a281a555b165B439A494C0e305a768a799B592A22f1a128B74B653a646a494
380862F1A342b348A402A372b44a463d421C35b683D57F71E000a494e945e49c232
$$ plain form
377291 2470 -2073 -274 4756 -1159 -4482 5549 -1921 549 -30 -3018 1646 -3689 518 823 3232 91
377812 2927 -366 4543 -2713 -1494 4146 -5945 -4085 -152 1250 1006 1433 1159 2805 -4512 -2287
378296 -2378 -4634 -5457 1707 335 -2317 427 976 945 -183 2896 -2622 0 2622 -3994 -2470 -2713
378818 1128 4207 1829 3201 5518 2500 -4970 1951 -1890 -1982 1128 3293 -366 -2134 -2134 915
379306 -1402 1311 1921 -213 -3018 -2378 793 -1951 -7134 -3628 122 2043 -1342 -122 701 1220 -2165
379822 1372 427 8964 -2256 -2500 61 274 61 1951 -152 4116 2531 2348 2378 -5366 1250 -2988
380346 -1281 -1555 -2165 2439 1494 30 -5305 -1768 -1799 2592 122 -61 -1128 274 2653 -1646 -1494
380862 61 1342 -2348 1402 1372 -244 -1463 -4421 335 -2683 457 671 5000 -1494 -5945 -549 -3232
381383c689C0B043b134a220F1D146E18e79a829c567C079f71D177B957A128h54
381902G32b378a83D451A738a006C05a006A616d88b317c201E427b622A768G62C445
382415f555A098D604i15b927B835E457d482h54f1c110d27a555C232a555g775b165
382935d512A189c110B744A220E122c476A402d573a037d329c0h54d756b195B683
383426A951b683b561I45d177C354a372a220c049H23D177A921a433c689a677a463
383910b835C781A22b592a555c903A128f10a128a189f71B653b13B226B104A006
384399c750C415c720B44B683c415A860b165B439e457B012C05a494c964C506A768
384887B134a463C903a83D88b927D085A189C079a006H23A128a646a22d604C506
$$ plain form
381383 -3689 30 2043 -2134 -1220 61 4146 518 -579 -1829 -3567 3079 -671 4177 2957 1128 -854
381902 732 -2378 -183 4451 1738 -1006 305 -1006 1616 -488 -2317 -3201 5427 -2622 1768 762 3445
382415 -6555 1098 4604 -915 -2927 2835 5457 -4482 -854 -61 -3110 -427 -1555 3232 -1555 -7775 -2165
382935 -4512 1189 -3110 2744 1220 5122 -3476 1402 -4573 -1037 -4329 -30 -854 -4756 -2195 2683
383426 1951 -2683 -2561 945 -4177 3354 -1372 -1220 -3049 823 4177 1921 -1433 -3689 -1677 -1463
383910 -2835 3781 122 -2592 -1555 -3903 1128 -610 -1128 -1189 -671 2653 -213 2226 2104 1006
384399 -3750 3415 -3720 244 2683 -3415 1860 -2165 2439 -5457 2012 305 -1494 -3964 3506 1768
384887 2134 -1463 3903 -183 488 -2927 4085 1189 3079 -1006 823 1128 -1646 -122 -4604 3506
385378G62a890c049D878A951b896A281h54c903A555c506D604d756a22f433B74
385861F10f40A524E336d238D88B470h23B470D390d88C537C66B13h84b927b226
386382F1d299g62b409a342b653c445d025A037B653A159d207e671a463a951b012
386873b927H54d57a128A860E18C720A890F372C567A159D57c384b774a982A220
387361A646D88B012f40B012A098B226a098B012E854g93B805A128B805A982B744
387845a982B835a83b805C720A281A799G93A951e579G93D177b592b13b073a738
388337A738C903b988a860h54a189b805A037a22c140C05a037I76C842a890b13a52
388852D57B13C96d116G32h84A768C201b622A342i15C964a22C903D451a951D57
$$ plain form
385378 762 -1890 -3049 4878 1951 -2896 1281 -854 -3903 1555 -3506 4604 -4756 -122 -6433 274
385861 610 -640 1524 5336 -4238 488 2470 -823 2470 4390 -488 3537 366 213 -884 -2927 -2226
386382 61 -4299 -762 -2409 -1342 -2653 -3445 -4025 1037 2653 1159 -4207 -5671 -1463 -1951 -2012
386873 -2927 854 -457 -1128 1860 518 3720 1890 6372 3567 1159 457 -3384 -2774 -1982 1220
387361 1646 488 2012 -640 2012 1098 2226 -1098 2012 5854 -793 2805 1128 2805 1982 2744
387845 -1982 2835 -183 -2805 3720 1281 1799 793 1951 -5579 793 4177 -2592 -213 -2073 -1738
388337 1738 3903 -2988 -1860 -854 -1189 -2805 1037 -122 -3140 305 -1037 976 3842 -1890 -213 -152
388852 457 213 396 -4116 732 -884 1768 3201 -2622 1342 -915 3964 -122 3903 4451 -1951 457
389373c476c05c872f10a372c781A951b073A494C476d57H84B592d88@H110A463
389892D634G32b073A616E49c476i15B165f372c201C598B348A555F40D88B713i15
390413F10c842A494B439E579c689C964a067A524b439a982f71h23B683a281d482
390896b957c964b774A006b470c689a189f10B683d025e18C659F40C05d57d360C140
391417a738d421A220G93A616a860b073a494c96B043a22c35e579A128B622b927
391902b988e214B226a799a52g01C537I15E18f10B744c628C35A067b104A921B531
392421b409C750b287D207B043i1a738F159c293a311D482c140G93C384C567a433
392912d421b653D27I76B74b378a83b713f10A342b256A555b957D207i45A220G32
$$ plain form
389373 -3476 -305 -3872 -610 -1372 -3781 1951 -2073 1494 3476 -457 884 2592 -488 0 8110 1463
389892 4634 732 -2073 1616 549 -3476 -915 2165 -6372 -3201 3598 2348 1555 640 488 2713 -915
390413 610 -3842 1494 2439 5579 -3689 3964 -1067 1524 -2439 -1982 -671 -823 2683 -1281 -4482
390896 -2957 -3964 -2774 1006 -2470 -3689 -1189 -610 2683 -4025 -518 3659 640 305 -457 -4360 3140
391417 -1738 -4421 1220 793 1616 -1860 -2073 -1494 -396 2043 -122 -335 -5579 1128 2622 -2927
391902 -2988 -5214 2226 -1799 -152 -701 3537 915 518 -610 2744 -3628 335 1067 -2104 1921 2531
392421 -2409 3750 -2287 4207 2043 -91 -1738 6159 -3293 -1311 4482 -3140 793 3384 3567 -1433
392912 -4421 -2653 427 976 274 -2378 -183 -2713 -610 1342 -2256 1555 -2957 4207 -945 1220 732
393426a890E671g93D88A311a768b012D238@C354A707D451e976b165C415D909F71
393948a22a768a311H54A433c110a677d57B744B348b226A921B927g32G134A829
394438D604B683h384A372f1a250d726C445b409C262F10b043C293A311B195b287
$$ plain form
393426 -1890 5671 -793 488 1311 -1768 -2012 4238 0 3354 1707 4451 -5976 -2165 3415 4909 671
393948 -122 -1768 -1311 854 1433 -3110 -1677 -457 2744 2348 -2226 1921 2927 -732 7134 1829
394438 4604 2683 -8384 1372 -61 -1250 -4726 3445 -2409 3262 610 -2043 3293 1311 2195 -2287
$$ [...]
##END=
##END=$$ END of FILE