##TITLE=HMBCGPND
##JCAMPDX= 6.0         $$ Bruker NMR JCAMP-DX V2.0
##DATA TYPE= nD NMR SPECTRUM
##DATA CLASS= NTUPLES
##NUM DIM= 2
##ORIGIN= Bruker BioSpin GmbH
##OWNER= nmrsu
$$ TOPSPIN		Version 1.3
$$ 2012-03-07 07:42:37.250 -0500  nmrsu@CHEM-NMR-002
$$ Compression mode = diff/dup
##.OBSERVE FREQUENCY= 500.13150039
##.OBSERVE NUCLEUS= ^1H
##.ACQUISITION MODE= SIMULTANEOUS (DQD)
##.ACQUISITION SCHEME= NOT PHASE SENSITIVE
##.AVERAGES= 4
##.DIGITISER RES= 18
##SPECTROMETER/DATA SYSTEM= spect
##.PULSE SEQUENCE= hmbcgpndqf
##.SOLVENT NAME= DMSO
##.SHIFT REFERENCE= INTERNAL, DMSO, 1, 6.500491
##AUDIT TRAIL= $$ (NUMBER, WHEN, WHO, WHERE, WHAT)
$$ ##TITLE= Audit trail, TOPSPIN		Version 1.3
$$ ##JCAMPDX= 5.01
$$ ##ORIGIN= Bruker BioSpin GmbH
$$ ##OWNER= nmrsu
$$ $$ c:/nmr/data/NMRSU/nmr/hexanol/8/pdata/1/auditp.txt
$$ ##AUDIT TRAIL=  $$ (NUMBER, WHEN, WHO, WHERE, VERSION, WHAT)
(   1,<2011-05-03 09:21:00.937 -0500>,<nmrsu>,<CHEM-NMR-002>,<TOPSPIN 1.3>,
      <acquisition in progress>)
(   2,<2011-05-03 09:28:16.312 -0500>,<nmrsu>,<CHEM-NMR-002>,<TOPSPIN 1.3>,
      <Start of raw data processing
       xfb F2: SI = 1K WDW = 3 SSB = 0 FT_mod = 6 PKNL = 1 F1: SI = 1K ME_mod = 2 NCOEF = 32 WDW = 3 SSB = 0 FT_mod = 6 PH_mod = 2
       data hash MD5: 1K * 1K
       AE AB 15 17 21 5A DE D2 6E DD F5 5F 54 4F 01 AE>)
$$ ##END=
$$ 
$$ $$ hash MD5
$$ $$ 12 A4 54 E8 D0 C6 2C 46 FA EE C3 90 18 1E A1 95
##$RELAX= 
##$RELAX= 
##$RELAX= 
##$RELAX= 
##$RELAX= 
##$RELAX= 
##$RELAX= 
##$RELAX= 
##$RELAX= 
##$RELAX= 
$$ Bruker specific parameters
$$ --------------------------
##$DU= <c:/nmr>
##$EXPNO= 8
##$NAME= <hexanol>
##$PROCNO= 1
##$TYPE= <nmr>
##$USER= <NMRSU>
##$AMP= (0..31)
100 100 100 100 100 100 100 100 100 100 100 100 100 100 100 100 100 100 
100 100 100 100 100 100 100 100 100 100 100 100 100 100 
##$ANAVPT= -1
##$AQSEQ= 0
##$AQ_mod= 3
##$AUNM= <au_getlinv>
##$AUTOPOS= <>
##$BF1= 500.13
##$BF2= 125.757789
##$BF3= 500.13
##$BF4= 500.13
##$BF5= 299.87
##$BF6= 299.87
##$BF7= 299.87
##$BF8= 299.87
##$BYTORDA= 1
##$CFDGTYP= 2
##$CFRGTYP= 5
##$CHEMSTR= <none>
##$CNST= (0..63)
1 1 145 1 1 1 1 1 1 1 1 1 50 8 1 1 1 1 1 1 1 50 30 40 1 1 1 1 1 1 1 1 
1 1 1 1 1 1 1 1 1 1 1 1 1 1 1 1 1 1 1 1 1 1 1 1 1 1 1 1 1 1 1 1 
##$CPDPRG= <garp>
##$CPDPRG1= <>
##$CPDPRG2= <waltz16>
##$CPDPRG3= <>
##$CPDPRG4= <mlev>
##$CPDPRG5= <mlev>
##$CPDPRG6= <mlev>
##$CPDPRG7= <mlev>
##$CPDPRG8= <mlev>
##$CPDPRGB= <>
##$CPDPRGT= <>
##$D= (0..63)
3e-006 1.5 0.00345 0.0023 0 0 0.0625 0.4 0 0.08 0 0.03 2e-005 3e-006 0 
0 0.0002 0 0 0 0 0 0 0 0 0 0 0 0 0 0 0 0 0 0 0 0 0 0 0 0 0 0 0 0 0 0 0 
0 0 0 0 0 0 0 0 0 0 0 0 0 0 0 0 
##$DATE= 1304432476
##$DBL= (0..7)
120 120 120 120 120 120 120 120 
##$DBP= (0..7)
150 150 150 150 150 150 150 150 
##$DBP07= 0
##$DBPNAM0= <>
##$DBPNAM1= <>
##$DBPNAM2= <>
##$DBPNAM3= <>
##$DBPNAM4= <>
##$DBPNAM5= <>
##$DBPNAM6= <>
##$DBPNAM7= <>
##$DBPOAL= (0..7)
0.5 0.5 0.5 0.5 0.5 0.5 0.5 0.5 
##$DBPOFFS= (0..7)
0 0 0 0 0 0 0 0 
##$DE= 6
##$DECBNUC= <off>
##$DECIM= 48
$$ [...]
##$SWIBOX= (0..15)
0 0 0 0 0 0 0 0 0 0 0 0 0 0 0 0 
##$SW_h= 10060.3621730382
##$TD= 64
##$TD0= 1
##$TE= 300
##$TE2= 300
##$TE3= 300
##$TEG= 300
##$TL= (0..7)
120 120 120 120 120 120 120 120 
##$TP= (0..7)
150 150 150 150 150 150 150 150 
##$TP07= 0
##$TPNAME0= <>
##$TPNAME1= <>
##$TPNAME2= <>
##$TPNAME3= <>
##$TPNAME4= <>
##$TPNAME5= <>
##$TPNAME6= <>
##$TPNAME7= <>
##$TPOAL= (0..7)
0.5 0.5 0.5 0.5 0.5 0.5 0.5 0.5 
##$TPOFFS= (0..7)
0 0 0 0 0 0 0 0 
##$TUNHIN= 0
##$TUNHOUT= 0
##$TUNXOUT= 0
##$USERA1= <user>
##$USERA2= <user>
##$USERA3= <user>
##$USERA4= <user>
##$USERA5= <user>
##$V9= 5
##$VALIST= <valist>
##$VCLIST= <CCCCCCCCCCCCCCC>
##$VD= 0
##$VDLIST= <DDDDDDDDDDDDDDD>
##$VPLIST= <PPPPPPPPPPPPPPP>
##$VTLIST= <TTTTTTTTTTTTTTT>
##$WBST= 256
##$WBSW= 4
##$XGAIN= (0..3)
0 0 0 0 
##$XL= 0
##$YL= 0
##$YMAX_a= 0
##$YMIN_a= 0
##$ZGOPTNS= <>
##$ZL1= 120
##$ZL2= 120
##$ZL3= 120
##$ZL4= 120
##$ABSF1= 0
##$ABSF2= 0
##$ABSG= 0
##$ABSL= 0
##$ALPHA= 0
##$AQORDER= 0
##$ASSFAC= 0
##$ASSFACI= 0
##$ASSFACX= 0
##$ASSWID= 0
##$AUNMP= <        >
##$AXLEFT= 0
##$AXRIGHT= 0
##$AXTYPE= 0
##$AXUNIT= <>
##$AZFE= 0.1
##$AZFW= 0.5
##$BCFW= 0
##$BC_mod= 0
##$BYTORDP= 0
##$COROFFS= 0
##$CY= 15
##$DATMOD= 1
##$DC= 0
##$DFILT= <>
##$DTYPP= 0
##$F1P= 0
##$F2P= 0
##$FCOR= 0.5
##$FTSIZE= 1024
##$FT_mod= 6
##$GAMMA= 0
##$GB= 0
##$INTBC= 1
##$INTSCL= 1
##$ISEN= 128
##$LB= 0
##$LEV0= 0
##$LPBIN= 98
##$MAXI= 10000
##$MC2= 0
##$MEAN= 0
##$ME_mod= 2
##$MI= 1
##$NCOEF= 32
##$NC_proc= -1
##$NLEV= 6
##$NOISF1= 0
##$NOISF2= 0
##$NSP= 0
##$NTH_PI= 0
##$NZP= 0
##$OFFSET= 74.99896
##$PC= 4
##$PHC0= 0
##$PHC1= 0
##$PH_mod= 2
##$PKNL= no
##$PPARMOD= 1
##$PPDIAG= 0
##$PPIPTYP= 0
##$PPMPNUM= 100
##$PPRESOL= 1
##$PSCAL= 1
##$PSIGN= 0
##$REVERSE= no
##$SF= 125.757789
##$SI= 1024
##$SIGF1= 0
##$SIGF2= 0
##$SINO= 16
##$SIOLD= 512
##$SREGLST= <1H.DMSO>
##$SSB= 0
##$STSI= 1024
##$STSR= 0
##$SW_p= 10060.3621730382
##$SYMM= 0
##$S_DEV= 49123
##$TDeff= 98
##$TDoff= 0
##$TI= <        >
##$TILT= no
##$TM1= 0
##$TM2= 0
##$TOPLEV= 0
##$USERP1= <user>
##$USERP2= <user>
##$USERP3= <user>
##$USERP4= <user>
##$USERP5= <user>
##$WDW= 3
##$XDIM= 1024
##$YMAX_p= 264018455
##$YMIN_p= 0
$$ End of Bruker specific parameters
$$ ---------------------------------
##NTUPLES= nD NMR SPECTRUM
##VAR_NAME=  FREQUENCY1,    FREQUENCY2,      SPECTRUM
##SYMBOL=    F1,            F2,              Y
##.NUCLEUS=  13C,           1H
##VAR_TYPE=  INDEPENDENT,   INDEPENDENT,     DEPENDENT
##VAR_FORM=  AFFN,          AFFN,            ASDF
##VAR_DIM=   1024,          1024,            1024
##UNITS=     HZ,            HZ,              ARBITRARY UNITS
##FACTOR=    9.83417612222698, 3.42267894450058, 1
##FIRST=     9431.70368901288, 3501.40056022409, 21700
##LAST=      -628.658484025322, 0,           5713
##MIN=       -628.658484025322, 0,           0
##MAX=       9431.70368901288, 3501.40056022409, 264018455
##PAGE= F1=9431.703689013
##FIRST=     9431.70368901288, 3501.40056022409, 21700
##DATA TABLE= (F2++(Y..Y)), PROFILE
$$ [...]
##PAGE= F1=2872.308215487
##FIRST=     9431.70368901288, 3501.40056022409, 22052
##DATA TABLE= (F2++(Y..Y)), PROFILE
136E9883L7458p105p054m0988N5537o2230L1527m2304r689K2321k5872J2930O859
$$ 59883 97341 90236 83182 42194 97731 35501 67028 24724 15035 37356 11484 24414 31273
123C1273q032k58Q191j5473q160L5572J7840j391m4479L7182N4690p0286M0526
$$ 31273 23241 22983 31174 15701 7541 43113 60953 59562 15083 52265 106955 36669 77195
110G7195m9425q979L1234j0596l4103O995L2344J1476m2169J5920p032J0411l441
$$ 77195 27770 18791 50025 39429 5326 12321 44665 56141 13972 29892 22860 33271 29830
97B9830j9675J464M391p267N768J7228L1893j8849N4720n2557j7134n981J786
$$ 29830 10155 11619 16010 8743 14511 31739 63632 44783 99503 46946 29812 23831 25617
84B5617J9816k3420j9303J2062K3398p381j0339M696M9130m1833j1242n483K1391
$$ 25617 45433 22013 2710 14772 38170 30789 20450 25146 74276 32443 21201 15718 37109
71C7109o655J761o565k753n833j4848L6572k0843r207M8998l4942L7269k0609
$$ 37109 30454 32215 25650 22897 17064 2216 38788 17945 8738 57736 22794 60063 39454
58C9454k3809o64r526M360J1882p070K5139k2963M1458j9865q776j0347k279Q767
$$ 39454 15645 14981 5455 9815 21697 14627 39766 16803 58261 38396 29620 19273 16994 25761
44B5761j482J6921k1814r048L8919P666J6317n7456q511K3903L0163j8611l7069
$$ 25761 24279 41200 19386 10338 49257 56923 73240 15784 7273 31176 61339 42728 5659
31E659Q482o216J2361n04M210n156j3006Q298K4066k649n444o66P303j5397L5473
$$ 5659 14141 7925 20286 19782 23992 18836 5830 14128 38194 35545 30101 29435 36738 21341 56814
16E6814l1076j6264M525n540J4076l070J3569k059j30k6477J3561J8109O700k2291
$$ 56814 25738 9474 13999 8459 22535 19465 33034 30975 30845 4368 17929 36038 42738 20447
2B0447j286q851
$$ 20447 19161 10310
0A0310
$$ 10310
##PAGE= F1=2862.474039365
##FIRST=     9431.70368901288, 3501.40056022409, 23343
##DATA TABLE= (F2++(Y..Y)), PROFILE
1023B3343O534j8683Q805L792k1701J0602M974J2620k5058K0189J7341O1278p2279
$$ 23343 29877 11194 19999 23791 2090 12692 17666 30286 5228 25417 42758 104036 31757
1010C1757J626q929J3469j9836k080N447j2333J0906m465K14K2310k5700j96J9453
$$ 31757 33383 24454 37923 18087 16007 21454 9121 20027 15562 15776 38086 12386 12190 31643
996C1643J2954k1736j8602L5220j3235q821J1099j0897j836Q249o15j3479Q224
$$ 31643 44597 22861 4259 39479 26244 17423 28522 17625 15789 24038 23423 9944 18168
983A8168L668j4224K0781Q8157n2240m3253P569k0700K5568j7030Q720j0171K0947
$$ 18168 21836 7612 28393 116550 64310 21057 28626 7926 33494 16464 25184 15013 35960
970C5960j4775J43N900j8798P410n687J4273M152K9457l1582L7101l5603j4972
$$ 35960 21185 21328 27228 8430 15840 10153 24426 28578 58035 26453 63554 27951 12979
957A2979P809K2778l2830K3809q669l156J6780q312k7595N714M11J0823J0728
$$ 12979 20788 43566 10736 34545 25876 22720 39500 31188 3593 9307 9718 20541 31269
944C1269o919J3502l1954Q122L841K661l117J71L2686m604l0434r971J0972k768
$$ 31269 24350 37852 5898 14020 17861 20522 17405 17576 50262 45658 15224 5253 16225 13457
930A3457q196J6731J1649k4083K474J7594o000r466n404J7311K9218N29l5744
$$ 13457 5261 21992 33641 9558 12032 29626 23626 14160 8756 26067 55285 55814 20070
917B0070R639k967r075L0623k6902j0480K6695l5750L0246j0375L8372n0162K2802
$$ 20070 29709 26742 17667 48290 21388 10908 37603 1853 32099 21724 60096 9934 32736
904C2736j5453m176J7358k1214Q969O6297l4859k8166K6802p516l523k5051J5492
$$ 32736 17283 13107 30465 9251 18220 84517 49658 21492 48294 40778 37255 12204 27696
891B7696k2666M177K227J1830n715J2746M4972n6559J3771n554J8212k2653K668
$$ 27696 5030 9207 11434 23264 17549 30295 75267 18708 32479 26925 45137 22484 25152
878B5152j4847M0847k7459k336R579K851k3032l519N898J7763M1587l7010r588
$$ 25152 10305 51152 23693 21357 30936 33787 10755 7236 13134 30897 72484 35474 25886
865B5886k2561L9415p365K238j0145j0534r81J3306J927q644O9731R458j9929
$$ 25886 3325 42740 35375 37613 27468 16934 15953 29259 31186 22542 92273 101731 81802
852H1802p7104J7910o385J2057K55J425j8804N800p32M270M5386l7891q618l432
$$ 81802 4698 22608 16223 28280 28535 29960 11156 16956 16224 20494 65880 27989 19371 15939
838A5939j0025Q842M0126n857J7811J5497o3279k960l39K289N1190m770n3563
$$ 15939 5914 14756 54882 49025 66836 82333 19054 16094 15755 18044 69234 64464 10901
825A0901L2532k0143J2772Q144k0538q317J8715q155L9219l6328j5290O674J9239
$$ 10901 43433 23290 36062 44206 23668 15351 34066 25911 65130 28802 13512 20186 39425
812C9425K1516r083j2305k2061J0714M3114l6704k0826K0695j6621j4851L7590
$$ 39425 60941 51858 39553 17492 28206 71320 34616 13790 34485 17864 3013 40603
800D0603k3961K8678k2949P936J1934J4215k5796J4627j2445M0626n1750K1790
$$ 40603 16642 45320 22371 30307 42241 56456 30660 45287 32842 73468 21718 43508
788D3508M5556k1221j6082j9915J5207M1075J10901o0857K03155p4141K4867L2409
$$ 43508 89064 67843 51761 31846 47053 88128 199029 138172 341327 267186 292053 324462
776C24462j63669L5313o1307P2562P2260L30n2144p5413p7554K0446J40126j32452
$$ 324462 160793 196106 134799 207361 279621 279951 227807 152394 74840 95286 235412 102960
764A02960n2487J9200R767J03472j10828n6407K3835K2594j4282l7568L5231l1833
$$ 102960 50473 69673 79440 182912 72084 15677 39512 62106 47824 10256 45487 13654
752A3654J1003j3926N23Q283p263J4881j8346L6705j7310r547p175J7835J6250
$$ 13654 24657 10731 11254 19537 12274 27155 8809 45514 28204 18657 11482 29317 45567
739D5567k3289j718K1744M1900j9846n2828J2369j1114L4302Q724l3235O59o273
$$ 45567 22278 20560 42304 84204 64358 11530 23899 12785 47087 55811 22576 23235 16962
726A6962k097K2165m830k3264K2809j3682J3269N760q642j1192K669p331K1191
$$ 16962 14865 37030 32200 8936 31745 18063 31332 37092 28450 17258 19927 12596 33787
713C3787k1588J6183L750n421q218j1632J2685J1682j4778O721K0055j7180O860
$$ 33787 12199 28382 32132 26711 18493 6861 19546 31228 16450 23171 43226 26046 32906
700C2906o884K475k0194J4034M14n402j0726j160J8342j7036K1235r074p104J1016
$$ 32906 26022 28497 8303 22337 22751 17349 6623 5463 23805 6769 28004 18930 11826 22842
686B2842o515K7211k3767J6446j4535J2953N1468l5668l6821J8876J9964k2071
$$ 22842 16327 43538 19771 36217 21682 34635 86103 50435 13614 32490 52454 30383
674C0383q343J0945J7988k2750j3676J5144j5591J01750n2805l2066p111J09832
$$ 30383 22040 32985 50973 28223 14547 29691 14100 115850 63045 30979 23868 133700
662A33700n3566n6093K9928l6836R158J068J6496k8719m600L6107J5981m5021
$$ 133700 80134 24041 53969 17133 26291 27359 43855 15136 10536 46643 62624 17603
650A7603J9173l0711J2459q075P85J8939m478k740r348k070j918k061L8881j9986
$$ 17603 36776 6065 18524 10449 11234 30173 25695 22955 13607 11537 9619 7558 46439 26453
636B6453j7708K9735L932K1805l1486o126j6073P154k780J231J8243j8127R167
$$ 26453 8745 38480 42412 64217 32731 26605 10532 17686 14906 16137 34380 16253 25420
623B5420j0784O898K775J8885P546P3816m8957l1453n237L828L0737N1702J7391
$$ 25420 14636 21534 24309 43194 50740 124556 75599 44146 38909 42737 73474 125176 142567
610A42567l1310k7084j5362M4192m5255p900k3609n908m710j2119J5414n880j88
$$ 142567 111257 84173 68811 113003 67748 59848 36239 30331 25621 13502 28916 23036 22848
597B2848K6911P4780J62465K64653J35815r8692k62119Q6565k6396K02817R674
$$ 22848 49759 124539 287004 551657 687472 588780 326661 413226 386830 589647 599321
586E99321J57393q6812k77446k08959r5665J457J7361R0938p4288R667l2363o1413
$$ 599321 756714 669902 392456 183497 87832 89289 106650 197588 123300 132967 100604 39191
574C9191J8764j0988P8592L8941k2905P780o025m9975l0343J0333l2772p152J3010
$$ 39191 57955 46967 125559 164500 141595 149375 143350 93375 63032 73365 40593 33441 46451
561D6451L6950m9485K372J5446J9456L7968k7695n46j6468m4077K8730J9147m3127
$$ 46451 83401 33916 36288 51734 71190 109158 81463 80917 64449 20372 49102 68249 25122
548B5122J0431j7030j2269N315j06K8654J5053M406k7362k180M636j2493L4328
$$ 25122 35553 18523 6254 11569 11463 40117 55170 59576 32214 30034 34670 22177 56505
535E6505n0439L2292k8633l2J7189M250J002o632P177P195k7612J3904K4123k7974
$$ 56505 6066 38358 9725 9693 26882 31132 32134 25502 32679 39874 12262 26166 50289 22315
521B2315p144K059j787q117J4428L593j4556J3831j958q477q331Q2953m8760k1549
$$ 22315 15171 17230 15443 7326 21754 25347 10791 24622 22664 14187 5856 88809 40049 18500
507A8500q839J0694r341J393L9573j3140o685k3629J9293j278k4715J1511n253
$$ 18500 9661 20355 11014 12407 51980 38840 32155 8526 27819 26541 1826 13337 8084
494H084K8995j2215J1448k0015L664r134R603j3272n340L0355l997K775j9938
$$ 8084 37079 24864 36312 16297 19961 10827 20430 7158 1818 32173 28176 30951 11013
481A1013J471P9132o6246p907q889O928K0100r014L167j3820r164p04K914J778
$$ 11013 12484 91616 25370 17463 8574 15502 35602 26588 29755 15935 6771 6067 8981 10759
467A0759l485J2496J2393j7041j2119K6279j2435P685M0843n5362O1478l0389
$$ 10759 7274 19770 32163 15122 3003 29282 16847 24532 65375 10013 71491 41102
455D1102q720k3353J197J6994n630r940J803K689N677k794m907J3610j4320n369
$$ 41102 32382 9029 10226 27220 21590 11650 13453 16142 21819 19025 14118 27728 13408 8039
441H039L0369j3815j1130K8517L1486j6801j3600k3997r827J4645j6573J2308
$$ 8039 38408 24593 13463 41980 73466 56665 43065 19068 9241 23886 7313 19621
429A9621J5861J4515l4421j0453J6818r199n161M1641J935l1039n32J9548J0617
$$ 19621 35482 49997 15576 5123 21941 12742 7581 49222 51157 20118 19586 39134 49751
416D9751l6797K9102k2611N710j6308j003l90l065J6162J40N336J151K8745l6033
$$ 49751 12954 42056 19445 25155 8847 7844 7454 4389 20551 20691 26027 27178 55923 19890
402A9890L9513j8043J1854l3778K5092k6931k562J3418j5071p544K5386j0465
$$ 19890 59403 41360 53214 19436 44528 17597 15035 28453 13382 5838 31224 20759
390B0759O255M636l409k0816P654l200J4855j3789p747M1130p842p979J1975j5382
$$ 20759 27014 31650 28241 7425 15079 11879 26734 12945 5198 46328 38486 30507 42482 27100
376B7100J7451l838k4690K5083j4702j5930M5980m4113J7297j3277q809J5208
$$ 27100 44551 40713 16023 41106 26404 10474 56454 12341 29638 16361 7552 22760
364B2760J6114j58l0024L117J3292J0689j2854j324K270K9543j7373J041k3026
$$ 22760 38874 38716 8692 11809 25101 35790 22936 21612 23882 53425 36052 37093 14067
351A4067R559j5426R3239q6937R0493r0755J4738k709k1175M3503l7095Q181J289
$$ 14067 23626 8200 101439 14502 104995 14240 28978 26269 5094 48597 11502 19683 20972
338B0972N804R082k4147J5302j0146o348L2435P272j0687j3452k085J529j7009
$$ 20972 26776 35858 11711 27013 16867 10519 42954 50226 39539 26087 24002 25531 8522
325H522K6233J8662p266P151N8407L6616L3873L3678q831O2290L0170l7301k4677
$$ 8522 34755 53417 46151 53302 111709 148325 182198 215876 207045 269335 299505 262204 237527
312B37527j0754j78361k3299L0037J42151M6408K6660K0749O1131K9080r1727
$$ 237527 226773 48412 25113 55150 197301 243709 270369 291118 352249 381329 289602
301B89602k4146P4038M1937p2379o8181j964j48543q671J78207K41933p5346L78756
$$ 289602 265456 339494 381431 309052 240871 238907 90364 81693 259900 501833 426487 805243
289H05243P33909P04506O09739j89798n59096j46432j025493n10725j64698P7522
$$ 805243 1539152 2243658 2853397 2663599 2104503 1958071 932578 421853 257155 334677
279C34677L99659J28443K60030j31093P36214O41398L67188K90959K57718J22065
$$ 334677 734336 862779 1122809 991716 1727930 2369328 2736516 3027475 3285193 3407258
269C407258J3561J732397J174027O46744o32900k727973N82399J437340m55990
$$ 3407258 3420819 5153216 6327243 6973987 6341087 3613114 4195513 5632853 5176863
260E176863N72001M40655K54301o20618j701080j858739q50012k45126j92886
$$ 5176863 5748864 6189519 6443820 5823202 4122122 2263383 1413371 1168245 975359
251I75359n076J3104O0521o3200o9813r1526j19435m47677J07564j44108j06376
$$ 975359 970283 983387 1043908 980708 910895 819369 699934 252257 359821 215713 109337
240A09337R4939m9449O7820m4070N187k3297q198k4250l174J01585n0165p8492
$$ 109337 204276 154827 222647 178577 183764 160467 152269 128019 124845 226430 176265 97773
228I7773L5606J60260K06931J80346J50826K4572P5794J15669r8748m26490k03291
$$ 97773 133379 293639 500570 680916 831742 856314 932108 1047777 949029 522539 319248
217C19248q1912j12030l1172J47545K412344J6739721L1687198L7353939O2796797
$$ 319248 237336 125306 94134 241679 2654023 19393744 51080942 88434881 151231678
208A51231678N2960176K8271136J4847159r274969m5324567m9439495m5941663
$$ 151231678 204191854 232462990 247310149 238035180 192710613 143271118 97329455
201I7329455n2313923k1382391j3577274q525647j411650L17310l051p291n3303
$$ 97329455 45015532 23633141 10055867 1530220 118570 435880 432829 425538 372235
192C72235L4458j52191M7250P1548K2460L5766O1435k5715n1974j65082j07542
$$ 372235 406693 254502 301752 373300 395760 431526 492961 467246 415272 250190 142648
181A42648m6981L1888P5261N9213p0722m0810j1543K0530L4903l160o5911j5035
$$ 142648 95667 127555 202816 262029 191307 150497 138954 159484 194387 191227 125316 110281
169A10281j5574m0227p669l2821L4199k6321j5302K2967K3325r711P6831q607
$$ 110281 94707 54480 46811 13990 48189 21868 6566 29533 52858 43147 119978 111371
157A11371j6032m4264J2361O431M2346l3977O1470m9749l1253J0656l7566R703
$$ 111371 95339 51075 63436 69867 112213 78236 139706 89957 58704 69360 31794 41497
145D1497k1791j7758K2064j205K0957m0031P2741l8696K1813L9860p109j4633
$$ 41497 19706 1948 24012 22807 43764 3733 76474 37778 59591 99451 92342 77709
133G7709m0556M6735n4810L1188l6781r890K1817k4219J3221Q489r643M75P793
$$ 77709 37153 83888 29078 60266 23485 13595 35412 11193 24414 32903 23260 23735 31528
120C1528j7752m473L3319J7207k611m2107L5934N3235o9646L9338m6350j0481
$$ 31528 13776 9303 42622 59829 57218 15111 51045 104280 34634 73972 27622 17141
108A7141L6616j5303l1785Q075L0474N863l7316J6368o881J2245n575k0244J508
$$ 17141 53757 38454 6669 14744 45218 51081 13765 30133 23252 35497 29922 9678 11186
95A1186N439l711r17K0011L4586j6350N2188n5983j7597n603K377J7288k0891
$$ 11186 16625 12914 11997 32008 66594 50244 102432 46449 28852 23249 25626 42914 22023
82B2023j9638J2160K2885p430q978O016M9936m4471j4007k702K2889j0262J0428
$$ 22023 2385 14545 37430 30000 21022 27038 76974 32503 18496 15794 38683 28421 38849
69C8849q370o551p235j3910L6512k1075r934M8106l2314L4662k0819k1355j878
$$ 38849 30479 23928 16693 2783 39295 18220 8286 56392 24078 58740 37921 16566 14688
56A4688q671L418J1075m355K2096j9742L5988j8096j0432p636o26Q794k986J4607
$$ 14688 6017 9435 20510 16155 38251 18509 54497 36401 25969 18333 17707 26501 23515 38122
42C8122k0913p158L8922R945J1649n4292r225K7024L2887j9225m1405P181o082
$$ 38122 17209 10051 48973 58918 70567 16275 7050 34074 66961 47736 6331 13512 7430
29G430J1827P29K621n024j3343O097K9441m849p731K664J1083j8868L5239k6854
$$ 7430 19257 19986 22607 17583 4240 10337 39778 34929 27198 29862 40945 22077 57316 30462
15C0462k0662K653m657J3978j004J5548k642j588k8369J3297J7900O888k1287
$$ 30462 9800 12453 7796 21774 20770 36318 33676 32088 3719 17016 34916 41804 20517
2B0517l321p690
$$ 20517 17196 9506
0I506
$$ 9506
##PAGE= F1=2852.639863243
##FIRST=     9431.70368901288, 3501.40056022409, 24641
##DATA TABLE= (F2++(Y..Y)), PROFILE
1023B4641O148k1781J1039M832k3323J0006P105J3189k6682J9871J3461O2997
$$ 24641 30789 9008 20047 24879 1556 11562 18667 31856 5174 25045 38506 101503
1011A01503o8754P3p774J2285j9978j636M513j2548J0477k495M868J7665k6956
$$ 101503 32749 32822 25048 37333 17355 15719 20232 7684 18161 15666 20534 38199 11243
998A1243k01K0659R451k1151j4304L4476j2399j1459J2529j0485k803Q335M38
$$ 11243 11042 31701 41152 20001 5697 40173 27774 16315 28844 18359 15556 23891 24329
985B4329j5313R046L630j3141K0435Q7960n0487m4169N729j9470K3885j6397R102
$$ 24329 9016 18062 21692 8551 28986 116946 66459 22290 28019 8549 32434 16037 25139
972B5139r989K0529j5072J256P459k2085Q831k237J3070N76K6578k7675L5882
$$ 25139 15150 35679 20607 21863 29322 7237 16068 13831 26901 27477 54055 26380 62262
959F2262l4155j5666N879K7095l4364K2051q913j549J7071j0534k5671O989k178
$$ 62262 28107 12441 18320 45415 11051 33102 24189 22640 39711 29177 3506 10495 8317
946H317J4115J0492p103J0812l2144Q530N120J009j614l25L0217j789l1229r596
$$ 8317 22432 32924 25821 36633 4489 13019 18139 19148 17534 17209 47426 45637 14408 4812
932D812J1865l552p920J6777J1020k4109K719K1009q090j0157o168J7341K9375
$$ 4812 16677 13125 5205 21982 33002 8893 11612 32621 24531 14374 8206 25547 54922
919E4922K364l8451J1273p44j1535L3990k9276r991K6174l7233L1821j0494L5516
$$ 54922 57286 18835 30108 29364 17829 51819 22543 12552 38726 1493 33314 22820 58336
906E8336m7968K3362j6942l965J5925j9360R693O3761l6730k4548K3585n036k142
$$ 58336 10368 33730 16788 12823 28748 9388 19081 82842 46112 21564 45149 40113 37971
893C7971k5798J5928k3319M442L014J1652o756J0762M8031n6981J1911l885J5803
$$ 37971 12173 28101 4782 9224 12238 23890 17134 27896 75927 18946 30857 26972 42775
880D2775k1312L754j7885L9138k4223J284R817J531k4204m174O475J9596M0864
$$ 42775 21463 25217 7332 46470 22247 23531 33348 34879 10675 6501 12976 32572 73436
867G3436l7778q565k2686L9243p414N514j5054j0848N48J1256J278m388O8441
$$ 73436 35658 27093 4407 43650 36236 41750 26696 15848 16396 27652 28930 24542 92983
854I2983P159j6066p9396J6797o174J5389R62m24k0070N939R9L166M9056m4406
$$ 92983 100142 84076 4680 21477 15303 30692 31654 31230 11160 17099 17198 20364 69420 25014
840B5014p782j513j0730J0283L8719j0984K3733J9793o6287o314L718p5N2230
$$ 25014 17232 15719 4989 15272 53991 43007 66740 86533 20246 13932 17650 17575 69805
827F9805j979n7041L2961k0586J4487P145k2203p409J8428o912L3566l1417j4184
$$ 69805 67826 10785 43746 23160 37647 44792 22589 15180 33608 26696 60262 28845 14661
814A4661L760K2180K1575j9137m107k1387J1413M6073m0728k1453J5271j0186
$$ 14661 18421 40601 62176 43039 38932 17545 28958 75031 34303 12850 28121 17935
802A7935j7190L9169k2643K6780k2420P537J2214J4860k5927J0502j0823M1861
$$ 17935 745 39914 17271 44051 21631 29168 41382 56242 30315 40817 29994 71855
790G1855m7894J6981M2119j5872j8645k0217J4405M5839J03557m5230K01199o6606
$$ 71855 23961 40942 83061 67189 48544 28327 42732 88571 192128 146898 348097 281491
778B81491J1146K5540j60489L8000n9795O0530P3532R490m9631p0234p7763K3014
$$ 281491 292637 318177 157688 195688 135893 196423 269955 279445 229814 159580 81817 104831
766A04831J31912j31915n2634K1039J0750J05034j16657n8459K3608K2934j3289
$$ 104831 236743 104828 52194 73233 83983 189017 72360 13901 37509 60443 47154
755D7154l8536L2829k8563J2368j4078k94R057p400J2346j5063L0610j4817p882
$$ 47154 8618 41447 12884 25252 11174 10880 19937 12537 24883 9820 40430 25613 17731
742A7731o285J5681J3793j9876p85K1572M5035k1810n3364J1625j0648L1248O134
$$ 17731 11446 27127 40920 21044 20259 41831 86866 65056 11692 23317 12669 43917 50051
729E0051k6464q76o115j991K1792q486k0369K5148j5175J3437M476q035j0965
$$ 50051 23587 22711 16596 14605 36397 27911 7542 32690 17515 30952 35428 27393 16428
716A6428K947p046J9601k1243J7093j580l323k973j4352J3140J1474j5094R081
$$ 16428 19375 12329 31930 10687 27780 26200 22877 19904 5552 18692 30166 15072 24153
703B4153J9933j6861R044j1088L826k1028J0250P311q458j1349j505J8427j4061
$$ 24153 44086 27225 36269 25181 29007 7979 18229 25540 17082 5733 4228 22655 8594
690H594K1459j1801p100J0621n853K7423k3396J8110j5727J2856M9896l2900l8059
$$ 8594 30053 18252 11152 21773 15920 43343 19947 38057 22330 35186 85082 52182 14123
677A4123J8622J9750k3035p845J1047J6026k0266j0453J5311j9722J01850n0335
$$ 14123 32745 52495 29460 21615 32662 48688 28422 17969 33280 13558 115408 65073
665F5073l3200r345J06400m8767n6159L2302l8735P009K254K1386l1009l847L0836
$$ 65073 31873 22528 128928 80161 24002 56304 17569 24578 26832 48218 17209 13362 44198
652D4198J7306m4744J9669l1360J3782q865R44J8190p290L10q186j403p29m875
$$ 44198 61504 16760 36429 5069 18851 9986 10930 29120 21830 22140 13954 12551 11822 6947
638F947M1869k0576j9252K8530L677K7131l3809p709j6555N640n356N383J7507
$$ 6947 48816 28240 8988 37518 41195 68326 34517 26808 10253 15893 10537 15920 33427
625C3427j6393P032j0436P355p66K2089M864P3303n1569k5827l827M503K6251
$$ 33427 17034 24066 13630 20985 20219 42308 47172 120475 68906 43079 39252 43755 70006
612G0006N0812J7276k9595k8407j4876M2500m5192m329k2968l946l841j3516J5158
$$ 70006 120818 138094 108499 80092 65216 107716 62524 58195 35227 31281 27440 13924 29082
599B9082n209L99K9980P4267J79926K32096J15926j20300l26519J23396j979K00144
$$ 29082 23873 24272 54252 128519 308445 540541 656467 536167 209648 333044 331065 531209
587E31209J6476J66878p6229k66607j90409r0226N145J0219Q3744p1978J0513
$$ 531209 547685 714563 638334 371727 181318 91092 96237 106456 190200 118222 128735
576A28735l0224o0463K0931j5559P6116M0556k1711J0528q595n0184k8703P291
$$ 128735 98511 38048 58979 43420 119536 160092 138381 148909 140314 90130 61427 68718
564F8718l1601n697J3235L7796n1541P004J3579J9458L7900k6150n625j3603m3641
$$ 68718 37117 31420 44655 82451 30910 37914 51493 70951 108851 82701 77076 63473 19832
551A9832K7187J7422m0048J1533j9762j0180N353J396K8396R996N897k7308j60
$$ 19832 47019 64441 24393 35926 16164 5984 11337 12733 41129 51125 57022 29714 29554
538B9554M972j0793L4846m9386K6236k7046K261J7801L581l644j778P537J327
$$ 29554 34526 23733 58579 9193 35429 8383 10644 28445 32026 28382 26604 34141 35468
525C5468k2263J1167K7232k8893p081L113j728q666J4317L446j5235J2995l538
$$ 35468 13205 24372 51604 22711 15630 18743 17015 8349 22666 26112 10877 23872 20334
512B0334p040o428Q3344n1157k1476j0601J7483j3414J22M3566j6510o843k0453
$$ 20334 13294 6866 90210 39053 17577 6976 24459 11045 11167 54733 38223 31380 10927
499A0927J7431l438k3045J1590n901K8641j0051J0286k0719M650j1955J3512j5278
$$ 10927 28358 24920 1875 13465 7564 36205 26154 36440 15721 20371 8416 21928 6650
486F650m095L0787n390N708k0036N62P7339o7370o606q698O045K1248p875K044
$$ 6650 2555 33342 27952 33660 13624 14186 91525 24155 17549 8851 14896 36144 28269 30313
472C0313j3582q948k029L260K756n413J2596J3004j7501j1753K7123r840M094
$$ 30313 16731 7783 5754 9014 11770 6357 18953 31957 14456 2703 29826 19986 24080
459B4080L6013m9393O0027k9287o601k5416J359J7444n545j1585K976J576P356
$$ 24080 60093 10700 70727 41440 34839 9423 10782 28226 22681 11096 14072 15648 23004
446B3004l408n759J5279j5871m770K9432q082j5914K7655K8223j2687j5985k2564
$$ 23004 19596 13837 29116 13245 8475 37907 29825 13911 41566 69789 57102 41117 18553
433A8553r074J3581j5536J1692J2601J7084l2224j1510J6111p451p287L9929K370
$$ 18553 9479 23060 7524 19216 31817 48901 16677 5167 21278 13827 6540 46469 48839
420D8839k7891L31J7134J2804m0488L1216k4186O486j5244k558J115k680J8150
$$ 48839 20948 21279 38413 51217 10729 41945 17759 24245 9001 6443 7558 4878 23028
407B3028P75M647k409K6720l2134L7024k1507R445k6457K6137k6816k711J3675
$$ 23028 23803 28450 26041 52761 20627 57651 36144 45589 19132 45269 18453 15742 29417
394B9417j5407q694K8600j2473N102M083j099k4552J0994m443J5669j2471j1581
$$ 29417 14010 5316 33916 21443 26545 30628 29529 4977 15971 11528 27197 14726 3145
381C145M5020q938o835J0686j0597J0382J595k8844K8637j7522j6282M6766m4483
$$ 3145 48165 39227 32392 43078 32481 42863 44458 15614 44251 26729 10447 57213 12730
368A2730J7553j3487r061J4387J6493j389k9689L304J4444Q709j1318j044M96
$$ 12730 30283 16796 7735 22122 38615 37226 7537 10841 25285 33994 22676 21632 22128
355B2128L2123j5163p56k4018P452j2293R7180r3210R1607r0915J4207l513j8816
$$ 22128 54251 39088 38332 14314 21766 9473 106653 13443 105050 14135 28342 24829 6013
342F013M2232l7269J1626l164Q851J0366k6820J7914l398j5397L0336J1075r885
$$ 6013 48245 10976 22602 19438 28289 38655 11835 29749 26351 10954 41290 52365 42480
329D2480j4757m997N21j2649K2654K6979j4299Q304O6643L0174L2205L1854r782
$$ 42480 27723 22726 23247 10598 33252 60231 45932 54236 120879 151053 183258 215112 205330
316B05330O5896L3375l5656k9282j0984j80899k3589K9390J40594L4266K9900
$$ 205330 271226 304601 268945 239663 228679 47780 24191 53581 194175 228441 258341
305B58341K0621O9501O6043j18608K464Q8384M5673o9171l9534L864j56784j12486
$$ 258341 278962 348463 414506 295898 298362 386746 432419 363248 323714 327578 170794 58308
293E8308J82973K61841o7396L27150P90114O98666O15883r5420o82974j22983
$$ 58308 241281 503122 435726 762876 1552990 2251656 2867539 2772119 2089145 1966162
283A966162j021993n15272j75242R2874M38781J51655K51902j54808Q03977O77883
$$ 1966162 944169 428897 253655 346529 785310 936965 1188867 1034059 1838036 2515919
273B515919L98388L85787K58731r7272N9155J675156J125186O37439n09658k900674
$$ 2515919 2914307 3300094 3558825 3461553 3520708 5195864 6321050 6958489 6448831 3548157
263C548157Q83589J799653l98787O45393L94562J91884p28609j909275k018930
$$ 3548157 4431746 6231399 5832612 6478005 6872567 7064451 6335842 4426567 2407637
254B407637q51674k16522j72839k0981L4756O4010j04395j07054j61894j58570
$$ 2407637 1555963 1339441 1166602 1145621 1180377 1244387 1139992 1032938 871044 712474
244G12474m70072J05500j50702r3679J07631m8397O8661n7590J3262j6055j2491
$$ 712474 242402 347902 197200 103521 211152 162755 231416 173826 187088 171033 158542
233A58542k4615l725R3556n7414q1733L0178J43845K06658J79608J68871L5367
$$ 158542 133927 130202 223758 166344 84611 114789 258634 465292 644900 813771 849138
222H49138Q0538J13342r2254m19365j88000r4416r4845m0002J19170K506252J7918228
$$ 849138 929676 1043018 950764 531399 343399 248983 154138 114136 233306 2739558 20657786
211B0657786L3255097L8407901O4851039N4299501K9662162J5772584r170333
$$ 20657786 53912883 92320784 157171823 211471324 241133486 256906070 247735737
204B47735737m6795740n1178352m7359066n4884034k2432235j4265309r317523
$$ 247735737 200939997 149761645 102402579 47518545 25086310 10821001 1503478
197A503478j379025L13243J236o885m1483J2072j55514M0564P3624K4995L7562
$$ 1503478 124453 437696 438932 432047 390564 402636 247122 287686 361310 386305 423867
186D23867O0466k3682m5287j63544j08789n0920L2498P4977O2292p7101l6284
$$ 423867 484333 460651 415364 251820 143031 92111 124609 199586 261878 184777 148493
175A48493j1024K7120L8924m508o9411q641j7098m0582j7796k8318K7644j6537
$$ 148493 137469 164589 203513 199005 129594 120953 103855 63273 45477 17159 44803 28266
163B8266j9499K1840K5614j1884P7464r480j7700m5626J5275M724N0601l8321
$$ 28266 8767 30607 56221 44337 121801 112321 94621 48995 64270 68994 119595 81274
151H1274O0066m6367k8495N032l6751R146k2344j7679J9437R21K0518l8200P4518
$$ 81274 141340 94973 66478 71510 34759 43905 21561 3882 23319 24240 44758 6558 81076
138H1076m3063K1417M1460p754k1491l9064L8186m6787L0187l1305j0738K1253
$$ 81076 38013 59430 100890 93136 71645 32581 70767 23980 54167 22862 12124 33377
126C3377k2429J3305R760j1029J425P122j8653j556L0774J6214l512l9701L4730
$$ 33377 10948 24253 34013 22984 24409 31531 12878 11322 42096 58310 54798 15097 49827
113D9827N0563o7012L6921m2656j1920M2437k0816k9196Q891K8613L29l2269J6721
$$ 49827 100390 33378 70299 27643 15723 58160 37344 8148 17039 45652 45981 13712 30433
100C0433o827J3923p457k0675J380O619n63o606K2055L6633j3386M8491n8445
$$ 30433 23606 37529 30072 9397 10777 17396 16833 10227 32282 68915 55529 104020 45575
87D5575j7662n186K552J4596j7943j9124J1464K2370p410p551P081N0710m7058
$$ 45575 27913 22727 25279 39875 21932 2808 14272 36642 29232 21681 28762 79472 32414
74C2414j6310k53K4099j3823J9425j0325j0396q606j1985L4983k0821j0395M6480
$$ 32414 16104 15851 39950 26127 45552 35227 24831 16225 4240 39223 18402 8007 54487
61E4487k8985L1735k0945j8863l101p800K780J0420j355J8578j6775L0766j6196
$$ 54487 25502 57237 36292 17429 14328 6528 9308 19728 18373 36951 20176 50942 34746
48C4746j2403m976J011Q734m435J2354k0034n253L8655J2140O536n0191r236K9507
$$ 34746 22343 17367 18378 27112 22677 35031 14997 9744 48399 60539 67075 16884 7648 37155
34C7155L5712j9733m6216O695o168J0750K115M44m473j3519M467L4160p262r831
$$ 37155 72867 53134 6918 13613 7445 18195 20310 20754 16281 2762 7229 41389 34127 24296
20B4296N905J5007k2490L4677k2161k5111J077m032J3755R59J8035l185l372l0308
$$ 24296 30201 45208 22718 57395 35234 10123 11200 7168 20923 21882 39917 36732 33360 3052
6C052J2935J7684P191k0250n346o616
$$ 3052 15987 33671 40862 20612 15266 8650
0H650
$$ 8650
##PAGE= F1=2842.805687121
##FIRST=     9431.70368901288, 3501.40056022409, 25924
##DATA TABLE= (F2++(Y..Y)), PROFILE
1023B5924N734k4413J2656N966k4610R303R060J3248k7670J9611Q865O4368o4155
$$ 25924 31658 7245 19901 25867 1257 10560 19620 32868 5198 24809 33674 98042 33887
1010C3887j679o536J0901k0128p06L436j2745J0042m56R481J2821k8253j57K1490
$$ 33887 32208 25672 36573 16445 15739 19175 6430 16472 16016 25497 38318 10065 9908 31398
996C1398N895j9512j0272L3378j1428j4170J3707j0067l678Q468J414j6693R405
$$ 31398 37293 17781 7509 40887 29459 15289 28996 18929 15251 23719 25133 8440 17845
983A7845L610j1946J9917Q6646m7841m4724L837j8019K1995j5724R435r830K0081
$$ 17845 21455 9509 29426 116072 68231 23507 27344 9325 31320 15596 25031 15201 35282
970C5282j5235K296R147k4597R415J081J1793k553K3206k3721L4534l2361j6610
$$ 35282 20047 22343 31490 6893 16308 17389 29182 26629 49835 26114 60648 28287 11677
957A1677M600L0949l5470J9975r108j9J7215j2501k3970Q419m607J7226J0067
$$ 11677 16277 47226 11756 31731 22623 22604 39819 27318 3348 11767 7160 24386 34453
944C4453o209P101l2241Q869O650r38j06o84K7605O98l1575r243J2659m356p586
$$ 34453 28244 35345 3104 11973 18623 17685 17579 16895 44500 45198 13623 4380 17039 12683 5097
929E097J6880J0435k4149K903K3974r853j0707o874J7096K9486M283m0953J2799
$$ 5097 21977 32412 8263 11166 35140 25287 14580 7706 24802 54288 58571 17618 30417
916C0417J432j3781L7089l1147r925K5587l8575L3309j0530L2658m5558K3838
$$ 30417 31849 18068 55157 24010 14085 39672 1097 34406 23876 56534 10976 34814
904C4814j8388l890J4272j7360J0363O0819l8358k0692K0554k691q28k6325J5960
$$ 34814 16426 12536 26808 9448 19811 80630 42272 21580 42134 39443 38615 12290 28250
891B8250k3600M835L632J1334p620Q836N0385n6887J0160k336J3757k0122M538
$$ 28250 4650 9485 13117 24451 16831 25667 76052 19165 29325 26989 40746 20624 25162
878B5162k0511L7182k0880N231R573K51k5446m836P142K1999L9028l8263p270
$$ 25162 4651 41833 20953 26184 35757 36008 10562 5726 12868 34867 73895 35632 28362
865B8362k1976L8172p521Q817k0096j1044K227Q857P93K57O5891M706j2063q0733
$$ 28362 6386 44558 37037 45854 25758 14714 16941 25798 26591 26848 92739 97445 85382 4649
851D649J5863o083J8551J717j784k1780O051J269J996N2199n0464p114L43j0870
$$ 4649 20512 14429 32980 34697 32913 11133 17184 18453 20449 72648 22184 15070 15413 4543
837D543J1194L6407j5206K9364K3916o8493r921P580k478N2600J149n9907L3058
$$ 4543 15737 52144 36938 66302 90218 21725 11804 19384 16906 69506 70655 10748 43806
824D3806k0817J6313O405k3981o674J8344n783K7778k6591j3212J146K5105K1455
$$ 43806 22989 39302 45707 21726 15052 33396 27613 55391 28800 15588 16734 41839 63294
811F3294k8652L493k0574J2091M8665m4441k1978R856l683j3733L4850k1289K4822
$$ 63294 34642 38135 17561 29652 78317 33876 11898 21754 18071 4338 39188 17899 42721
798D2721k2044P254J2787J5086k6003O900r330M2693m3730J1777L8805j0383k1105
$$ 42721 20677 27931 40718 55804 29801 36701 27371 70064 26334 38111 76916 66533 45428
785D5428k0246J3309N0347R6358k9041J95145n8249j381J8584j57336M1855n8153
$$ 45428 25182 38491 88838 185196 156155 351300 293051 291670 310254 152918 194773 136620
773A36620M8465P4531J7279m6612o4663p7213K6197J21602j29048n3505K3148
$$ 136620 185085 259616 276895 230283 165620 88407 114604 236206 107158 53653 76801
762G6801J0696J05452j20586o0133K3162K3072j2201l9287L0839k5046J2954j4175
$$ 76801 87497 192949 72363 12230 35392 58464 46263 6976 37815 12769 25723 11548
750A1548q90R547p408R759j1648K4772j2512o329n345J3021J2232j6823K06K1179
$$ 11548 10658 20205 12797 22556 10908 35680 23168 16839 11494 24515 36747 19924 20130 41309
736D1309M7816k3396n3822J0761j0116K7890M250k0049k375o143j762K1413j1079
$$ 41309 89125 65729 11907 22668 12552 40442 44692 24643 22268 16125 14363 35776 24697
723B4697j8483K7229j6558J3431L451p525j0689L298o794J8087k0196J7256n651
$$ 24697 6214 33443 16885 30316 33767 26242 15553 18851 12057 30144 9948 27204 21553
710B1553j894J576j6924J3658J1626j5278J0935J9358j6131J1162j5321N129k1620
$$ 21553 19659 21235 4311 17969 29595 14317 25252 44610 28479 39641 24320 29449 7829
697G829N613J5579j2073j1810k017J8317j0881K1294j4285p083J0168n036K7363
$$ 7829 13442 29021 16948 5138 3121 21438 10557 31851 17566 10483 20651 15615 42978
684D2978k3026K0204j7008J2553M7616k9379l9337J8226J9162k3816o900J0988
$$ 42978 19952 40156 23148 35701 83317 53938 14601 32827 51989 28173 21273 32261
672C2261J4041j7495p178J5482k4221J00712m7316l3604j1479J01589m3413n5460
$$ 32261 46302 28807 21629 37111 12890 113602 66286 32682 21203 122792 79379 23919
660B3919L4293m0221M808L429K6193l2956k824K4790J8223m3563J9855l1970J5178
$$ 23919 58212 17991 22799 26228 52421 19465 16641 41431 59654 16091 35946 3976 19154
647A9154r647J083J7822j0174L059p081p63N58p785M4757k0937k0730K7719K677
$$ 19154 9507 10590 28412 18238 21297 14216 13453 14011 6226 50983 30046 9316 37035 39712
633C9712L2569l5635r255j7100M540r083J1061J5556j4556M988j0039P409l697
$$ 39712 72281 36646 27391 10291 14831 5748 16809 32365 17809 22797 12758 20167 16470
620A6470K4916K391P1740n3179k0390k543N143K2175N0330J6816k7625k9997j3574
$$ 16470 41386 43777 115517 62338 41948 39405 44548 66723 117053 133869 106244 76247 62673
607F2673M0577m4966m49k3076k347k980j4939J4724m375R08L3466P5621J99353
$$ 62673 103250 58284 57835 34759 32412 29432 14493 29217 24842 25750 59216 134837 334190
594C34190J90219R8467j30643l89439J62807K2392J79174K3367J71688o1302k51614
$$ 334190 524409 622876 492233 102794 265601 287993 467167 490534 662222 600920 349306
583C49306j70786q4810R807L139P5339o9009J1420k8306n9368K2771j9596P3904
$$ 349306 178520 93710 103517 106656 181995 112986 124406 96100 36732 59503 39907 113811
571A13811M1975k0413J3184j1143n0403k7043M112l0392m075J3236L7995n2506
$$ 113811 155786 135373 148557 137414 87011 59968 64080 33688 29613 42849 80844 28338
559B8338J1086J1524J9543L6920k3983j0851j0188m3104K5565J5320l6618J2698
$$ 28338 39424 50948 70491 107411 83428 72577 62389 19285 44850 60170 23552 36250
547C6250k2651p885N728K549K7805M877P675k6853J572N334r044L4973m7694J9579
$$ 36250 13599 5714 11442 13991 41796 46673 54348 27495 29067 34401 25357 60330 12636 32215
533C2215k5078M575J8240K856q203L194Q551n199j7033Q572K9998k9379p301M109
$$ 32215 7137 11712 29952 32808 24605 27799 36350 31151 14118 22690 52688 23309 16008 20117
519B0117j372r117J3949L352j6002J2230n080n603m263Q2517n2754k1210j2582
$$ 20117 18745 9628 23577 26929 10927 23157 18077 12474 8211 90728 37974 16764 4182
506D182K4288j7087j501M7427j9798o937j7382J5810n849k0160J0594o348K8103
$$ 4182 28470 11383 9882 57309 37511 30574 13192 29002 23153 2993 13587 7239 35342
493C5342p819Q965k1364N981j4264J6657j7376k915L1335o852Q762j9941m56P5463
$$ 35342 27523 36488 15124 21105 6841 23498 6122 3207 34542 27690 36452 16511 16055 91518
479I1518o8171n740q459N502K1692o692J100j3057q785l457L561L745p178J2544
$$ 91518 23347 17607 9148 14650 36342 29650 30750 17693 8908 5451 9012 12757 5579 18123
465A8123J3476j7834j0724K7347p202L83L1094m3339N8163k7881m247k7414J311
$$ 18123 31599 13765 3041 30388 23186 23569 54663 11324 69487 41606 37359 9945 11256
452A1256J8142n556j3335M059M88R276m136o398J6843j7591m004K8335k846k0210
$$ 11256 29398 23842 10507 14566 15054 24330 20194 13796 30639 13048 9044 37379 34533 14323
438A4323K6704K5051q862j8332k0763q138J2165j4438J1216J0250J8620k9890
$$ 14323 41027 66078 57216 38884 18121 9983 22148 7710 18926 29176 47796 17906
426A7906j2546J5295n684q452L7074K808k4690R21J5231J4478m2541L1691k5599
$$ 17906 5360 20655 14971 6519 43593 46401 21711 22632 37863 52341 9800 41491 15892
413A5892O981j3658m101K490k195K0067K143L798o423K5361k8923L4331k4664
$$ 15892 22873 9215 5114 7604 5409 25476 27619 31417 24994 50355 21432 55763 31099
400C1099P333j9630K6845k6322k957J3809j5608r256L1163j4263L946L351J090
$$ 31099 38432 18802 45647 19325 16368 30177 14569 5313 36476 22213 26159 29510 30600
387C0600k7167J3346n505J6153j0944j3466M7307j0382n550Q996n322K817P789
$$ 30600 3433 16779 11274 27427 16483 3017 50324 39942 34392 43388 38066 40883 48672
374D8672l3515L2070k0326j6502M7321m4553J7511j3352r439J3744J6391k496
$$ 48672 15157 47227 26901 10399 57720 13167 30678 17326 7887 21631 38022 35526
362C5526k9162L782J5409O327r062j081j213L4412j2116l260k4867N134r088J00184
$$ 35526 6364 10146 25555 31882 22820 21739 20526 54938 42822 39562 14695 19829 10741 110925
348A10925r8589R1208q9525J3583m308j5996M0371l7234J4607p089J1713J1632
$$ 110925 12336 103544 14019 27602 23294 7298 47669 10435 25042 17953 29666 41298
336D1298k9113K0666L385k3983K7381J4844r196j5865p627r16q054J8928L4927
$$ 41298 12185 32851 36236 12253 39634 54478 45282 29417 21790 20874 12820 31748 66675
323F6675k1218R741P4837K2973L0251K9885j0794O9144L6697l4591l3373j1129
$$ 66675 45457 55198 130035 153008 183259 213144 202350 271494 308191 273600 240227 229098
311B29098j82112k3043K8183J37939K2782L2721K0790P6851J03517j43829K8481
$$ 229098 46986 23943 52126 190065 212847 245568 266358 343209 446726 302897 331378
300C31378R8816M6420o8001j1504Q457j61487j56744J41039K73088n5872K71741
$$ 331378 430194 476614 408613 397109 405566 244079 87335 228374 501462 445590 717331
289G17331Q26303O79935O07385N87p94137r8140r95205n07933j87353J05905M69399
$$ 717331 1543634 2223569 2830954 2831541 2037404 1939264 944059 436126 248773 354678 824077
278H24077J74187K40767j73662Q59454P05741M26193M77286K59910l20413J00260
$$ 824077 998264 1239031 1065369 1924823 2630564 3056757 3534043 3793953 3473540 3573800
268C573800J584150J056293O17507l80392l022095J189087K153939l11235P01329
$$ 3573800 5157950 6214243 6831750 6451358 3429263 4618350 6772289 6461054 7162383
259G162383L24147J15368q35843k099393k153499q38355j79002j41090l7184N9031
$$ 7162383 7486530 7601898 6766055 4666662 2513163 1674808 1495806 1354716 1317532 1376563
249A376563O1828j48623j40334k29392j99512m89473J03595j54940q2004J19555
$$ 1376563 1438391 1289768 1149434 920042 720530 231057 334652 179712 97708 217263
239B17263m6699O7994p0645K1830p820j7164k4338m534Q6346o1500q5755K0540
$$ 217263 170564 238558 167913 189743 181923 164759 140421 135887 222233 160733 74978 95518
227I5518J31476K06833J77992J85309M4692Q3641J10749q5400m06232j79340j04197
$$ 95518 226994 433827 611819 797128 841820 925461 1036210 950810 544578 365238 261041
216B61041p9315m7694R0258K575162J8838475L4318813L8853063O5897181N4773146
$$ 261041 181726 134032 224290 2799452 21637927 55956740 94809803 160706984 215480130
207B15480130L0619758J6439453q920052m7560716n2105352m8050398n6622122
$$ 215480130 246099888 262539341 253619289 206058573 153953221 105902823 49280701
200D9280701k3131893j4714661r967242j336526L07339O674n578l1965r665j56386
$$ 49280701 26148808 11434147 1466905 130379 437718 444392 438814 406849 397184 240798
190B40798L1625P5485K6244L9275N9210k1652l9037j59911j09102n3795L2325
$$ 240798 272423 347908 374152 413427 472637 450985 411948 252037 142935 89140 121465
179A21465P3736O3937q2000l1673j0127L3807M3374n601p2836k011j8092m0516
$$ 121465 195201 259138 177138 145465 135338 169145 212519 206918 134082 132071 113979 73463
167G3463k6366k5317J9502n196k2557J8366K7723j4241P7880j0564j9417m6494
$$ 73463 47097 21780 41282 36086 13529 31895 59618 45377 123257 112693 93276 46782
155D6782J8435K879N9500m3070N7764m2389k5169j531l5815Q585k2410j7055J6350
$$ 46782 65217 68096 127596 84526 142290 99901 74732 73201 37386 45971 23561 6506 22856
142B2856K734K0694l6143P5374m7271K1127M2245r063k7431l6600L0173l8726
$$ 22856 25590 46284 10141 85515 38244 59371 101616 92553 65122 28522 58695 19969
130A9969K8850k5874j2316K0645k0528J3190J0719j2206K558O202j8051L78K8019
$$ 19969 48819 22945 10629 31274 10746 23936 34655 22449 25007 31209 13158 13536 41555
117D1555J4898m099l7321L3647M6760o2555L3377l8454j3127M8452k6994k6481
$$ 41555 56453 52354 15033 48680 95440 32885 66262 27808 14681 63133 36139 9658
105I658R541K6753n003k7199J7022o860J5433r075k0913J059P874K156j1039K3159
$$ 9658 19199 45952 40949 13750 30772 23912 39345 30270 9357 10416 18290 20446 9407 32566
91C2566L7991j0026M3687n9926j7296m743K292J1841j4641j7984J0197K1892p341
$$ 32566 70557 60531 104218 44292 26996 22253 24545 36386 21745 3761 13958 35850 28509
78B8509o073P871N1414m9551j8109J808K4995j7279K8534j2353j4219r816r742
$$ 28509 22436 30307 81721 32170 14061 15869 40864 23585 52119 39766 25547 15731 5989
65E989L2590k0073j0581M4108k5006K8568k1009j6355m329o913K474R867J624
$$ 5989 38579 18506 7925 52033 27027 55595 34586 18231 13902 6989 9463 19330 20954
52B0954J4836j4011K5885j4230j4632k400K584Q587n796J0171j9185l339L8128
$$ 20954 35790 21779 47664 33434 18802 16402 18986 27573 21777 31948 12763 9424 47552
39D7552J4169J129m5303q509L1353L8556k0132n1387O988o468R160L641k384l401
$$ 47552 61721 62850 17547 9038 40391 78947 58815 7428 14416 7948 17108 20749 18365 14964
25A4964j3569M005L7586r831j1698R010J9003k6195L3773j7090k9514p5l782J3413
$$ 14964 1395 5400 42986 33155 21457 30467 49470 23275 57048 39958 10444 10369 6587 20000
11B0000K809K0972l781n408l2223J2481J7479P591j9202p320n651
$$ 20000 22809 43781 40000 34592 2369 14850 32329 39920 20718 13398 7747
0G747
$$ 7747
##PAGE= F1=2832.971510998
##FIRST=     9431.70368901288, 3501.40056022409, 27164
##DATA TABLE= (F2++(Y..Y)), PROFILE
1023B7164N286k6576J3707P155k5358Q299J0837J2808k8016J9376L660O5378n8551
$$ 27164 32450 5874 19581 26736 1378 9677 20514 33322 5306 24682 28342 93720 35169
1010C5169l603n223R319k0263O41K251j2869R542J583J3978P904k9581m8K1956
$$ 35169 31566 26343 35662 15399 16040 18291 5422 14964 16547 30525 38429 8848 8800 30756
996C0756K292j6696o939L2191j0298j6923J4601r643m466Q601K347j7513R205
$$ 30756 33048 16352 9413 41604 31306 14383 28984 19341 14875 23476 25823 8310 17515
983A7515L610j0653J9245Q4193m4348m4865J913j6391J9938j5027R718r700J9632
$$ 17515 21125 10472 29717 113910 69562 24697 26610 10219 30157 15130 24848 15148 34780
970C4780j5269L256J0964k6293R107M235J0446n338J9614j9832L3063l0254j7763
$$ 34780 19511 22767 33731 7438 16545 20780 31226 25888 45502 25670 58733 28479 10716
957A0716M060L4179l6196J7589r167J433J7204j4217k2375R891o871K0125R446
$$ 10716 14776 48955 12759 30348 21181 22614 39818 25601 3226 13117 6246 26371 35817
944C5817m009K232l2269R132Q461l187J372q86K4902K785l1483q868J3324n196
$$ 35817 31808 34040 1771 10903 19364 16177 17549 16663 41565 44350 12867 3999 17323 12127
930A2127p225J7086R902k4216L026K6446j1254j1124p416J6630K9413O285m3260
$$ 12127 4902 21988 31890 7674 10700 37146 25892 14768 7352 23982 53395 59680 16420
917A6420J4188L503j5731L9803l2597j0155K4969l9686L4637j0474K9857m3085
$$ 16420 30608 34111 18380 58183 25586 15431 40400 714 35351 24877 54734 11649
905A1649K4331j9814l934J2427j5217J0971N7534l9759j6643J7784n54M09k6555
$$ 11649 35980 16166 12232 24659 9442 20413 77947 38188 21545 39329 38775 39184 12629
892A2629J5501k3476N346L998J0924q296P154N1923n6340Q518q93J2110j9098
$$ 12629 28130 4654 10000 13998 24922 16626 23780 75703 19363 27881 26988 39098 20000
879B0000M992k2279L4573j7450R698Q595r59k6743n502P911K4985L6004l8415
$$ 20000 24992 2713 37286 19836 29534 38129 37170 10427 4925 12836 37821 73825 35410
866C5410n729k1102L6781p579J2017k5130j1120M030O185O73N204O1950K129q072
$$ 35410 29681 8579 45360 37781 49798 24668 13548 17578 23763 24436 29640 91590 93719 85647
852H5647q1039J5064o058K1510K462k920k3581O130K676Q54N4730n5870o615K046
$$ 85647 4608 19672 13614 35124 37586 34666 11085 17215 19891 20745 75475 19605 12990 15036
838A5036j0409J1521L3241j8412L4559K7771o9757j3648J1040m850N2253M515
$$ 15036 4627 16148 49389 30977 65536 93307 23550 9902 20942 16092 68345 72860
826G2860o2063L2832k0840J8260N870k5844o090J8543m869K1971k1971j2299j154
$$ 72860 10797 43629 22789 41049 46919 21075 14985 33528 28659 50630 28659 16360 15206
813A5206K7972K1102l7426J0296j9612J2745N0790m7718k2411M575K748j0238
$$ 15206 43178 64280 26854 37150 17538 30283 81073 33355 10944 15519 18267 8029
801H029L0446j9999K2910k1866P077J3666J4895k6033L863q091M3194l9294O250
$$ 8029 38475 18476 41386 19520 26597 40263 55158 29125 32988 24897 68091 28797 35047
788C5047L5767m916k3178k0305J1914N4573Q9396j2498J84996m8937j2729J1385
$$ 35047 70814 65898 42720 22415 34329 88902 178298 165800 350796 301859 289130 300515
776C00515j54079M6819n6429L6290P4895K3965m2922n8710p5782K9822J09380
$$ 300515 146436 193255 136826 173116 248011 271976 229054 170344 94562 124384 233764
765B33764j23917n5011K5461R601J04700j22507o1352K2440K3024j1038l9652
$$ 233764 109847 54836 80297 89898 194598 72091 10739 33179 56203 45165 5513
754E513K9117k1617J3098j4338j225R813p306P123q143J9329j0497m869m389R878
$$ 5513 34630 13013 26111 11773 10548 20361 13055 20178 12035 31364 20867 15998 11609 21487
740B1487J1778j4364J276K0538N0208k4535n4201R763r512K4342L074j4124l804
$$ 21487 33265 18901 20177 40715 90923 66388 12187 21950 12438 36780 39854 25730 21926
727B1926o350j460K1055j2632j7498K8957j7810J3240K723p132j0381L720o565
$$ 21926 15576 14116 35171 22539 5041 33998 16188 29428 32151 25019 14638 18358 11793
714A1793J6718j8301J6446q499j176N486j9307J4225J2090j5269J2233J8363j5012
$$ 11793 28511 10210 26656 18157 16981 22467 3160 17385 29475 14206 26439 44802 29790
701B9790J3159j9519O325k1886P26K4628j6205j2056k730J7915p549K0803j6519
$$ 29790 42949 23430 29755 7869 8595 33223 17018 4962 2232 20147 12598 33401 16882
688A6882p062R673m054K7018k2672K2640j8270J2029M4693k5179m0649J7691J8244
$$ 16882 9820 19493 15439 42457 19785 42425 24155 36184 80877 55698 15049 32740 50984
675E0984k4444n530J0782J2054j4494l860J5620k8909R8309m3932l3176j3471
$$ 50984 26540 21010 31792 43846 29352 25492 41112 12203 110512 66580 33404 19933
663A9933R5590l7705n4022L5834m1237K562M600L0807l4428j965J8403J8776m1539
$$ 19933 115523 77818 23796 59630 18393 20955 25555 56362 21934 19969 38372 57148 15609
650A5609J9706l2461J6585j0425J210J7912j2933N228o049j70J869j0671M7479
$$ 15609 35315 2854 19439 9014 10224 28136 15203 20431 14382 14212 16081 5410 52889
637E2889k1034k2143K7386Q80L7999l6864j0703j7765L846j2114J6236J2590j2639
$$ 52889 31855 9712 37098 37978 75977 39113 28410 10645 14491 2377 18613 31203 18564
624A8564L052r562P021n978K7328J26O9224n3902j5111j368N628J8374N0415J5987
$$ 18564 21616 12054 19075 13097 40425 40551 109775 55873 40762 39394 45022 63396 113811 129798
610A29798k5388l1854j1463L8451m4391L546k3915j055k143j6379J4112l399J340
$$ 129798 104410 72556 61093 99544 55153 58699 34784 33729 31586 15207 29319 25920 27260
597B7260L7343Q0284K22398J40616Q2120j30211l86838J59553L8253J38598L1550
$$ 27260 64603 144887 367285 507901 590021 459810 72972 232525 270778 409376 440926
586D40926J66218m4510k35678j51914p9399J5471l765O5933o5560J2263k6646
$$ 440926 607144 562634 326956 175042 95643 111114 107349 173282 107722 119985 93339
575I3339n8112K4277k3105P1941M3188j8961J5710j3726n0656k5384Q58k9112
$$ 93339 35227 59504 36399 108340 151528 132567 148277 134551 83895 58511 59369 30257
563C0257k152J2945L7532n2382J4565R317J9722L5094k1261j6084o361m2427K3903
$$ 30257 28105 41050 78582 26200 40765 50082 69804 104898 83637 67553 61192 18765 42668
550D2668J2809l2865J3900k5683n371O361L404K6878k10R692k5952K960N699p272
$$ 42668 55477 22612 36512 10829 5458 11819 15223 42101 41891 51583 25631 28591 34290 27018
536B7018L4689m5315J2365k2716O683J8660K085j2577Q189J0294j2173j2220O164
$$ 27018 61707 16392 28757 6041 12724 31384 33469 20892 29081 39375 27202 14982 21146
523B1146L2356k9462p731N040p23r555J3416L305j6847J1537o498m255j937Q0530
$$ 21146 53502 24040 16309 21349 20626 11071 24487 27792 10945 22482 15984 11729 9792 90322
509I0322n3507k0737j4752L0965k0281l459N1152k2981o990j4518J4548q504j6759
$$ 90322 36815 16078 1326 32291 12010 8551 59703 36722 29732 15214 29762 21258 4499
496D499R210o602K7419n517P456k1956P645j4001J6980j9542j833L1977q308J1840
$$ 4499 13709 7107 34526 29009 36465 14509 22154 8153 25133 5591 3758 35735 27427 39267
482C9267j9667j563P3564o8688n261q197N297K1467n528L82j2239q790m873L801
$$ 39267 19600 18037 91601 22913 17652 9455 14752 36219 30691 31073 18834 10044 5171 8972
468H972M730q673J2300J3798j8074r168K7033m584l302K6234l7414N5955k6230
$$ 8972 13702 5029 17329 31127 13053 3885 30918 26334 23032 49266 11852 67807 41577
455D1577j657k9334J052J9112n686j5175N034n58J1465n017o806J8305j9493l095
$$ 41577 39920 10586 11638 30750 25064 9889 14923 14365 25830 20813 14007 32312 12819 9724
441I724K7132J879k4070K5721K2004n386k0575j8658p007J0420j3306J0853Q615
$$ 9724 36856 38735 14665 40386 62390 57004 36429 17771 10764 21184 7878 18731 27346
428B7346J9348k7333j3687J4401l909r047L3580L304k1605J213J3835J5649m3110
$$ 27346 46694 19361 5674 20075 16166 7119 40699 44003 22398 23611 37446 53095 9985
415I985L0693k6633P028j1530n666L719j643K1870M087K969j0851K4489k6212
$$ 9985 40678 14045 21073 9543 3877 7596 5953 27823 31910 34879 24028 48517 22305
402B2305L1442k7375N554j3477K7243k5500l325J3857j5667r156L2941j5771K783
$$ 22305 53747 26372 31926 18449 45692 20192 16867 30724 15057 5901 38842 23071 25854
389B5854K478L095k8097J4170o284J6174r192j4027M8489j2048m162O955L33n066
$$ 25854 28332 31427 3330 17500 11216 27390 18198 4171 52660 40612 36450 43405 43738 38672
375C8672J4614l8627L5315k3053j6596M7634m4305J7155j2864r941J3284J5801
$$ 38672 53286 14659 49974 26921 10325 57959 13654 30809 17945 8004 21288 37089
363C7089l460k8453M562J6150L716o352j363k823L6409q261o453k5554K632n852
$$ 37089 33629 5176 9738 25888 29604 23252 21889 19066 55475 47214 40761 15207 17839 11987
349A1987J02145j02934Q9295q6603J2879n067j2937L8118l6991J7091j0494J4419
$$ 11987 114132 11198 100493 13890 26769 21702 8765 46883 9892 26983 16489 30908
337C0908J2874l1114K3384J0227l1784K3496J8497q563j6758j0037k706l346J5198
$$ 30908 43782 12668 36052 46279 14495 37991 56488 47925 31167 21130 18424 15078 30276
324C0276M2321k7826J1361Q2950J5192K7978K7860j1813P2158M0206l4164l7019
$$ 30276 72597 44771 56132 139082 154274 182252 210112 198299 270457 310663 276499 239480
312B39480j1178j82070k1882K6373J34343J2056L4882K0846Q3669J40616j67041
$$ 239480 228302 46232 24350 50723 185066 197122 232004 252850 336519 477135 310094
301C10094N1982J04869M4294o8648J3185J1140j63329j72950R2641K74024m2117
$$ 310094 362076 466945 511239 442591 455776 466916 303587 130637 223278 497302 455185
290D55185K14038Q39756O50341N85599R4900q88628p2773r47336m88864j99676
$$ 455185 669223 1508979 2159320 2744919 2839819 1951191 1878418 931082 442218 242542
280B42542J16411M90678J95342K26605j87303R00751P23824M50294N62971K60803
$$ 242542 358953 849631 1044973 1271578 1084275 1985026 2708850 3159144 3722115 3982918
270C982918n41789J35420J462673R70099N88103k49157l088162J488494K488727
$$ 3982918 3441129 3576549 5039222 6009321 6597424 6348267 3260105 4748599 7237326
261G237326j97109P38151K32592K7498r38738k264963k257624q10417j34189j00623
$$ 7237326 7040217 7778368 8010960 8038458 7099720 4834757 2577133 1766716 1632527 1531904
251A531904n3678Q5554N5057j94014j68892k91742k40603n05522J02028j56548
$$ 1531904 1478226 1563780 1618837 1424823 1255931 964189 723586 218064 320092 163544
241A63544p1562J30440m4394O5698q2817L0746J339k2130k3366n755P9955o2996
$$ 163544 91982 222422 178028 243726 160909 191655 192994 170864 147498 141743 221698 158702
229A58702q9206M303J23289K07964J76244K00115N2833Q5347J08268p8211l87590
$$ 158702 69496 73799 197088 405052 581296 781411 834244 919591 1027859 949648 562058
218E62058j77206j11450o5500n4534O1438K616813J9469226L4839613L8672715
$$ 562058 384852 273402 207902 153368 214806 2831619 22300845 57140458 95813173
209I5813173O5898602N4364620L1114401J6827659q530645m7592042n2183305
$$ 95813173 161711775 216076395 247190796 264018455 255487810 207895768 155712463
202A55712463m7994437n7471588k3459481j4912005j0453095j285475K99538J3222
$$ 155712463 107718026 50246438 26786957 11874952 1421857 136382 435920 449142
194D49142l455k4423l0023j54567J9906P6477K5855M0273N7475j9436l2708j53911
$$ 449142 445687 421264 391241 236674 256580 333057 358912 399185 456660 437224 404516 250605
182B50605j08084n5823L1483P1497O4141q5320k7041q861M0455M8188o329p6232
$$ 250605 142521 86698 118181 189678 253819 168499 141458 132597 173052 221240 214911 138679
170A38679M950j8429l9924l2723k4443R581P422k5968J4215K9660j6779P8118
$$ 138679 143629 125200 85276 52553 28110 37691 45113 19145 33360 63020 46241 124359
158A24359j1837k1199m6898K1875Q81O9008m8166N4462l7795k1209r045l4831
$$ 124359 112522 91323 44425 66300 67181 136189 88023 142485 104690 83481 74436 39605
146C9605Q048k2073j6315J3389M196K1426l4371P5773n1217K0924M2223j1025
$$ 39605 47653 25580 9265 22654 26850 48276 13905 89678 38461 59385 101608 90583
134I0583l2269l3292K2943l1254K7544k0511j4624K0010j8547J2882J1422j3202
$$ 90583 58314 25022 47965 16711 44255 23744 9120 29130 10583 23465 34887 21685
122B1685L855N047j6153J465K5119J3314m400l5015L2751M1950n6585K8918l3863
$$ 21685 25540 30587 14434 15899 41018 54332 49932 14917 47668 89618 33033 61951 28088
109B8088j3883N4334l3653k3740J0066K4892j0025k2266J7329o981J6762j0421
$$ 28088 14205 68539 34886 11146 21212 46104 36079 13813 31142 24161 40923 30502
97C0502k0923N51R134M445j4178K3332L8652o373L7882o0446j6474m285J584R125
$$ 30502 9579 10130 19264 23709 9531 32863 71515 65142 103024 42578 26104 21819 23403 32528
83C2528j1062j6520Q660K1482p236m561Q373N2010n1907j9366L434K5552k0563
$$ 32528 21466 4946 13606 35088 27852 23291 31664 83674 31767 12401 15835 41387 20824
70B0824L7537j4396j7926j0765p472K9585j8839j0495M1000k0431K5234k1033
$$ 20824 58361 43965 26039 15274 7802 37387 18548 8053 49053 28622 53856 32823
58C2823j3854n559n982K475R360M385J1053j1410K1421j2259j7057P2M040Q362
$$ 32823 18969 13410 7428 9903 19263 23648 34701 23291 44712 32453 15396 15468 19508 27870
44B7870p038Q054j8356j435L7360J5957m398l9801p193L2716M1331k0419n6777
$$ 27870 20832 28886 10530 9095 46455 62412 58014 18213 11020 43736 85067 64648 7871
31G871P923o954P168N292n903j730j3515N313L9066j2498j3296J1936K3001k9916
$$ 7871 15794 8840 16008 21300 15397 13667 152 5465 44531 32033 18737 30673 53674 23758
17B3758L2530j1757l3769p04m000J2974M533K4277m510p609l4042J1934J7300
$$ 23758 56288 44531 10762 10058 6058 19032 23565 47842 43332 35723 1681 13615 30915
4C0915Q065j8158r211m809
$$ 30915 38980 20822 11611 6802
0F802
$$ 6802
##PAGE= F1=2823.137334876
##FIRST=     9431.70368901288, 3501.40056022409, 28331
##DATA TABLE= (F2++(Y..Y)), PROFILE
1023B8331M801k8277J4253Q360k5558O994J2435J1895k7735J9133k016O6015n2049
$$ 28331 33132 4855 19108 27468 1910 8904 21339 33234 5499 24632 22616 88631 36582
1010C6582n656l847P543k0340K305R99j2847Q899L559J8338K987l0933J42K2081
$$ 36582 30926 27079 34622 14282 16587 17586 4739 13638 17197 35535 38522 7589 7731 29812
996B9812j359j2648m519L1016q983j9683J5180r208n174Q703L253j7753Q432L633
$$ 29812 28453 15805 11286 42302 33319 13636 28816 19608 14434 23137 26390 8637 17069 20702
982B0702r270J8431Q0612m0071m4553k5j4624J7750j4322R947r601J9205j5184
$$ 20702 11432 29863 110475 70404 25851 25826 11202 28952 14630 24577 14976 34181 18997
969A8997M135J2905k7426Q174P188R021p857J6034j6100L1476k7868j9060M310
$$ 18997 23132 36037 8611 16785 23973 32994 25137 41171 25071 56547 28679 9619 13929
956A3929L6632l6603J4923r022K813J7030j5686k0749J1268q970K2788Q627m35
$$ 13929 50561 13958 28881 19859 22672 39702 24016 3267 14535 5565 28353 36980 36545
943C6545l775l2083R148J0573n729K769r05K2162M415l0983q368J3781o087o873
$$ 36545 32770 687 9835 20408 14679 17448 16543 38705 43120 12137 3769 17550 11463 4590
929D590J7435R429k4326L094K8393j2263j1424p616J5998K8954Q363m5384J5412
$$ 4590 22025 31454 7128 10222 38615 26352 14928 7312 23310 52264 60627 15243 30655
916C0655N416j7312M2025l3685j0579K4354m0308L5559j0319K7155m0651K4910
$$ 30655 36071 18759 60784 27099 16520 40874 566 36125 25806 52961 12310 37220
904C7220k1242m074J0417j2945J1511N3975m0947j2447J5321J325J560k6422J4487
$$ 37220 15978 11904 22321 9376 20887 74862 33915 21468 36789 38114 39674 13252 27739
891B7739k2936N958M052J0465q780N936N2534n5431O990M61J0866j8237N101k1786
$$ 27739 4803 10761 14813 25278 16498 22434 74968 19537 26527 26988 37854 19617 24718 2932
877B932K9936j3969J4826O710k078k8060o151Q766K8481L1810l8194l974k0245
$$ 2932 32868 18899 33725 40435 38357 10297 4146 12912 41393 73203 35009 31035 10790
864A0790L5198p515J4975l0008j1076N934L351J219J0205N6537n28m251q0271
$$ 10790 45988 38473 53448 23440 12364 18298 21649 22868 33073 89610 89082 84831 4560
851D560J4354o046K4232L163m016k5221O170M231j91N6581o0419o224L426r463
$$ 4560 18914 12868 37100 40263 36247 11026 17196 21427 21236 77817 17398 11174 14600 5137
837E137J1366K9311k0539L9192L1266o9961j7235J3777p109N1162Q001o3433L2301
$$ 5137 16503 45814 25275 64467 95733 25772 8537 22314 15205 66367 74368 10935 43236
824D3236k0665K0336N471k7737n650J9102m265J6248j7651j1401l085L0737K0444
$$ 43236 22571 42907 48378 20641 14991 34093 29828 46076 28425 17024 13939 44676 65120
811F5120m5285J6133j8493J3373N2362n0445k2767l75Q893o831K6130j8851K1153
$$ 65120 19835 35968 17475 30848 83210 32765 9998 9623 18516 11685 37815 18964 40117
798D0117k1931O977J4852J4314k6032J381p160M3416l4623M84L3130L97k4492
$$ 40117 18186 25163 40015 54329 28297 29678 22518 65934 31311 31795 64925 65322 40830
785D0830k0784J0186N8517Q2731M198J70930l8522k2728L764j50692N2675n4653
$$ 40830 20046 30232 88749 171480 175678 346608 308086 285358 289122 138430 191105 136452
773A36452K3945P4440K9839l8545n2478p3415L3701R5484j16667n7026K7903P512
$$ 136452 160397 234837 264676 226131 173653 100238 133939 229423 112756 55730 83633 91145
761I1145J02782j22384o2026K1372K2814r826l9235K7277j8516J3039j4637j292
$$ 91145 193927 71543 9517 30889 53703 43877 4642 31919 13403 26442 11805 10513
749A0513R914p121M464m600J4384q843l491l441O284J2641j2748K434J9637N2181
$$ 10513 20427 13306 17770 13170 27554 18711 15220 11779 18063 30704 17956 20390 40027 92208
735I2208k5165n4494Q611q826K0715K568q779n137o724j132K0742j3320j7063
$$ 92208 67043 12549 21160 12334 33049 35617 26838 21701 14977 13845 34587 21267 4204
722D204L0153j8913J2862K316o868j0067M213o347J5570j5699J4715j0244j161
$$ 4204 34357 15444 28306 30622 23754 13687 17900 11553 27123 11424 26139 15895 14734
709A4734Q848k1435J4800J2790j5076J3025J6990j3542J4979k3609P387k1784
$$ 14734 23582 2147 16947 29737 14661 27686 44676 31134 46113 22504 29891 8107
697H107j395L1400k0744j2087l496J6989m119K0055j8493p050R155k907K6382
$$ 8107 6712 38112 17368 5281 1785 18774 14655 34710 16217 9167 18322 15415 41797
684D1797k2349K5305j9388J1278M1207k0391m1991J7022J7054k4952l771J0440
$$ 41797 19448 44753 25365 36643 77850 57459 15468 32490 49544 24592 20821 31261
672C1261J0087j1315n06J5666l3404R4482m0392l1836j5282Q8622l1848n1910
$$ 31261 41348 30033 29527 45193 11789 106271 65879 34043 18761 107383 75535 23625
660B3625L6883m1739K80N780L5110l5309j469J1905J9011l8755J9207l2453J7636
$$ 23625 60508 18769 19049 24829 59939 24630 23161 35066 54077 15322 34529 2076 19712
647A9712j1200J330J8489j5189O409n102L60L167j3457M9970k0834k3497K7568
$$ 19712 8512 9842 28331 13142 19551 14449 14809 17976 4519 54489 33655 10158 37726
634C7726j727M3311l7401j2006j8617L487p857J4134Q899j0661J238q969O146
$$ 37726 35999 79310 41909 29903 11286 14773 6916 21050 29949 19288 20526 11557 17703
621A7703p582K9300j945O5888n3902r917k95N895J4691N1153J4814k2904l3942
$$ 17703 10121 39421 37476 103364 49462 39545 39250 45145 59836 110989 125803 102899 68957
608F8957q632L6198m3288P382k5404J3j331j7830J3322k306J688M1625Q9349K49914
$$ 68957 60325 96523 53235 60617 35213 35226 33895 16065 29387 27081 28769 70394 159743 409657
594D09657Q6044O4027j24104k97252J04511L9485Q7954M2674J44614k8483k22517
$$ 409657 495701 559728 435624 138372 242883 282368 370322 412996 557610 529127 306610
583C06610j35555p4038K1984j0398N5759o1813J2920k5270n6665K5456k6112P0208
$$ 306610 171055 97017 119001 108603 164362 102549 115469 90199 33534 58990 32878 103086
571A03086M4182j7304J8053j6371n0926k3752k387k7755J77J2276L6400n1197
$$ 103086 147268 129964 148017 131646 80720 56968 54581 26826 27003 39279 75679 24482
559B4482J7403O998K0005L2518j8062k1185k280m1574K2228R876k8822J5117k8838
$$ 24482 41885 48883 68888 101406 83344 62159 59879 18305 40533 50409 21587 36704 7866
546G866k634P165M021K5617n175J1894k4570L966O032n493L3974m2158M652j9989
$$ 7866 5232 12397 16418 42035 36860 48754 24184 28150 34182 28689 62663 20505 25157 5168
532E168Q428J9127J279j6665J3105J2812j9237q241L979L4269k9191q292N900
$$ 5168 13596 32723 34002 17337 30442 43254 24017 15776 19755 54024 24833 16541 22441
519B2441K13j0088J2826L300j7752J0910p664l128M71P7441n3383k0050j3771
$$ 22441 22654 12566 25392 28692 10940 21850 14186 11058 11529 88970 35587 15537 1766
506A766L4068k2948n724N4750k6040p019j1892J3685j1395j3080P664o675K6631
$$ 1766 35834 12886 7162 61912 35872 28853 16961 30646 19251 6171 13835 7160 33791
493C3791l125N713k2498R607j1018J4352k1744q62L2659r673J4838j9184k785
$$ 33791 30666 36379 13881 23488 12470 26822 5078 4216 36875 27202 42040 22856 20071
480B0071P1697o8971n100p929N386K0654m448p0j1132r026o203L964N702r798
$$ 20071 91768 22797 17697 9768 15154 35808 31360 31290 20158 11132 4929 8893 14595 4797
466D797J1840J3950j8259p321K6368k030o813K1547l1801N3456k4404J162l1158
$$ 4797 16637 30587 12328 5007 31375 29345 22532 44079 12278 65734 41330 42492 11334
453A1334N94K0360n957j7081N884j545J3945o078o993J9682k1584k065K5885O075
$$ 11334 11928 32288 26331 9250 15134 13589 27534 21456 14463 34145 12561 10496 36381 42456
439D2456k7548K4761J9100k300k2654j6316n687Q393j2166J0573P493J9494k4441
$$ 42456 14908 39669 58769 56469 33815 17499 11812 20205 8039 18612 26105 45599 21158
426B1158j5082J3469k136r471K9948L913j8810J210J2929J6342m2704K8736k6967
$$ 21158 6076 19545 17409 7938 37886 41799 22989 24199 37128 53470 10766 39502 12535
413A2535O432q936p259M776j054K3513O506K263j5649K3905k3788K8377k9526
$$ 12535 18967 10031 2772 7548 6494 30007 36513 38776 23127 47032 23244 51621 22095
400B2095M127q149K7369k4406l835J3852j5576q497L3988j6952J611J518M847
$$ 22095 26222 18073 45442 21036 17201 31053 15477 6980 40968 24016 25627 27145 31992
387C1992k7684J3822o660J5589p209j4413M9593j3810k712M627O232j3067K1902
$$ 31992 4308 18130 11470 27059 19850 5437 55030 41220 38508 43135 49367 36300 58202
374E8202m4069L8308k5651j6565M7687m3720J6471j2015j0562J2999J4738m271
$$ 58202 14133 52441 26790 10225 57912 14192 30663 18648 8086 21085 35823 31552
362C1552k7574N626J6657J150l574j793m311L8121l667j0286k6055j9k633J02991
$$ 31552 3978 9604 26261 27411 23837 22044 17733 55854 52187 41901 15846 15827 13194 116185
348A16185j06132Q5918q2228J2113n765r788L5604l6555J9081j3399J6979J4093
$$ 116185 10053 95971 13743 25856 20091 10303 45907 9352 28433 15034 32013 46106
336D6106l2911K5926J7103l8578J8719K1940p918j7415j2294m776J408J1538M9003
$$ 46106 13195 39121 56224 17646 36365 58305 50387 32972 20678 15902 17310 28848 77851
323G7851l3911J3042R0938P070K5384K5840j2796P5005M3930l4350m0304j1160
$$ 77851 43940 56982 147920 154990 180374 206214 193418 268423 312353 278003 237699 226539
311B26539j80926k0494K4163J29996K151L6204K0514R0300J76488j87891P1490
$$ 226539 45613 25119 49282 179278 181429 217633 238147 328447 504935 317044 388534
300C88534J06580L9789p1164L1972J1470j62503j76575N7147K65697k7284J56052
$$ 388534 495114 534903 463739 495711 507181 344678 168103 225250 490947 463663 619715
289F19715Q28736O12065N52282J84168r63120m7883q81331m59005k10515J24307
$$ 619715 1448451 2060516 2612798 2796966 1833846 1785963 904632 445627 235112 359419
279C59419N02054K14419K09565j95543R26548P31317M70479O40675K60992p55961
$$ 359419 861473 1075892 1285457 1089914 2016462 2747779 3218258 3858933 4119925 3363964
269C363964J63560J315233Q69898N50549j20180l096713J771459K793198o0829
$$ 3363964 3527524 4842757 5712655 6263204 6143024 3046311 4817770 7610968 7550139
260G550139P54787J23520o8644j033846k400302k327501p68714q3774n3893p0355
$$ 7550139 8304926 8428446 8359802 7325956 4925654 2598153 1829439 1745665 1691772 1621417
250A621417J13487M4449k38839j92200l46998k80141n17780J00906j55297o2529
$$ 1621417 1734904 1779353 1540514 1348314 1001316 721175 203395 304301 149004 86475
240H6475J39992m1557O1714r3705L9844J1320k7280k1635p519P4360o2504r0443
$$ 86475 226467 184910 246624 152919 192763 204083 176803 155168 147649 222009 159505 69062
228F9062k0007J19589K10057J74716K13088O0099Q5889J06266p0747l64289j81218
$$ 69062 49055 168644 378701 553417 766505 826604 912493 1018759 948012 583723 402505
217D02505j16482n3447o0656L3082K629813J9789526L4798426L7873140O4856615
$$ 402505 286023 232576 171920 205002 2834815 22624341 57422767 95295907 160152522
208A60152522N3089699L1132979J6927396q013714m6888492n1405953m7197046
$$ 160152522 213242221 244375200 261302596 253288882 206400390 154994437 107797391
201A07797391n7408082k3406753j4853263j0759391j227443K89824K0812n45j8528
$$ 107797391 50389309 26982556 12129293 1369902 142459 432283 453095 452550 434022
192D34022m8431j50093O013P5842K3521L9912N5262j6904k5891j45677j05490
$$ 434022 385591 235498 241511 317353 340874 380786 436048 419144 393253 247576 142086
181A42086n7323L0082O8231O2932q7033k2436p240M6922N3264o583p9605J2310
$$ 142086 84763 114845 183076 246008 158975 136539 129299 176221 229485 222902 143297 155607
169A55607j8050l8731l6981k5531k168K1087l0117R825L1460j9501P8232j3284
$$ 155607 137557 98826 61845 36314 34146 55233 25116 34941 66401 46900 125132 111848
157A11848k3034m6901K5622j278P9045n3507N0070l2580j6586j7474l3836P533
$$ 111848 88814 41913 67535 66257 145302 91795 141865 109285 92699 75225 41389 48922
145D8922k1423j5468J0694N292K2622l2960P5773n4797K0788M1421j3601l5808
$$ 48922 27499 12031 22725 28017 50639 17679 93452 38655 59443 100864 87263 51455
133E1455k9324J6700k4969K6590j5266j7572J9354j6511J2389J1919j4044N298
$$ 51455 22131 38831 13862 40452 25186 7614 26968 10457 22846 34765 20721 26019
121B6019L668j3355K033K2142J1522m458l2820L2095L6291m9506K3834k9012j3974
$$ 26019 29687 16332 18365 40507 52029 47571 14751 46846 83137 33631 57465 28453 14479
108A4479N9742m0580k1056J0485K3026j4654j7595J7698p199J7900j1498k0699
$$ 14479 74221 33641 12585 23070 46096 31442 13847 31545 24346 42246 30748 10049
96A0049j08J0338O316j6274K2848L8637k540L1221o0062j5185l820M22O550p288
$$ 10049 9941 20279 26595 10321 33169 71806 69266 100487 40425 25240 21420 21842 28392 21104
82B1104j4887P006K1154p098l028Q579N2457n4079k0054M584K5752k3574M6193
$$ 21104 6217 13223 34377 27279 24251 32830 85287 31208 11154 15738 41490 17916 64109
69F4109j6407k1415j1394n331K6129j7151j0146L7191j5324K1796k1036j1380
$$ 64109 47702 26287 14893 9562 35691 18540 8394 45585 30261 52057 31021 19641
57A9641o788m945K696Q852O823P352q946J7428j0334j9603K426N318Q070q129
$$ 19641 12853 7908 10604 19456 26279 33631 24685 42113 31779 12176 14602 19920 27990 19861
43A9861N994j7519M27L6371J7438r863l3873n441L3735M3946k0596o2222R332
$$ 19861 25855 8336 8763 45134 62572 52709 18836 13395 47130 91076 70480 8258 17590
30A7590p590M909P054j0098N71j1428N818L9162j5201j4612J4657K6938l3600
$$ 17590 10000 14909 21963 11865 12436 1008 6826 45988 30787 16175 30832 57770 24170
17B4170L0974o294l7775p90m710J2477O114K7848n434r880l5696J1287J7161Q589
$$ 24170 55144 48850 11075 10285 5575 18052 24166 52014 46580 36700 1004 12291 29452 38041
3C8041j7126j0993m100
$$ 38041 20915 9922 5822
0E822
$$ 5822
##PAGE= F1=2813.303158754
##FIRST=     9431.70368901288, 3501.40056022409, 29392
##DATA TABLE= (F2++(Y..Y)), PROFILE
1023B9392M275k9523J4360R544k5351N538J3851J0550k6867J8853p975O6243m4783
$$ 29392 33667 4144 18504 28048 2697 8235 22086 32636 5769 24622 16647 82890 38107
1010C8107p792k422N586k0308M166k76j2611Q041N419K2559j877l2311M34K1897
$$ 38107 30315 27893 33479 13171 17337 17061 4450 12491 17910 40469 38592 6281 6715 28612
996B8612n056p450l041K9890p456k2411J5415q759n802Q756M127j7478P158L685
$$ 28612 23556 16106 13065 42955 35499 13088 28503 19744 13942 22698 26825 9347 16505 20190
982B0190p812J7497P5952l5101m3763j957j2752J5464j3626J0116r531J8818j4988
$$ 20190 12378 29875 105827 70726 26963 25006 12254 27718 14092 24208 14677 33495 18507
969A8507M931J4963k8303O941R911P507j0166J2646j2591K9784k5245k0374N274
$$ 18507 23438 38401 10098 17039 26950 34457 24291 36937 24346 54130 28885 8511 13785
956A3785L8220l6737J2017q634M130J6687j6911j9006J2457j0908K5198P611M438
$$ 13785 52005 15268 27285 18651 22781 39468 22557 3551 16008 5100 30298 37909 42347
943D2347j0771l0411P639J2987q525M022p23J9444N547l0130p599J3923p048o559
$$ 42347 31576 1165 8804 21791 13266 17288 16565 36009 41556 11426 3827 17750 10702 4143
929D143J7952R021k4490L111K9806j2868j1621p243J5256K7853J0512m7343J6446
$$ 4143 22095 31116 6626 9737 39543 26675 15054 7811 23067 50920 61432 14089 30535
916C0535P122j8461M3664l4446j1127K3774m0153L5804j0064K4582l8325K5619
$$ 30535 37657 19196 62860 28414 17287 41061 908 36712 26648 51230 12905 38524
904C8524k2686m283Q260j0566J1988N0215m1941q145J3183K916K618k5895J2901
$$ 38524 15838 11555 19815 9249 21237 71452 29511 21366 34549 37465 40083 14188 27089
891B7089k1993O653L753R993r070N397N2126n4264N575J747J0005j7523M874j9549
$$ 27089 5096 11749 15502 25495 16425 21822 73948 19684 25259 27006 37011 19488 24362 4813
877D813K3794j0479K0664L859l091k9344o718R633L2331K6564l7572k042j9459
$$ 4813 28607 18128 38792 42651 39560 10216 3498 13131 45462 72026 34454 32412 12953
864A2953L3456p292J7558l4585j0915P910N26K780J4851M9651l208p59p8421J3691
$$ 12953 46409 39117 56675 22090 11175 19085 19611 22391 37242 86893 83685 82926 4505 18196
850A8196o001K6687L804n172k6548O167N853j088N7703o3908n773M191q211J0902
$$ 18196 12195 38882 42686 37514 10966 17133 22986 21898 79601 15693 9920 14111 5900 16802
836A6802K4737k1567M3152L4324o9021k0326J5392r161M9321J1478o3975L1495
$$ 16802 41539 19972 63124 97448 28427 8101 23493 14332 63653 75131 11156 42651
824D2651k0307K2541N136k9588n351K0073m038J0691j3700j0502m554L3357J9392
$$ 42651 22344 44885 50021 20433 15082 35155 31117 41808 28108 17606 13052 46409 65801
811F5801n2074K0850j7208J3976N3309n2516k3069m255J3989l548K1987j7897
$$ 65801 13727 34577 17369 31345 84654 32138 9069 4814 18803 15255 37242 19345
799A9345J9652k2274O900J6335J3390k6010o10o527M3393k9752n427L0978N460
$$ 19345 38997 16723 23623 39958 53348 27338 26728 20201 63594 33842 28415 59393 64853
786F4853k4648k2092Q062O2202P6393K0855J53290k6881l1033m439j47273N9095
$$ 64853 40205 18113 26175 88377 164770 185625 338915 312034 281001 276562 129289 188384
774A88384n2828J1426P3152L5159l3600m6179p0118L7633Q0200j07509n9389L0383
$$ 188384 135556 146982 220134 255293 221693 175514 105396 143029 223229 115720 56331 86714
762H6714M527R9726j20249o2063J9898K2459q593l7499K4789j5884J2902j5091
$$ 86714 91241 190967 70718 8655 28553 51012 42419 4920 29709 13825 26727 11636
750A1636j115R900o872J824j081R993p575k193k526K295J4969j2179L676J8474
$$ 11636 10521 20421 13549 15373 14292 24285 16710 14517 11991 14286 29255 17076 20752 39226
736C9226N3717k5241n4696P291q047J7117K645m058o348p253q13K0485j3423j6627
$$ 39226 92943 67702 13006 20297 12250 29367 32012 27954 21606 14353 13540 34025 20602 3975
722C975L0550j9841J2300K237o736r769M763o123J4713j2751J2335j1087j764
$$ 3975 34525 14684 26984 29221 22485 12716 17479 11356 26069 13318 25653 14566 12802
709A2802J1758k3140J5244J3634j4767J3435J5288j1762J6567k7513Q301k1312
$$ 12802 24560 1420 16664 30298 15531 28966 44254 32492 49059 21546 29847 8535
697H535K728L2334k5527j2016m055J5318o49J9116k0195p065Q635j599K5451k2071
$$ 8535 11263 43597 18070 6054 1999 17317 16668 35784 15589 8524 17159 15560 41011 18940
683A8940K8083k0234J0296L7250j5126m3349J6229J5654k5366j678R980Q148q001
$$ 18940 47023 26789 37085 74335 59209 15860 32089 47743 22377 20699 30679 38827 30826
670C0826K871J5555l7099Q8911l6922k9544j6869Q0929k6055m9224L7434m1699
$$ 30826 33697 49252 12153 101064 64142 34598 17729 98658 72603 23379 60813 19114
658A9114k027O997L8975l5510j430N456J8972l5315J8350l1010J7400j1968J447
$$ 19114 17087 24084 63059 27549 26119 31575 50547 15232 33582 2572 19972 8004 9451
645I451J9533j6487O172m254Q24M426j6088N2165k0312k4794K8253n106M8395
$$ 9451 28984 12497 18669 14415 15239 19665 3577 55742 35430 10636 38889 33783 82178
632H2178l7149j3139j9727L359k162J0514M738q647m27q237M747q492L0815l846
$$ 82178 45029 31890 12163 15522 13360 23874 28612 19965 19538 11301 16048 7556 38371 34525
618C4525O1890n3375m707O76N931J0998N2545J3367k0235l6190n260L3943m1548
$$ 34525 96415 43040 38333 39009 44940 55938 108483 121850 101615 65425 60165 94108 52560
605E2560J0787k7420R59n33j9295J2359j127J948M6368J03278K81894L0520M1339
$$ 52560 63347 35927 36886 36353 17058 29417 28290 30238 76606 179884 461778 492298 533637
592E33637j20219k14433Q0219L3246M6588N8095J05571j5782k16215j23559o9040
$$ 533637 413418 198985 279204 312450 359038 417133 522704 506922 290707 167148 98108
581I8108K9029j6680M5057n7937J3268k4202n4963K6317k8623O8671M4942j5406
$$ 98108 127137 110457 155514 97577 110845 86643 31680 57997 29374 98045 142987 127581
569A27581K0149j9074n1172k2172n520k6323K947J1147L4604m9006J9575M613
$$ 127581 147730 128656 77484 55312 49792 23469 26416 37563 72167 23161 42736 47349
557D7349K0399K9311j4478k6011J879m0523K0563O525k4522J6329l2083L02Q067
$$ 47349 67748 97059 82581 56570 58449 17926 38489 45014 20492 36821 4738 5040 13107
544A3107M457K4035r936J4233k2704M573O300l724L2815l8123l375j7049R683
$$ 13107 17564 41599 31663 45896 23192 27765 34065 30341 63156 25033 21658 4609 14292
531A4292J9660M50k0374J7845J6121k5917n598K041L5727k8620q916O686J436
$$ 14292 33952 34402 14028 31873 47994 22077 16479 18520 54247 25627 16711 23397 24833
518B4833j0823J2284L316j8685J0339q405k407K922P3306n2378j9146j0373L4233
$$ 24833 14010 26294 29610 10925 21264 12859 10452 13374 86680 34302 15156 4783 39016
505C9016k5051q264N8237k8957p044r505J3232j4513r196O013o591K5786o04L677
$$ 39016 13965 5701 63938 34981 27937 18432 31664 17151 7955 13968 7377 33163 32559 36236
491C6236k2986J1811o576J0070k3943KL3302j0863J7648j8440m167O9899o9066
$$ 36236 13250 25061 18485 28555 4612 4614 37916 27053 44701 26261 22094 91993 22927
478B2927n170p671N701J9353l505k28r749r522p394M037O644j0501J1206J3910
$$ 22927 17757 10086 15787 35140 31635 31407 21658 12136 4742 8779 15423 4922 16128 30038
464C0038j8441n326K5456M21r992J7116k6661N0704k2473M196l2865l5K1871o385
$$ 30038 11597 6271 31727 32148 22156 39272 12611 63315 40842 45038 12173 12138 34009 27624
450B7624j9022O587k445J6720p334o989K0996k3859r36K4651R731l0689K3863
$$ 27624 8602 15189 12744 29464 22130 15141 36137 12278 11342 35993 45724 15035 38898
437C8898J6349L73k4511j3808m192O144j1051J0349O727J9230k1104j6872J2536
$$ 38898 55247 55620 31109 17301 13109 19253 8202 18551 25278 44508 23404 6532 19068
424A9068l73r935K6482M681j6473R44J2486J6588m1795K6306k6205N062o118q813
$$ 19068 18695 8760 35242 39923 23450 24394 36880 53468 11673 37979 11774 16836 10718 1905
410A905N573m57K4953R336J746k0781K3425k1454K5160l1024L057l761K7266k3093
$$ 1905 7478 7021 31974 41310 43056 22275 45700 24246 49406 18382 21439 17678 44944 21851
396B1851m502J3815j5334p436L4420j7775M33N45O263k6701J3088o535J4286m999
$$ 21851 17349 31164 15830 8394 42814 25039 25472 26017 32280 5579 18667 12132 26418 21419
382B1419j4918N0807j5554j246K087J2221k0972K9451m9698M0988k8071j6418
$$ 21419 6501 57308 41754 40508 42595 54816 33844 63295 13597 54585 26514 10096
370A0096M7469m2789J5459j0808j1290J2868J3231m920k6535O926J6941r73j226
$$ 10096 57565 14776 30235 19427 8137 21005 34236 29316 2781 9707 26648 25675 24449
357B4449k280n652L9548J566j4677k6346k776N14J02688j08095Q1170p6536J1303
$$ 24449 22169 16517 56065 57631 42954 16608 13832 14346 117034 8939 90109 13573 24876
344B4876o383o651L2920l5945K0607j5831J9388J5285l4570K8176K3929m4172
$$ 24876 18493 11842 44762 8817 29424 13593 32981 48266 13696 41872 65801 21629
332B1629J3130K5074p189j7815j4462p049O165P974N4847l9252J4646R8729j116
$$ 21629 34759 59833 52644 34829 20367 13318 19483 27457 82304 43052 57698 156427 155311
319A55311K2502K3871j3744P7696M7849l5037m3320j1132j78903j9293K1899J25104
$$ 155311 177813 201684 187940 265636 313485 278448 235128 223996 45093 25800 47699 172803
307A72803o898L6564J9666R6943K10328k06013Q6051J04438L3681p5685M2646
$$ 172803 165905 202469 222135 319078 529406 323393 409444 513882 547563 471878 514524
296E14524R278j59236j70468L7127K51334j2248J00200P92470N67389N09539K65144
$$ 514524 523802 364566 194098 231225 482559 470311 570511 1362981 1930370 2439909 2705053
285B705053j015036k4604q00716m19880k18094J29612N03291K30756J89957j98345
$$ 2705053 1690017 1665413 864697 444817 226723 356335 859626 1090382 1280339 1081994
275A081994R36144P27781M86639P08629K60134r57858J83930J147403P59389N06265
$$ 1081994 2018138 2745919 3232558 3941187 4201321 3243463 3427393 4574796 5334185 5840450
265E840450K325l047574K028143L057581R2543P50830R75j69690j117993k500777
$$ 5840450 5842775 2795201 4823344 7880925 7973468 8724298 8725273 8555583 7437590 4936813
255D936813k360525p14599k9602l159q6919J41745L0650k81468k09953l93587
$$ 4936813 2576288 1861689 1832087 1828928 1742009 1883754 1914404 1632936 1422983 1029396
245A029396l16524n25691J00253j51038n5043J47910l8294N6051j02939M8946
$$ 1029396 712872 187181 287434 136396 81353 229263 190969 247020 144081 193027
235A93027K1978l2488j9068r929O9511o0600q8518n1838J21514K12036J73244
$$ 193027 215005 182517 163449 153520 223031 162431 73913 22075 143589 355625 528869
224E28869K23768O6767Q5435J05057o3086l37489j90821j19694m3117o6122N415
$$ 528869 752637 819404 904839 1009896 946810 609321 418500 298806 255689 189567 194982
213A94982K613712J9789654L4196746L6483287O2810322N0995587L0679307J6739565
$$ 194982 2808694 22598348 56795094 93278381 156088703 207084290 237763597 254503162
205B54503162p385434m5475066m9798221m5690824n6440488k2979442j4543845
$$ 254503162 247117728 201642662 151844441 106153617 49713129 26733687 12189842
198A2189842j0877108j164150K78196K9371L166j4003o4539j43314q282P2817
$$ 12189842 1312734 148584 426780 456151 459317 445314 380775 237461 229179 301996
188C01996J9010L7524N2786j3978j8272j35753j01298n8679K8250O3916O0379
$$ 301996 321006 358530 411316 397338 379066 243313 142015 83336 111586 175502 235881
177B35881q7190j7898n285N3069N8467o266q2915K0089j6962l6891l9783k7887
$$ 235881 148691 130793 125508 178577 237044 230778 147863 167952 150990 114099 74316 46429
165D6429j5547L5474l5085N288L3179k2404P8276j4889k4892m6585K9680l596
$$ 46429 30882 66356 31271 36559 69738 47334 125610 110721 85829 39244 68924 65328
153F5328Q9485n8945M4514k6759j1316k6733l2819P007k0543j4490Q331O029K4172
$$ 65328 154813 95868 140382 113623 102307 75574 42755 49762 29219 14729 23060 29089 53261
140E3261l1891P5363n7917K0704L9883j6719l7824k4957J1597k0345K6174j0181
$$ 53261 21370 96733 38816 59520 99403 82684 44860 19903 31500 11155 37329 27148
128B7148k1017J8683j4447J1719J2255j4755O874K071j0023K385J9150R593m335
$$ 27148 6131 24814 10367 22086 34341 19586 26460 28531 18508 20893 40043 49636 45301
115D5301l0755L1708K9968m1757J8434k4026j3251O4388m7548j8504J0805K1153
$$ 45301 14546 46254 76222 34465 52899 28873 15622 80010 32462 13958 24763 45916
103D5916j8830j3283J8191p536J8839j2309k0257q62J1423P794j7653K2043L7996
$$ 45916 27086 13803 31994 24458 43297 30988 10731 9869 21292 29086 11433 33476 71472
90G1472J348K3882n8863j3435l349j192M210l406j3155N305K0908o925j485Q485
$$ 71472 72820 96702 37839 24404 21055 19863 24073 20667 7512 12817 33725 26800 25315 33800
76C3800N2726n6028k0165N237K5581k6124N4187j8344k4589j1681l420K2374j5060
$$ 33800 86526 30498 10333 15570 41151 15027 69214 50870 26281 14600 11180 33554 18494
63A8494r552L2736r755J8305k1034q948q016l693K989Q307Q887L819o603J3930
$$ 18494 8942 41678 31923 50228 29194 20246 12230 8537 11526 19833 28720 32539 25936 39866
49C9866q492k2170M640O356P725r033L971j6600K166L5188J8563j5082k7723l349
$$ 39866 31374 9204 13844 20200 27925 18892 22863 6263 8429 43617 62180 47098 19375 16026
35A6026L4474M6312k0666o7548J1068q335K503Q900j4774L359r272O456L8823
$$ 16026 50500 96812 76146 8598 19666 11331 13834 22734 7960 11319 2047 8503 47326
22D7326j7880j5650J7161L0753l7196K9145q44m1436m15n835J1975P528L1568
$$ 47326 29446 13796 30957 61710 24514 53659 52815 11379 10964 5129 17104 24632 56200
9E6200o596j2132l7037J0455J7072R142j6110j2648l532
$$ 56200 49604 37472 435 10890 27962 37104 20994 8346 4814
0D814
$$ 4814
##PAGE= F1=2803.468982632
##FIRST=     9431.70368901288, 3501.40056022409, 30313
##DATA TABLE= (F2++(Y..Y)), PROFILE
1023C0313L708l0330J4096J0675k4817M021J5083Q825k5467J8509j3899O5912
$$ 30313 34021 3691 17787 28462 3645 7666 22749 31574 6107 24616 10717 76629
1011G6629l6910r959r63L462k0119O110j539j2164O970P125K6644o648l3712Q40
$$ 76629 39719 29760 28797 32259 12140 18250 16711 4547 11517 18642 45286 38638 4926 5766
997E766K1450q805j310k393K8827n696k5067J5288q299o342Q756M950j6807N507
$$ 5766 27216 18411 17101 14708 43535 37839 12772 28060 19761 13419 22175 27125 10318 15825
983A5825L771o290J6456P0298k9542m2487l867j0804J3112j2950J0209r482J8480
$$ 15825 19596 13306 29762 100060 70518 28031 24164 13360 26472 13522 23731 14249 32729
970C2729j4692N647J7120k9122N635J2380N897j2289R564r343K8000k2425k1462
$$ 32729 18037 23684 40804 11682 17317 29697 35594 23305 32869 23526 51526 29101 7639
957G639O643L8973l6634Q927p994N386J6173j7887j7160J3453j2693K7347O405
$$ 7639 14282 53255 16621 25548 17554 22940 39113 21226 4066 17519 4826 32173 38578
944C8578J0433j8519k8161N523J5682j1503N044l20J6808O168k9003o467J3698
$$ 38578 49011 30492 2331 7854 23536 12033 17077 16757 33565 39733 10730 4263 17961
931A7961q109o299J8651Q679k4715L083L0690j3072j1728o105J4499K5859J2723
$$ 17961 9852 3553 22204 30883 6168 9251 39941 26869 15141 9036 23535 49394 62117
918F2117m9160J7268Q585j9130M4649l4897j1754K3255l9436L5603r714K2158
$$ 62117 12957 30225 38810 19680 64329 29432 17678 40933 1497 37100 27386 49544
906D9544l6142K6480k4157m531N979q118J2410M6332m2755l786J1362M211L579
$$ 49544 13402 39882 15725 11194 17173 9055 21465 67797 25042 21256 32618 36829 40408
893D0408k4974J0773k0687P420L083R526r166N680N0697n2957M273K991R469j6927
$$ 40408 15434 26207 5520 12940 16023 25549 16383 22063 72760 19803 24076 27067 36536 19609
879A9609M344j6951J7523p030K7173R4l995l0533p061J0354L6330K0451l6535
$$ 19609 23953 7002 24525 17495 44668 44762 40767 10234 3173 13527 49857 70308 33773
866C3773L3j8773L1584o900J9638l8719j0637R927k054N552J8749M1374n846K263
$$ 33773 33806 15033 46617 39717 59355 20636 9999 19926 17872 23424 42173 83547 77701 79964
852G9964p5517J3034n881K8838M386o424k7487O119P480j814N8068o6165m995
$$ 79964 4447 17481 11600 40438 44824 38400 10913 17032 24512 22698 80766 14601 9606
839I606L964o789J0268J9665k1516M6349L6878o6890k2754J5696j0904M6745J4810
$$ 9606 13570 6781 17049 36714 15198 61547 98425 31535 8781 24477 13573 60318 75128
826G5128o3674L0444j9784K4866M794l1320n193K1486m224N354j0156r611n457
$$ 75128 11454 41898 22114 46980 51774 20454 15261 36747 32523 37877 27721 18110 12653
813A2653L5823J7836n7620K4275j5753J4557N3585n3841k3346l294J4236m13J8082
$$ 12653 48476 66312 8692 32967 17214 31771 85356 31515 8169 4875 19111 18698 36780
800C6780j7160J8495k2909O768J8090J2190k5974k209o135M3137k4715j1369K9336
$$ 36780 19620 38115 15206 21974 40064 52254 26280 24071 17936 61073 36358 24989 54325
787E4325J0228k3342k4529N448O5670P0386L7289J32553j3948l7179j3311j44039
$$ 54325 64553 41211 16682 22130 87800 158186 195475 328028 314080 276901 263590 119551
775A19551O5687n0930j176P1163M0102k8331m0101o5970M1425O3854r6710o1930
$$ 119551 185238 134308 133132 204295 244397 216066 175965 109995 151420 215274 118564 56634
763E6634L2810P86R5590j16202o1400J7998K1967p371l4457K1674j3783J2713
$$ 56634 89444 90230 185820 69618 8218 26216 48183 40812 6355 28029 14246 26959
751B6959j5674p40R814o577p19K325O160o664r87j662j961J8723j2748M992J7052
$$ 26959 11285 10545 20359 13782 13063 15388 21548 14884 13897 12235 10274 28997 16249 21241 38293
736C8293N4808k4732n4797N790p162J3649L161N6p419p924n24K0284j3235j5751
$$ 38293 93101 68369 13572 19362 12200 25849 29010 29066 21647 13723 13199 33483 20248 4497
722D497L0014k0569J1574K464o717r520N352n876J4202r814R591j1283k832J4299
$$ 4497 34511 13942 25516 27980 21263 11743 17095 11219 25421 15607 25198 13915 11083 25382
708B5382k4066J5225J4535j4424J3603J3307r721J7869l1148R070k0494R490L0912
$$ 25382 1316 16541 31076 16652 30255 43562 33841 51710 20562 29632 9138 18628 49540
695D9540l0365j2003m505J3109K807J8047k1610p126Q135j52K4236k1850L0852
$$ 49540 19175 7172 2667 15776 18583 36630 15020 7894 16029 15877 40113 18263 49115
682D9115k0687R088L2929r505m4713J5324J4105k5697O76R422O246m594O249J5221
$$ 49115 28428 37516 70445 60940 16227 31551 45656 19959 20635 30057 36303 31709 37958 53179
668E3179l9384Q1324l3751k6295j8194P2759k0522m6096L7510m1107m340Q284
$$ 53179 13795 95119 61368 35073 16879 89638 69116 23020 60530 19423 15083 23367
656B3367M2274l4983j866q07J8685l1339J7141k8199J5941j2719J562K0972j6669
$$ 23367 65641 30658 28792 27985 46670 15331 32472 4273 20214 7495 9057 30029 13360
643A3360M436l517J235N618j8506N3992j9449k6042K9386r177N3150l6021j4097
$$ 13360 17796 14279 15514 21132 2626 56618 37169 11127 40513 31336 84486 48465 34368
630C4368k1148L353L780O549L03o620j921p347K793q687L1853n610N7409n2536
$$ 34368 13220 16573 20353 26902 27205 20585 18664 11317 14110 5423 37276 31666 89075 36539
616C6539O35J544N764P220N4509J1747j7476l8504j599L1831l9172J3566k9818
$$ 36539 37174 38718 44482 51702 106211 117958 100482 61978 60379 92210 53038 66604 36786
603C6786J895K69k0772J1222J15K116N1653J21836L17595k1350J3383j26207j53031
$$ 36786 38681 38950 18178 29400 29515 31631 83284 205120 522715 501365 514748 388541 235510
590B35510Q3259K8585K8032P8279N7237q317k20465j17764o5070L6180k2549L4073
$$ 235510 318769 347354 375386 453665 510902 502585 282120 164356 99286 135466 112917 146990
578A46990n4089J3199k3465n2923K6866l0591O7262M5459j3256K1934k1807n1335
$$ 146990 92901 106100 82635 29712 56578 25987 93249 138708 125452 147386 125579 74244
566G4244k0670q435k4819O100R519L2161m5895K1076K203K0903K5617j0606l0425
$$ 74244 53574 45139 20320 26420 35939 68100 22205 43281 45484 66387 92004 81398 50973
553E0973N929l9267J8930K780j9999J7512l5239L260R008M763K2155j4423J6669
$$ 50973 56902 17635 36565 39345 19346 36858 1619 4879 13887 18650 40805 26382 43051
540D3051k0388M793O475j983L1206l3131j1229j4353J0357K0258l91k3608K2307
$$ 43051 22663 27456 33931 31948 63154 30023 18794 4441 14798 35056 34665 11057 33364
527C3364K0210l1809m692L65L6741k7807r545P401K944j1836J1853L338j9610
$$ 33364 53574 21765 17073 17438 54179 26372 16827 24228 27172 15336 27189 30527 10917
514A0917R810q526k308N403O8188n0505j8035p074L3897k6566j1010O1594l1721
$$ 10917 20727 12201 9893 15296 83484 32979 14944 7870 41767 15201 4191 65785 34064
501C4064p078p344J3177j7842n150M285o386K4939K098J281k3418J4193j288M793
$$ 34064 26986 19642 32819 14977 9827 14112 7726 32665 34763 36044 12626 26819 25531 30324
487C0324k6095P78L3804j1801K0172j7384n744O8189o9016n387p432O170J7673
$$ 30324 4229 5007 38811 27010 47182 29798 24054 92243 23227 17840 10408 16578 34251
474C4251k750p0q109j0286q411M009P546j0821J0532J3659j8680l259K4343K725
$$ 34251 31501 31431 23322 13036 4625 8634 16180 5359 15891 29550 10870 7611 31954 34679
460C4679j2656J2976k2135M7740k0515P427l4423q07K3611o982k0957P122l227
$$ 34679 22023 34999 12864 60604 40089 47516 13093 12286 35897 28915 7958 15080 11853
447A1853J9780q779o850K2275k6299K67K3485J2831l3525K3055J3750K625k6095
$$ 11853 31633 22854 16004 38279 11980 12247 35732 48563 15038 38093 51843 54468 28373
434B8373j1199k541L741r994J0167O213J8652j7244j9148J1631J372j0517K3332
$$ 28373 17174 14633 18374 8380 18547 24760 43412 26168 7020 18651 20023 9506 32838
421C2838N629j4734M78J2466J6429m0661K3694k4044L112l577j0084N870J13K6151
$$ 32838 38467 23733 24211 36677 53106 12445 36139 12095 15207 11630 1546 7416 7529 33680
407C3680J2534J458k6218K2911j9061K1831l1801K320l89K6982k1614n323J3751
$$ 33680 46214 47672 21454 44365 25304 47135 15334 17654 17265 44247 22633 17310 31061
394C1061j4940o106L4338j8224p50l47P254k5445J2273n867J2212k577j5559N2069
$$ 31061 16121 10015 44353 26129 25379 25032 32286 6841 19114 13247 25459 22882 7323 59392
380E9392j7190J96n89J8137k8558L7029n5348M3304l0272j6163M6970m1507J4122
$$ 59392 42202 42398 41809 59946 31388 68417 13069 56373 26101 9938 56908 15401 29523
367B9523r249j2116J2869J1330n405k5332Q374J7038k165J22k749o829M0688P309
$$ 29523 20274 8158 21027 32357 26952 1620 9994 27032 24867 24989 22240 15411 56099 63408
353F3408j9516k6401n587L523J01243j08757P5175o9713J0466o904l601L0135
$$ 63408 43892 17491 11904 15427 116670 7913 83088 13375 23841 16937 13336 43471
341D3471l5185K1722j7823K1630J6446l6126L0025L0575m8373O816K7790o293
$$ 43471 8286 30008 12185 33815 50261 14135 44160 74735 26362 33178 60968 54675
329E4675j7945j6591r460J0899M500N9765m3624J6022J06206r065J9404K1973
$$ 54675 36730 20139 10679 21578 26078 85843 42219 58241 164447 155382 174786 196759
317A96759j4708Q0188N1893l6054m6143j1162j76250j8594J9946J19866j5085
$$ 196759 182051 262239 314132 278078 231935 220773 44523 25929 45875 165741 150656
306A50656L5898J8300J03662K41415k21033R5296R9318K6987q2180M3490M616
$$ 150656 186554 204854 308516 549931 328898 424194 523512 550499 468319 511809 516425
295E16425j54003j55863L0844K34784K412M9169P31120N18647M59773L34804j042613
$$ 516425 362422 206559 237403 472187 474599 523768 1254888 1773535 2233308 2568112 1525499
284A525499m215p09421l73412k20781J32438M94500K43786J68248j95811R29457
$$ 1525499 1521284 811863 438451 217670 350108 844608 1088394 1256642 1060831 1990288
274A990288P13182M98772P65515K58012j143001J96053R65624O42514M56696J14341
$$ 1990288 2703470 3202242 3967757 4225769 3082768 3278821 4244445 4886959 5343655 5457996
264E457996k942542K249650L273540K57397P26596j30650k72109j188406k563021
$$ 5457996 2515454 4765104 8038644 8296041 9022637 8891987 8619878 7431472 4868451
255D868451k355419o49889K6338M9386j02880J69158J4311l20375k22091m30342
$$ 4868451 2513032 1863143 1889481 1938867 1835987 2005145 2019456 1699081 1476990 1046648
245A046648l48387n28556J00020j43756m9171J53897l4720M8786j10205N7868
$$ 1046648 698261 169705 269725 125969 76798 230695 195975 244761 134556 192424
235A92424L3137l7616j5585j3054O5342n7810q3654o9192J12994K10856J71112
$$ 192424 225561 187945 172360 159306 224648 166838 83184 13992 126986 337842 508954
224E08954K31421P3030Q4053J04855n5323l08575k05329j21530l4353p0964k1443
$$ 508954 740375 813405 897458 1002313 946990 638415 433086 311556 277203 206239 184796
213A84796K569036J9471521L3056553L4553341N9834667M8158589K9773848J6275669
$$ 184796 2753832 22225353 55281906 89835247 149669914 197828503 227602351 243878020
205B43878020o665817m3401733m7414965m3533480n4610326k2196937j3998440
$$ 243878020 237212203 193810470 146395505 102862025 48251699 26054762 12056322
198A2056322j0804239j097359K64658L8824P713j0647p8242j34838k0396O6895
$$ 12056322 1252083 154724 419382 458206 465919 455272 377030 242192 221796 288691
188B88691J2251L2411N0458j0642r645j25055r5768o0274K6160N8541N6581q5928
$$ 288691 300942 333353 383811 373169 363524 238469 142701 82427 108587 167128 223709 137781
176A37781j3465l016N8765O3632n301q6076K8252j5240l4380m1808l0755l0069
$$ 137781 124316 121300 180065 243697 238396 152320 180572 165332 130952 89144 58389 28320
164B8320N0050m0837O03L4871k5476P8301j6636k6720m6043L4025o059J00160
$$ 28320 78370 37533 38136 73007 47531 125832 109196 82476 36433 70458 64399 164559
152A64559o4306L7747k0368n463l6674l1747O421j9504j3357O323O437K5962l1130
$$ 164559 100253 138000 117632 112169 75495 43748 50169 30665 17308 23631 30068 56030 24900
139B4900P4523o0492K0663L7670k0286l8015k0583P735j7664K6321n287k4788
$$ 24900 99423 38931 59594 97264 76978 38963 18380 26115 8451 34772 29485 4697
127D697J7996j2379J0883J2466j5360Q581K54o417K714J6210P598m099k8825L1593
$$ 4697 22693 10314 21197 33663 18303 26884 27138 20721 23435 39645 47243 43144 14319 45912
113D5912K3189l3761J3010j9029j1687O8101n4320j6159J1024J9278k2521r394
$$ 45912 69101 35340 48350 29321 17634 85735 31415 15256 26280 45558 23037 13643
101A3643J8866q015J9572j2869j9616j660J2346Q910j8570K1166L6797N167J6072
$$ 13643 32509 24494 44066 31197 11581 9921 22267 31177 12607 33773 70570 75737 91809
88I1809n6965j1248k871l245K191M96j1364L599K0727o707N8Q095N2788n7718
$$ 91809 34844 23596 20725 17480 19671 20167 8803 12402 33129 26422 26480 34575 87363 29645
74B9645j9729N409K5041k7819O1009k0175k7361j1640j806J8489j2646q731K7703
$$ 29645 9916 15325 40366 12547 73556 53381 26020 14380 12574 31063 18417 9686 37389
61C7389l796J4803k1040o574r242k083L170P697J0556N14m370J0924o751k4599
$$ 37389 33593 48396 27356 20782 11540 9457 12627 20324 30880 31394 27024 37948 31197 6598
47F598O642P091P339r711J956j5417L597L3842J9291j9872k1555r83L4949M8336
$$ 6598 13240 20331 27670 17959 19915 4498 8095 41937 61228 41356 19801 18818 53767 102103
33A02103k0629p2569J3011r148M4J0802j8774N528p379P067L8461k0474j6431
$$ 102103 81474 8905 21916 12768 12812 23614 4840 10368 2989 10056 48517 28043 11612
20A1612J9448L4391m0659K7099M442m4665K82p241J1534Q740L5311q024j4276
$$ 11612 31060 65451 24792 51891 56333 11668 11950 4709 16243 24983 60294 52270 37994
7C7994l7397Q825J7042R700j5107j4153l118
$$ 37994 597 9422 26464 36164 21057 6904 3786
0C786
$$ 3786
##PAGE= F1=2793.63480651
##FIRST=     9431.70368901288, 3501.40056022409, 31057
##DATA TABLE= (F2++(Y..Y)), PROFILE
1023C1057L105l0718J3530J1728k3995K487J6129O782k3600J8080j8750O4158
$$ 31057 34162 3444 16974 28702 4707 7194 23323 30105 6505 24585 5835 69993
1011F9993k8607j2104N15J190j9743Q045k767j1586N771Q657L0586j1284l5129
$$ 69993 41386 29282 29797 30987 11244 19289 16522 4936 10707 19364 49950 38666 3537
998C537J355K0799j2609N506k397K7819l690k7611J4795p831o775Q701N688j5850
$$ 3537 4892 25691 13082 18588 16191 44010 40320 12709 27504 19673 12898 21599 27287 11437
984A1437L595L895m716J5323O3772k3521m0729n741q802J0727j2306J0207r442
$$ 11437 15032 18927 14211 29534 93306 69785 29056 23315 14513 25240 12934 23141 13699
971A3699J8191j4307O287J9351k9984M389J4579M189j4227O843o368K6139j9450
$$ 13699 31890 17583 23870 43221 13237 17626 32205 36394 22167 29010 22642 48781 29331
958B9331k1936P878L9007l6313N719p118O577J5491j8606j5272J4291j4337K9236
$$ 29331 7395 15273 54280 17967 23686 16568 23145 38636 20030 4758 19049 4712 33948
945C3948N016J7319k6747k6032L541J8599j4551N734L20J4315O285k7704m990
$$ 33948 38964 56283 29536 3504 7045 25644 11093 16827 17147 31462 37747 10043 5053
932E053J3177r323o077J9527Q401k5007L020L1066j2896j1758m126J3843K2823
$$ 5053 18230 8907 2830 22357 30758 5751 8771 39837 26941 15183 11057 24900 47723
919D7723J4981n0855J7860R776j9285M4931l5050j2427K2815l8274L5084r275
$$ 47723 62704 11849 29709 39485 20200 65131 30081 17654 40469 2195 37279 28004
907B8004J9894l4121K7507k5657m789L599n654J2794M2403m3395N73R824N223
$$ 28004 47898 13777 41284 15627 10838 14437 8783 21577 63980 20585 21158 30982 36205
894C6205M445k3692Q177j9077Q246K049R062r065O806M8359n1626L086M222R178
$$ 36205 40650 16958 25135 6058 14304 16353 25415 16350 23156 71515 19889 22975 27197 36375
880C6375j6414L566j4346J1455l663L4227m446m789l1566p041J0768M0250J3702
$$ 36375 19961 23527 9181 20636 16973 51200 46754 41965 10399 3358 14126 54376 68078
867F8078l5081K225j8214K9617o350K1105m2284j0242J1949m094R356K1755L1871
$$ 68078 32997 35222 17008 46625 40275 61380 19096 8854 20803 16709 26065 47820 79691
854G9691q370M691p1628J2367n666L0651M921p763k8029O030R063k358N7664o7097
$$ 79691 71321 76012 4384 16751 11085 41736 46657 38894 10865 16895 25958 23600 81264 14167
840A4167l717K514n269R554J4263k0429M8695L8883o3566k4749J4919j2230M3471
$$ 14167 10450 12964 7695 17249 31512 11083 59778 98661 35095 10346 25265 13035 56506
827E6506J7856o2547K9189j9121K7287M380l2850n171K3337m821K60p027q750
$$ 56506 74362 11815 41004 21883 49170 53550 20700 15529 38866 34045 34305 27278 18528
814A8528n726L8190J5651o1532K6018j4125J5123N3165n4345k3638J820J0294
$$ 18528 12802 50992 66643 5111 31129 17004 32127 85292 30947 7309 9129 19423
802A9423K555J4464j6639J7753k3815O469K0088J0794k5921l542n900M2647j9546
$$ 19423 21978 36442 19803 37556 13741 20210 40298 51092 25171 21629 15729 58376 38830
789C8830j7191K8137J4709k0507k8143K229O8981O4705N3315J09302K52m0677
$$ 38830 21639 49776 64485 43978 15835 18064 87045 151750 205065 314367 314619 273942
777B73942k2820j41275P2039m8919j3629O8675M4738k3058l4593o1105M4893M6807
$$ 273942 251122 109847 181886 132967 119338 188013 232751 209693 175100 113995 158888 205695
765B05695q4574o4478L5086l534R0456j10405o0045J5738K1335o193l0594J8425
$$ 205695 121121 56643 91729 88195 178651 68246 8201 23939 45274 39081 8487 26912
753B6912j2238J2449j6334k25R689o245l032N469K846o026J00q57o046K3383j4377
$$ 26912 14674 27123 10789 10564 20253 14008 10976 16445 19291 13265 13365 12508 6462 29845 15468
738A5468O361J5379N5462k3625n4787M099o159J0404L930L627q331q723k73K0125
$$ 15468 21829 37208 92670 69045 14258 18357 12198 22602 26532 30159 21828 13105 12832 32957
724C2957j2987j4369K8728k1067J0722K943o780r347N946n588J4061p137O693
$$ 32957 19970 5601 34329 13262 23984 26927 20147 10800 16746 11158 25219 18082 24775
711B4775j1085m191J6533k4223J4772J5418j4120J3652J1104p472J8837l4436
$$ 24775 13690 9499 26032 1809 16581 31999 17879 31531 42635 35163 54000 19564
699A9564R701j9371J7006K8873l5075j2171n019J0647O204J6897k2723p255P680
$$ 19564 29265 9894 26900 55773 20698 8527 3508 14155 20359 37256 14533 7278 14958
686A4958J398K2757k1697L3502k0645P672K8349l659m6064J4322J2469k5940L198
$$ 14958 16356 39113 17416 50918 30273 37945 66294 62635 16571 30893 43362 17422 20620
673B0620Q794M377j129R591J4607l9983P1822l1100k2129j9222O4355j5419m2688
$$ 20620 29414 33791 32662 42253 56860 16877 88699 57599 35470 16248 80603 65184 22496
660B2496L7167l9973o629R679M4880l3712k760o739J8153k6956J5596k4619J3843
$$ 22496 59663 19690 13061 22740 67620 33908 31148 24409 42562 15606 31202 6583 20426
647B0426j3435J671K2707j6041J619k902J609O713k0599N5330j8239k7243L0882
$$ 20426 6991 8662 31369 15328 16947 14045 15654 22367 1768 57098 38859 11616 42498
634D2498j3824N7477l3947j4893k2905L386R905K312m269m598l216o303K62q104
$$ 42498 28674 86151 52204 37311 14406 17792 27697 30009 25740 21142 17926 11623 11885 3781
620C781L2361p273N2628n1605O239K302N453L338N6898J0075j4758m0771K050
$$ 3781 36142 28869 81497 29892 36131 38433 43886 47224 104122 114197 99439 58668 60718
607F0718L0014l6284J5642l2447K930J099k2256R914J391K205N7564J44222L55707
$$ 60718 90732 54448 70090 37643 40573 41672 19416 29330 30721 32926 90490 234712 590419
594E90419o5617j6690j46637j16400J03367K9000L3138J03231J2981o326k37116
$$ 590419 524802 508112 361475 245075 348442 377442 410580 513811 526792 520466 283350
583B83350j19403o3019M2988k7942K3035n0409J2617k3084n0434K7092l1889O5869
$$ 283350 163947 100928 143916 115974 139009 88600 101217 78133 27699 54791 22902 88771
571H8771M5728j0875K3352k4517n1357j9269j1031k3239R460P426K9103m1975
$$ 88771 134499 123624 146976 122459 71102 51833 40802 17563 27023 34449 63552 21577
559B1577K1931k08K1519K1583o545l4292R679l7817J7348j318j5288J8648l4451
$$ 21577 43508 43300 64819 86402 79857 45565 55244 17427 34775 33457 18169 36817 2366
546B366K369R953M980K0003j8575J9181j7705M670O526k85K9148k7132j7981j2852
$$ 2366 4735 14688 19668 39671 21096 40277 22572 27242 33768 33483 62631 35499 17518 4666
532D666J0447K0906j235k6264K6383K5034l6848n549j044L7348k6813j0131Q046
$$ 4666 15113 36019 34784 8520 34903 59937 23089 17540 16496 53844 27031 16900 24946
519B4946M740j3151J1543L339k0478R300p886k990P928O2153m7806j6735l917
$$ 24946 29686 16535 28078 31417 10939 20239 12353 9363 17291 79444 31638 14903 10986
506A0986L3042k7474j3671O4580l4326p135n386J3495k1359r85K498o100K4147
$$ 10986 44028 16554 2883 67463 33137 26002 20616 34111 12752 11767 14265 8165 32312
493C2312N034j541k3780J6679M585j170k8160J497L4062j2421K2317j5965p530
$$ 32312 37346 35805 12025 28704 33289 32119 3959 5456 39518 27097 49414 33449 25919
480B5919O6556o8851n671p217O724J5715k221M17o246j1303r233L876Q392j0848
$$ 25919 92475 23624 17953 10736 17460 33175 30954 31371 25125 13822 4589 8465 16857 6009
466F009J0000J3196j9052j160K3048M844j4624R124j8329M4595j8601J0825l5783
$$ 6009 16009 29205 10153 8993 32041 36885 22261 31385 13056 57651 39050 49875 14092
453A4092j704K5534p752k2831P463l851K3087j0383o643K3542k8879J523K2433
$$ 14092 12388 37922 30170 7339 14802 10951 34038 23655 17012 40554 11675 13198 35631
440C5631J5361l6072K2352J1290M468k7369q544p54J252r027J0017N899J7797
$$ 35631 50992 14920 37272 48562 53030 25661 17117 16363 17615 8588 18605 24504 42301
427D2301j2842k1936J0775L090j1224K0557O741j3687q5J2807J5907l9419K1040
$$ 42301 29459 7523 18298 21388 10164 30721 37462 23775 23690 36497 52404 12985 34025
414C4025k0535J360k070j0911N526O20K7078J6062J430l1940K2288j6523J8433
$$ 34025 13490 14850 12780 1869 7395 8015 35093 51155 52585 20645 42933 26410 44843
401D4843l1796J846J941K6567k0012o278J3639j4397m593L3806j8297j928j055
$$ 44843 13047 14893 16834 43401 23389 17111 30750 16353 11760 45566 27269 25341 24286
388B4286P723k3983J1444m669R386L2j6294N3281j8651J578l321K3811l5611M4396
$$ 24286 32009 8026 19470 14801 24187 24219 7925 61206 42555 44133 40812 64623 29012 73408
374G3408o0837M5214l2223j5810M6185l9877J2473p352j3026J2974R091n721k3729
$$ 73408 12571 57785 25562 9752 55937 16060 28533 21181 8155 21129 30220 24499 770
361G70R639J6986j985k0l155p823M1538J3413k4677k6195q377O309R8697j08058
$$ 770 10409 27395 25410 25390 22235 14412 55950 69363 44686 18491 10114 16423 115120 7062
347G062O8073o1991R621p322o91K7308l4298K2486j9416K3686J7571l7579L1368
$$ 7062 75135 13144 22765 15443 14752 42060 7762 30248 10832 34518 52089 14510 45878
334D5878L6883n0996j41K9990n163j7781j8729j1942J5590J100O3692m6808J7011
$$ 45878 82761 31765 31624 61614 56451 38670 19941 7999 23589 24689 88381 41573 58584
321E8584J13197j6482J6199K0151j5797Q2412N5948l7198m8824j1308j73189j8560
$$ 58584 171781 155299 171498 191649 175852 258264 314212 277014 228190 216882 43693 25133
309B5133J8598J14460k2424L4183J6527J10412K69115k32562R9476R2396K0905
$$ 25133 43731 158191 135767 169950 186477 296889 566004 333442 432918 525314 546219
298E46219r0169L3427k320j47740j34304L5445K19251J6381N698O45791M68175
$$ 546219 456050 489477 487157 339417 205113 240558 459809 476190 481888 1127679 1595854
287A595854M05640L90456j044880J1806o11588l21734k17295J32984M76151K53076
$$ 1595854 2001494 2391950 1347070 1358876 747288 425554 208259 341243 817394 1070470
277A070470J45039j88176R07013O87895N06987Q10504K54557j307699J99693P76961
$$ 1070470 1215509 1027333 1934346 2622241 3129228 3939732 4194289 2886590 3086283 3863244
267C863244N23311M03223K12214k785267K428411L434502M27752O83138k66748
$$ 3863244 4386555 4789778 5001992 2216725 4645136 8079638 8507390 9190528 8923780
258H923780l72344j242821k585086k312303n76798Q1958J01608j17596J94597
$$ 8923780 8551436 7308615 4723529 2411226 1834428 1916386 2017994 1900398 2094995
249B094995l865l54180k28798m56541l74707n25526J00111j33643m4864J57686
$$ 2094995 2091130 1736950 1508152 1051611 676904 151378 251489 117846 72982 230668
239B30668l0951M0066j15265O6433M4590m2517j1110j6924O1774n4589p6731n1751
$$ 230668 199717 239783 124518 190951 235541 193024 181914 164990 226764 172175 95444 43693
227D3693Q2343K02138J67279K35117P8968Q1676J05727m7566k79013k23950j22410
$$ 43693 126036 328174 495453 730570 809538 891214 996941 949375 670362 446412 324002
216C24002k6898p5208m7453K497258J8848516L1419233L2152284N6036808M4680414
$$ 324002 297104 221896 174443 2671701 21520217 52939450 85091734 141128542 185808956
207A85808956K8452660J5557215n877780m0740999m4338257m0805050n1989610
$$ 185808956 214261616 229818831 223941051 183200052 138861795 98056745 46067135
200D6067135k1091317j3240378j0545805j028768K49193M9099J3130q331q9684
$$ 46067135 24975818 11735440 1189635 160867 410060 459159 472289 463958 374274
191C74274j25370k7781N8226L497K3908M8855o980J4j14774q9417o2402K4034
$$ 374274 248904 221123 279349 282846 306754 355609 348629 348643 233869 144452 82050 106084
179A06084N2118N1662q3468r190m46O3891O8578l637q8967L6702j3001l1204m3553
$$ 106084 158202 209864 126396 117206 116760 180651 249229 245592 156625 193327 180326 149122 105569
166A05569l3532m4924O4015m7274m249L6581k8696P8354j8509k8455m5360L8594
$$ 105569 72037 27113 91128 43854 39605 76186 47490 125844 107335 78880 33520 72114
154G2114q643J10863o9393K9760j3471Q63m7094l0567N714j8350j2061M657O556
$$ 72114 63471 174334 104941 134701 121230 122093 74999 44432 50146 31796 19735 24392 30948
141C0948K7888l0634P3236o2446K0652L4858k4185l5972j6786N130j6909K6869
$$ 30948 58836 28202 101438 38992 59644 94502 70317 34345 17559 22689 5780 32649
129C2649n85k8719J7286j0331R895J2573j5869J0414j783k716L131J3389N605
$$ 32649 32064 3345 20631 10300 20195 32768 16899 27313 25530 22814 25945 39334 44939
116D4939l825k7023L1726J6179k5897P815j4140r340P0793o0664j4090J1141J7400
$$ 44939 41114 14091 45817 61996 36099 43914 29774 20434 91227 30563 16473 27614 45014
103D5014k5719n956J9778q669K0094j3182j8809k457J3073R706j9181K0354L5128
$$ 45014 19295 13339 33117 24448 44542 31360 12551 10094 23167 32873 13692 34046 69174
90F9174Q794Q011n4502q667k380n702N63M329r541J912K0587o436J594P422N2615
$$ 69174 77968 85979 31477 22810 20430 14728 15291 19620 10079 11991 32578 26142 27736 35158 87773
75H7773n9112j8818N157K4141k7885O5784k1870k9661j1309n28J4660j0016p705
$$ 87773 28661 9843 15000 39141 11256 77040 55170 25509 14200 13672 28332 18316 10611
62A0611K2174K472J1322k1061m270j0466L9L042P011J1816k517k235Q378n118
$$ 10611 32785 35257 46579 25518 21248 10782 10821 13863 20874 32690 30173 27938 36316 31198
48C1198k6538Q175P467O918j0116q5j3511M253L2366J9604k4069j5571J612L5144
$$ 31198 4660 12835 20302 27220 17104 17019 3508 7761 40127 59731 35662 20091 21703 56847
34E6847M9934k0490p7099J5070r995k388J2723j8150L179n792P502L8197k2926
$$ 56847 106781 86291 9192 24262 14267 11879 24602 6452 9631 3839 11341 49538 26612
21B6612j6996K1533L7801m3944K4898R418m7382J155q790J1228R710L8941r723
$$ 26612 9616 31149 68950 25006 49904 59322 11940 13095 4305 15533 25243 64184 54461
8E4461j6234l7016O690J7075J0244j4107j5485k881
$$ 54461 38227 1211 7901 24976 35220 21113 5628 2747
0B747
$$ 2747
##PAGE= F1=2783.800630387
##FIRST=     9431.70368901288, 3501.40056022409, 31590
##DATA TABLE= (F2++(Y..Y)), PROFILE
1023C1590K470l0720J2740J2681k2911R65J6991M492k1342J7551j8333N6956k0054
$$ 31590 34060 3340 16080 28761 5850 6815 23806 28298 6956 24507 6174 63130 43076
1010D3076j4179K000j207j9183R918l951j0981M552J0009L4375j5747l6490J905
$$ 43076 28897 30897 29690 10507 20425 16474 5493 10045 20054 54429 38682 2192 4097
997D097K0017j6477J2754k897K6854j437l0009J3952p364p069Q595O296j4699
$$ 4097 24114 7637 20391 17494 44348 42911 12902 26854 19490 12421 21016 27312 12613
984A2613J523M058l099J4108N6523j7171l8512p567o767Q348j1710J0090r389
$$ 12613 14136 18194 15095 29203 85726 68555 30043 22476 15709 24057 12347 22437 13048
971A3048J7933j3842O856K1622l0931L281J6501K389j5968M487l649K4220j6371
$$ 13048 30981 17139 23995 45617 14686 17967 34468 36857 20889 25376 21727 45947 29576
958B9576k1424Q434L8473l5789K471o043P693J4647j9058j3364J4960j5851L0868
$$ 29576 8152 16586 55059 19270 21741 15698 23391 38038 18980 5616 20576 4725 35593
945C5593L461K4832l5172k4086J821K1649j7536N992J205J2026N943k6371l257
$$ 35593 39054 63886 28714 4628 6449 28098 10562 16554 17759 29785 35728 9357 6100
932F100J2508j0754n851K0558Q176k5364K928L0971j2375j1719j334J3330J8769
$$ 6100 18608 7854 2003 22561 30737 5373 8301 39272 26897 15178 13844 27174 45943
919D5943J7273n2447J8204J0679j8910M4487l4912j3126K2462l6681L4277q763
$$ 45943 63216 10769 28973 39652 20742 65229 30317 17191 39653 2972 37249 28486
907B8486J7800l2264K8694k7184n024J165l254J3162L8507m3853M856Q524N975
$$ 28486 46286 14022 42716 15532 10508 11673 8419 21581 60088 16235 21091 29615 35590
894C5590N216k2096N219j7234R119O97Q559q765Q671M5339n0373K011N473R031
$$ 35590 40806 18710 23929 6695 15814 16511 25070 16305 24976 70315 19942 21953 27426 36457
880C6457j5944K610j1847N678m13M1646r571n476l2400o709J0910M3868O579l3228
$$ 36457 20513 23123 11276 16954 16541 58187 48616 43140 10740 4031 14941 58809 65388 32160
866C2160M516j7816K7596n664K1867m5166r733J3941n311J3685K4007K1365j0699
$$ 32160 36676 18860 46456 40792 62659 17493 7760 21701 16390 30075 54082 75447 64748
853F4748O424o6854J1679n342L2084N436r155k8208N914J0559k717N6492o6722
$$ 64748 71172 4318 15997 10655 42739 48175 39020 10812 16726 27285 24568 81060 14338
840A4338k021m5l677Q817Q713j8327N0066M0311n9092k6665J3443j3050L9572
$$ 14338 12317 12272 8595 17412 26125 7798 57864 98175 39083 12418 25861 12811 52383
827E2383K0481o0638K7766j8345K9772L842l4105n276K5596n792m601m293p946
$$ 52383 72864 12226 39992 21647 51419 55261 21156 15880 41476 35684 31083 26790 18844
814A8844n361M0598J2702o2782K5053j2324J5684N2049n3964k3994P275N944N342
$$ 18844 13483 54081 66783 4001 29054 16730 32414 84463 30499 6505 13780 19724 25066
801B5066J1162j6304J7466k4899N833K2296R287k5825m752n742M1918j4277k2678
$$ 25066 36228 19924 37390 12491 18324 40620 49907 24082 19330 13588 55506 41229 18551
788A8551K7200J8958j6342l2723j688P2198N9336O8744Q4201J5573m1132l2788
$$ 18551 45751 64709 48367 15644 13956 86154 145490 214234 298435 314008 272876 240088
776B40088j39273P7777m6745k5518O5868M9015j8142l0016n5702M7876K9446p1437
$$ 240088 100815 178592 131847 106329 172197 221212 203070 173054 117352 165228 194674 123237
764A23237o6872L7114q228Q4432j03075n8088J3296K0529n096k6251J5382j1249
$$ 123237 56365 93479 85251 169683 66608 8520 21816 42345 37249 10998 26380 15131
752A5131J2064j6998L69R543n877m876Q098k6n528J026j17p929K6699j6849P757
$$ 15131 27195 10197 10566 20109 14232 9356 17454 17428 11900 12926 12809 4880 31579 14730 22487
737B2487J3470N5697k1928n4653K210n025P463M744O753r074r627n7J9981j2816
$$ 22487 35957 91654 69726 15073 17283 12258 19721 24465 31218 22144 12517 12460 32441 19625
723A9625j2576K6946k1301R805L578o876r274O505n251J4280m856L780j0702n678
$$ 19625 7049 33995 12694 22499 26077 19201 9927 16432 11181 25461 20605 24385 13683 8005
709H005J8490k4013J4300J6225j3904J3673Q731n067J9431l7308J0205j7987K4739
$$ 8005 26495 2482 16782 33007 19103 32776 41507 36440 55871 18563 28768 10781 35520
696C5520K6580l9482j2573n640Q059R505J5701k3519p467P287L009K1041k1624
$$ 35520 62100 22618 10045 4405 12464 21969 37670 14151 6684 13971 16980 38021 16397
683A6397L5940k0030O069K3623K280m7383J3240J0799k6060N774Q122K538K363
$$ 16397 52337 32307 38376 61999 64279 16896 30136 40935 14875 20649 28771 31309 33672
670C3672J2844J3670l8971O0871k9163j7130j9930N5949j0884l9178L6485l8323
$$ 33672 46516 60186 21215 82086 52923 35793 15863 71812 60928 21750 58235 19912
658A9912q849J1217M6667l1719m055j2162J7324k2299J3737k0460J1279j4092
$$ 19912 11063 22280 68947 37228 33173 21011 38335 16036 29773 9313 20592 6500
646F500J766K4626j5017j740k418J972P677k2034N5839j6677k8404L2637j8911
$$ 6500 8266 32892 17875 16135 13717 15689 23366 1332 57171 40494 12090 44727 25816
633B5816O1291l0883j5555k4992L402J6166k139q871k602m287n118k851o593L2197
$$ 25816 87107 56224 40669 15677 19079 35245 33106 24235 21633 17346 12228 9377 2784 34981
619C4981q874M7734n0794J2237K933N066o03N9520Q480j2227m2884N375K8620
$$ 34981 26107 73841 23047 35284 38217 43283 42680 102200 110680 98453 55569 60944 89564
606H9564l3080J7044l5171M157J985k3736Q431K684K232O4179J69262L94502j00025
$$ 89564 56484 73528 38357 42514 44499 20763 29194 31878 34110 98289 267551 662053 562028
593E62028m2461j80041j10555J33708L4880N6441J32635j8197q041k65185j28235
$$ 562028 519567 339526 228971 362679 397559 454000 586635 568438 560397 295212 166977
582A66977o3665M9091l2795J2155m7023J1447k3087m7354K6943l2311O4327M5763
$$ 166977 103312 152403 119608 131763 84740 96187 73100 25746 52689 20378 84705 130468
570A30468q324K4373k7146n1190j7977j3233k1581J2768M982K5478l7390K2209
$$ 130468 122144 146517 119371 68181 50204 36971 15390 28158 33140 58618 21228 43437
558D3437k619K2240J7371k395l7489J2935l6194J5833n709j0420J9710l0892j218
$$ 43437 40818 63058 80429 78034 40545 53480 17286 33119 27410 16990 36700 5808 4590
545D590J0881N138J7616k2348K1775j4778M266O427J353K6655k0124k2608j3646
$$ 4590 15471 20609 38225 15877 37652 22874 27140 33567 34920 61575 41451 18843 5197
532E197J0040K1591k070k8232K9950L0519m1342p787k187L7600k5695j0648Q631
$$ 5197 15237 36828 34758 6526 36476 66995 25653 17866 15679 53279 27584 16936 25567
519B5567O832j4714J1271L296k1231Q781o498m468J0538N5275m4344j5286r12
$$ 25567 32399 17685 28956 32252 11021 19802 13304 8836 19374 74649 30305 15019 14107
506A4107L1651k7769j5099O6094l6773p225l604J4154k5036L251O76n779K3465
$$ 14107 45758 17989 2890 68984 32211 24986 21382 35536 10500 13751 14427 8648 32113
493C2113Q245m836k4061J9195J0870p597l0106K184L3994j2673K4005j4145r492
$$ 32113 40358 35522 11461 30656 41526 33929 3823 6007 40001 27328 51333 37188 27696
480B7696O4949o8589n955p031P307J3567j942J229m195j2548r843L636R168j0679
$$ 27696 92645 24056 18101 11070 18377 31944 30002 31231 27036 14488 4645 8281 17449 6770
466F770R768J2546j9629R41K1581O746j5738N525j5311M1307j6802J4361l6879
$$ 6770 16538 29084 9455 10396 31977 38723 22985 28510 13199 54506 37704 52065 15186
453A5186k729K7584q688k4578P578m263K6580j2096o453K4810l1555K805K1533
$$ 15186 12457 40041 31353 6775 14353 10090 36670 24574 18121 42931 11376 14181 35714
440C5714J7307l8327K1756Q950N926k8303n892J147j257q183R905N747J6674p937
$$ 35714 53021 14694 36450 45400 51326 23023 17131 18278 17021 8838 18743 24490 41164 33227
426C3227k5195R983M771j2044J8173P962j3369o12J3424J5069l8097J8402j6055
$$ 33227 8032 18015 22786 10742 28915 36877 23508 22896 36320 51389 13292 31694 15639
413A5639P17k185j1621M901J031K7705J9880J683l7916K1530j3818J5019l0971
$$ 15639 16356 14171 2550 7451 8482 36187 56067 57750 19834 41364 27546 42565 11594
400A1594J513L277K6069j8324p332J3445j3713k953L2865j8003l085j475P576
$$ 11594 13107 16384 42453 24129 16797 30242 16529 13576 46441 28438 25353 23878 31454
387C1454k2320J0606l007N883K792j7065N4353j9891K872o033K9084m1933N1302
$$ 31454 9134 19740 16733 22616 25408 8343 62696 42805 45677 39644 68728 26795 78097
374G8097o5976M6687l3893j5372M5107l7904J0525n131j4007J3154O587n868k0698
$$ 78097 12121 58808 24915 9543 54650 16746 27271 22140 8133 21287 27874 22006 1308
361A308R593J6827k62j851l474q618M2092J9707l0014k5701j1035Q747R5135j05948
$$ 1308 10901 27728 27466 25615 22141 13523 55615 75322 45308 19607 8572 17319 112454 6506
347F506O0009n3638Q785p634K036K4490l3305K2966k0655K5535J8659l8900L2102
$$ 6506 66515 12877 21662 14028 16064 40554 7249 30215 9560 35095 53754 14854 46956
334D6956M2675n1884p649L1586l742j7300k0907j4432K0216k242O6584m8596J7447
$$ 46956 89631 37747 30098 61684 57942 40642 19735 5303 25519 23277 89861 41265 58712
321E8712J19478k3097J3019J8398j7171Q4293N9887l8272n1387j1606j69858j9233
$$ 58712 178190 155093 168112 186510 169339 253632 313519 275247 223860 212254 42396 23163
309B3163J8064J09025k8936L1417J4541J17068K92905k40210R9436Q5034J6733
$$ 23163 41227 150252 121316 152733 167274 284342 577247 337037 436473 521507 538240
298E38240r8446J2322j1256j42098j08182M7992K06814K9533k7797N38686M18245
$$ 538240 439794 452116 440860 298762 190580 238572 445386 474919 447122 985808 1404053
287A404053L50037M29793j021521K1658n11376k67043k06837J31530M49070K58350
$$ 1404053 1754090 2183883 1162362 1184020 672644 405601 198764 330294 779364 1037714
277A037714J21043j75796Q69891O52698N11497Q43260K49871j449188J94800N88866
$$ 1037714 1158757 982961 1852852 2505550 3017047 3860307 4110178 2660990 2855790 3444656
267C444656M05781L47070K92785k581040K558465L535933N97471O22221m02658
$$ 3444656 3850437 4197507 4490292 1909252 4467717 8003650 8601121 9223342 8820684
258H820684m66961j279592k566523k232688m97842J35154J51466j30333K17063
$$ 8820684 8353723 7074131 4507608 2274920 1777078 1912232 2063698 1933365 2150428
249B150428k3110l81696k30493m71939l94862n15646J00436j21163m1927J59080
$$ 2150428 2127318 1745622 1515129 1043190 648328 132682 233118 111955 70028 229108
239B29108k7092L0104j17970P4471N6108m7044n569k1534N8722n1308o8636l3342
$$ 229108 202016 232120 114150 188621 244729 197685 192116 170582 229304 177996 109360 76018
227G6018O7917J85400J60951K33961Q4534P8096J07573l9941k50189k45806j22678
$$ 76018 143935 329335 490286 724247 808781 886877 994450 954509 704320 458514 335836
216C35836k0422p8903p2624K400717J7944801K9343559K9364589N1550992M0683329
$$ 335836 315414 236511 163887 2564604 20509405 49852964 79217553 130768545 171451874
207A71451874K6765635J4614672n046079l7584421m0673381l7604085m8677280
$$ 171451874 198217509 212832181 207786102 170201681 129528300 91924215 43246935
200D3246935j9705822j2300608j0113564r59909K31775O0125J9425o981r9215
$$ 43246935 23541113 11240505 1126941 167032 398807 458932 478357 471376 372161
191C72161j15564k8949M7923o500J1584M8623l230J0422j06148q2915o5197K2158
$$ 372161 256597 227648 275571 269071 280655 329278 326048 336470 230322 147407 82210 104368
179A04368M4696M5779q0133n147K416O8344P3118j257r1433M5277j0391k7383
$$ 104368 149064 194843 114710 109563 111979 180323 253441 252184 160751 206028 195637 168254
167A68254m5323l5785n9158P6449n4234r285L8334l2029P8469k0490l0024m4612
$$ 168254 122931 87146 27988 104437 50203 40918 79252 47223 125692 105202 75178 30566
155C0566M3288j1314J21359p3994K0581o156P509n7738k9240M844j7107j0600
$$ 30566 73854 62540 183899 109905 130486 124330 131839 74101 44861 49705 32598 21998
143B1998L291O432K9860l0370P1500o3722K0666L1533k8286l1243j4284L649j7492
$$ 21998 25289 31721 61581 31211 102711 38989 59655 91188 62902 31659 17375 21024 3532
130C532K7314L916l2632J6520q324Q775J2588j6290J2372m036R46L690J0756L677
$$ 3532 30846 34762 2130 18650 10326 19101 31689 15399 27771 23735 24681 28371 39127 42804
116D2804l585k5331L2054R168j8480L048r465o304P2420o6362j2361J1151J5522
$$ 42804 39219 13888 45942 55110 36630 39678 30213 23909 96329 29967 17606 28757 44279
103D4279k8435k975K0975r526K0403j3256j7865l227J3588J0226j9585J9682L3081
$$ 44279 15844 12869 33844 24318 44721 31465 13600 10373 23961 34187 14602 34284 67365
90F7365J2122p3n1616n759j867q501o11P981p702K64K0449o099L116O483N2189
$$ 67365 79487 79414 27798 22039 20172 11671 11060 19041 11339 11603 32052 25953 29069 35552 87741
75H7741o0182j7531M566K2907k5418O7521k3401l1444j0736L86J1097p308o496
$$ 87741 27559 10028 14594 37501 12083 79604 56203 24759 14023 14409 25506 18198 11702
62A1702J6236Q968P884k1101k046j1689K800K446O239J2665n243j82O235l586
$$ 11702 27938 36906 44790 23689 21643 9954 12754 15200 21439 34104 28861 28679 34914 31328
48C1328k7283Q624P443O466j0198k190j0348L583L0797J9496k7526r960M399L5030
$$ 31328 4045 12669 20112 26578 16380 14190 3842 7425 38222 57718 30192 20232 24631 59661
34E9661N1021k0248q0961J7175j0846m718J4616j3934k623m535P714L8049k5188
$$ 59661 110682 90434 9473 26648 15802 11084 25700 11766 9143 4608 12322 50371 25183
21B5183j7389K3439M0932m7008K2613J3949m9528K087j0362J1129J0388M2327
$$ 25183 7794 31233 72165 25157 47770 61719 12191 14278 3916 15045 25433 67760
9F7760j1685j7940l6277M484J7173J0752j3098j6586k875
$$ 67760 56075 38135 1858 6342 23515 34267 21169 4583 1708
0A708
$$ 1708
##PAGE= F1=2773.966454265
##FIRST=     9431.70368901288, 3501.40056022409, 31880
##DATA TABLE= (F2++(Y..Y)), PROFILE
1023C1880J808l0376J1803J3520k1589n27J7681K024j8769J6914j3221M5039j1438
$$ 31880 33688 3312 15115 28635 7046 6519 24200 26224 7455 24369 11148 56187 44749
1010D4749j6136L479l700j8474J1718n094j0424L399J1184L7992k0000l7281J969
$$ 44749 28613 32092 28392 9918 21636 16542 6118 9517 20701 58693 38693 1412 3381
997C381J9188k0399K0209l767K5905J048l2230J2794o909p183Q438O728j3420
$$ 3381 22569 2170 22379 18612 44517 45565 13335 26129 19220 12037 20475 27203 13783
984A3783o34M254j441J2816M8727j0635l5869r333m718O019j1184R835r284J7670
$$ 13783 13149 17403 15962 28778 77505 66870 31001 21668 16950 22969 11785 21620 12336 30006
970C0006j3305P361K3890l1968K353J8149N06j7491K463j156K2264j3234j9883
$$ 30006 16701 24062 47952 15984 18337 36486 36992 19501 21964 20808 43072 29838 9955
957I955Q117L7502l5070p37m816Q715J3656j9231j1361J5355j7247L2242J760
$$ 9955 18072 55574 20504 19767 14951 23666 37322 18091 6730 22085 4838 37080 38840
944C8840L2688m3510k2329M50K4723k0344N758K340R992N218k5163j359J1845
$$ 38840 71528 28018 5689 6139 30862 10518 16276 18616 28608 33826 8663 7304 19149
931A9149j2461n530K1661P993k5780K813L0453j1556j1617K199J2890J3878J9585
$$ 19149 6688 1158 22819 30812 5032 7845 38298 26742 15125 17324 30214 44092 63677
918F3677n3959J8290J1296j8009M3320l4502j3825K2192l4662L3196q199J5886
$$ 63677 9718 28008 39304 21295 64615 30113 16288 38480 3818 37014 28815 44701
906D4701l0569L0033k8728n215j220j049J3534L4719m4066Q931P407O502N899
$$ 44701 14132 44165 15437 10222 9002 7953 21487 56206 12140 21071 28478 34980 40879
893D0879k0250K034j5243J0024q67P916q263J1107M1897m9274J046O775Q922j5480
$$ 40879 20629 22663 7420 17444 16577 24493 16230 27337 69234 19960 21006 27781 36703 21223
879B1223J554r514K35K697M9200j5054o065l3018o242J0957M6975o45l1008O906
$$ 21223 22777 13263 13498 16195 65395 50341 44276 11258 5016 15973 62948 62303 31295 38201
865C8201j7624K5564m875K1861m7274r108J5857n562J8037K5746J0116j2752P390
$$ 38201 20577 46141 41266 63127 15853 6745 22602 17040 35077 60823 70939 58187 65577
852F5577o1330J0981m916L3101N962j0551k8089N794J1933k898N4574o5165p4
$$ 65577 4247 15228 10312 43413 49375 38824 10735 16529 28462 25564 80138 14973 14899
839A4899l436k009Q103L202j5133N0228M1161n3560k8744J1557j3310L5173K2557
$$ 14899 11463 9454 17557 20759 5626 55854 97015 43455 14711 26268 12958 48131 70688
826G0688n8019K6219j7487L2271L140l5011n499K8220p080r269j907p220m434
$$ 70688 12669 38888 21401 53672 56812 21801 16302 44522 37442 28173 26266 19046 14612
813A4612M3249Q863o1524K1535j0354J6252N0267n2654k4473J2429J802P935Q190
$$ 14612 57861 66724 5200 26735 16381 32633 82900 30246 5773 18202 20004 27939 36129
800C6129j6116J7638k5948M606K4680P755k5631n988n597M0942q940k7506K6179
$$ 36129 20013 37651 11703 16309 40989 48744 23113 17125 11528 52470 43530 16024 42203
787D2203K3069j1217l7917o315P5361N4272Q3377N7948L1741l8363m2909j38228
$$ 42203 65272 54055 16138 9823 85184 139456 222833 280781 312522 274159 231250 93022
775I3022Q2613m4366l6228O2792N2767j3916k6696m9971N0250J2167n7650o8968
$$ 93022 175635 131269 95041 157833 210600 196684 169988 120017 170267 182434 124784 55816
763E5816L8798j3073P7644r4475n5665J0927J9486m117k1600J2697j0805J1518
$$ 55816 94614 81541 159185 64710 9045 19972 39458 35341 13741 26438 15633 27151
751B7151j7590R81R389n468n881R826k550n023J743N67n248K6030j9892R153J1337
$$ 27151 9561 10542 19931 14463 8582 18408 15858 10835 12578 13145 7897 33927 14035 23188 34525
736C4525N5547j9666n4381J17l753M893N403R538r639j0604J39J9807j2773j0458
$$ 34525 90072 70406 16025 16142 12389 17282 22685 32223 22584 11980 12119 31926 19153 8695
722H695K4829k1234Q912M233o946r310O968m857J4807l015R48j0287p157K0173
$$ 8695 33524 12290 21202 25435 18489 9179 16147 11290 26097 23082 24030 13743 6586 26759
708B6759k3610J3987J6919j3807J3724O244k559J9619l9708J0596j6387L2385
$$ 26759 3149 17136 34055 20248 33972 40216 37657 57276 17568 28164 11777 44162
696D4162K4153m3430j3214o351N399J2684J4477k3986p774O974M625J9125k1638
$$ 44162 68315 24885 11671 5320 10719 23403 37880 13894 6120 13094 17719 36844 15206
683A5206L8087j8791M311J8859Q178m8643J2094R140k5970Q243P446P14N850J5946
$$ 15206 53293 34502 38813 57672 65850 17207 29301 38441 12471 20714 28160 28874 34724 50670
669E0670J2384l6544M9057k8092j1429k0314M7756p010l5747L5558l6208j0915
$$ 50670 63054 26510 75567 47475 36046 15732 63488 56478 20731 56289 20081 9166
657I166J2911M7517k9062n670j6843J6076j7496J1594j5790Q298j4666J834K6618
$$ 9166 22077 69594 40532 34862 18019 34095 16599 28193 12403 20701 6035 7869 34487
644C4487j3868n245k073K350Q481k2385N5095j4775k9530L4548k4286O4507k6817
$$ 34487 20619 15374 13301 15651 24132 1747 56842 42067 12537 47085 22799 87306 60489
631F0489j6118k7372L367K2480o716j3422o47n118l808o542l983L1199j0447M2907
$$ 60489 44371 16999 20366 42846 36130 22708 22061 16943 13135 6593 2610 33809 23362 66269
617F6269n0295J8752L412M666m505O2160P083j0024m4752Q090K7746k9778J7855
$$ 66269 15974 34726 38138 42804 38299 100459 107542 97518 52766 60856 88602 58824 76679
604G6679l7868N642K955k5199O774L972K235P1538J95582M31979j24204n7507
$$ 76679 38811 44453 47408 22209 28983 32955 35190 106728 302310 734289 610085 552578
592E52578k17192j44247J69055M5472R1986J65573l4693j0880l01540j42309o7264
$$ 552578 335386 191139 360194 405666 497652 663225 628532 617652 316112 173803 106539
581A06539N4290l7033J623m4050R634k3499m3505K6307l1610O2447M5598n689
$$ 106539 160829 123796 125419 81369 91003 67504 23999 50306 18696 81143 126741 121052
569A21052K5001k9634n0795j6794j5009j9888J5776K348K1367l2316K2019n060
$$ 121052 146053 116419 65624 48830 33821 13933 29709 32057 53424 21108 43127 38067
557C8067K3056J3137J749l9903J5511l4430J4401j0321n424K0669k7124m965J1786
$$ 38067 61123 74260 76009 36106 51617 17187 31588 21267 15843 36512 9388 4423 16209
544A6209N257J5037k5707K4478j1760L646O164K911K3747j2151k4937j6971R247
$$ 16209 21466 36503 10796 35274 23514 27160 33324 36235 59982 47831 22894 5923 15170
531A5170K2297k884k9398L2881L6559m5694j0891l067L7559k4506j1084R164R228
$$ 15170 37467 34583 5185 38066 74625 28931 18040 14973 52532 28026 16942 26106 35334
518C5334j6371J0857L182k1803Q217m504o623J3293M7627m0201j3740J941K9721
$$ 35334 18963 29820 33002 11199 19416 14912 8289 21582 69209 29008 15268 17209 46930
505D6930k7451j4602O5490l9071p356j974J5114k8823P496j158n463K2939J1753
$$ 46930 19479 4877 70367 31296 23940 21966 37080 8257 15753 14595 9132 32071 43824
492D3824q629k4243K1669J7406j4285l1921K858L3555j2530K5181j1904j1541
$$ 43824 35195 10952 32621 50027 35742 3821 6679 40234 27704 52885 40981 29440
480B9440O3269o8242o184o875P881J1299j929K358j999j3987j0236L294R864j0389
$$ 29440 92709 24467 18283 11408 19289 30588 28659 31017 29018 15031 4795 8089 17953 7564
466G564R933J1762k0480L025J9955Q400j5893K123j3084L7914j5186J7999l7628
$$ 7564 17497 29259 8779 11804 31759 40159 24266 26389 13305 51219 36033 54032 16404
453A6404l916K9707r777k6108P422m390L0160j3842o367K6076l4277M094K0807
$$ 16404 12488 42195 32418 6310 13732 9342 39502 25660 19293 45369 11092 15186 35993
440C5993J8658m0271K1259O704P034k8879l276L137l728p490R838N711J5305k622
$$ 35993 54651 14380 35639 42343 49377 20498 17222 20359 16631 9141 18979 24690 39995 37373
426C7373k8830R260O406j2958J6168R209j3765r43J4209J3961l6673J5789j1042
$$ 37373 8543 17803 24209 11251 27419 36628 22863 21920 36129 50090 13417 29206 18164
413A8164J453l816j2486M306J311K8017K3937K227m4106K0659j0976J1647k9351
$$ 18164 19617 15801 3315 7621 8932 36949 60886 63113 19007 39666 28690 40337 10986
400A0986J174L754K5534j6581q430J3113j2898j229L1551j7363m201j521O740
$$ 10986 12160 15914 41448 24867 16437 29550 16652 15423 46974 29611 25410 23889 30629
387C0629k0450R748r66J805N668j7825N5225k0886M056q652L3801m7344N7508
$$ 30629 10179 19927 18961 20766 26434 8609 63834 42948 47004 38352 72153 24809 82317
374H2317p0582M7708l5257j4872M3739l5602Q302k608j5049J3388L894n837j7083
$$ 82317 11735 59443 24186 9314 53053 17451 25753 23145 8096 21484 25378 19541 2458
361B458Q973J6594K835n208l703r201M2342K6010l5363k4900j3396J0662R0669
$$ 2458 11431 28025 30860 25652 21949 12748 55090 81100 45737 20837 7441 18103 108772
348A08772j02409N1159m4949P971p841M548K1729l2221K3221k1590K7164J9704
$$ 108772 6363 57522 12573 20544 12703 17251 38980 6759 29980 8390 35554 55258
336E5258m0035L2134M7774n0926j5604L2509j992j6482k3144j6795K4680n517
$$ 55258 15223 47357 95131 44205 28601 61110 59118 42636 19492 2697 27377 21860
324B1860O8406m8827J7180J24783k8685J0012J6706j9022Q5774O3576l9114n3817
$$ 21860 90266 41439 58619 183402 154717 164729 181435 162413 248187 311763 272649 218832
312B18832j2064j66288k0574J8460J03657l4634K7600J2597J23457L12367k43601
$$ 218832 206768 40480 19906 38366 142023 107389 134989 147586 271043 583410 339809
301C39809R6533P8610J5666j04945j8213k1785j39676q1273O5730J98443M1853
$$ 339809 436342 514952 530618 425673 407460 385675 245999 164726 230456 428899 470752
290D70752m9745M13367L71030K96125M50892r72584K2991m12785k11471j89174
$$ 470752 421007 834374 1205404 1501529 1952421 979837 1002828 590043 378572 189398
280A89398J28415M14411K59514R7039j59132Q19660O08738N12612Q63926K44219
$$ 189398 317813 732224 991738 1088777 929645 1749305 2358043 2870655 3734581 3978800
270C978800j565710J81475M08957K93813K89155L53465k336467K635615L575517
$$ 3978800 2413090 2594565 3003522 3297335 3586490 3939955 1603488 4239103 7814620
261G814620P60516N46257n33842n52813j297748k508397k119401m15730J83912
$$ 7814620 8575136 9121393 8587551 8034738 6736990 4228593 2109192 1693462 1877374
252A877374J97067j40344K35763m2604m01987k27809m76756m08673m97914J00942
$$ 1877374 2074441 1934097 2169860 2127256 1725269 1497460 1020704 612031 114117 215059
242B15059j07062m0019J57984k3229J9167j18267Q1832O7450n1058J092k6837
$$ 215059 107997 67978 225962 202733 221900 103633 185465 252915 201857 202949 176112
231A76112N6110m8257o0028j5785O8284J66272J52337K27415Q9575P2993J10115
$$ 176112 232222 183965 123937 108152 176436 342708 495045 722460 812035 885028 995143
220I95143l2604k23263k69949j22562j4575q2118r6996K282498J6794084K6902866
$$ 995143 962539 739276 469327 346765 332190 250072 153076 2435574 19229658 46132524
210D6132524K6286206M6532266L6304420K4774141J3486048m196163l4038269
$$ 46132524 72418730 118950996 155255416 180029557 193515605 189319442 155281173
203A55281173l6543724l4043071m4794432j8092825j1216365r525398q92071K12383
$$ 155281173 118737449 84694378 39899946 21807121 10590756 1065358 173287 385670
195C85670P1807K6562o556j07307j05917k4007L7796j6535m377N0276J75K0892
$$ 385670 457477 484039 477483 370176 264259 240252 278048 261513 257136 307412 307587 328479
183C28479j00108p6885o8590K0866L6390L9124p6348j437N567P2040P7068J821
$$ 328479 228371 151486 82896 103762 140152 179276 102928 101491 107058 179098 256166 257987
171B57987r3308N3768p571k2960m7276l7211p2097Q6736o1517j4505M0138l5432
$$ 257987 164679 218447 210876 187916 140640 103429 31332 118068 56551 42046 82184 46752
159D6752P8666k2554l1355m3849M7972j4030J31393p7906J0281J470J4290o8313
$$ 46752 125418 102864 71509 27660 75632 61602 192995 115089 125370 126840 141130 72817
147G2817k7749L788j5767q991K165O108L1802l0305O9326o4282K0700K7793l2449
$$ 72817 45068 48856 33089 24098 26263 32371 64173 33868 103194 38912 59612 87405 54956
134E4956k3610j3645L035j7553K6093Q198l6263J5563o376P543J2514j6620J4449
$$ 54956 31346 17701 20736 3183 29276 37474 1211 16774 10398 17941 30455 13835 28284
121B8284o493M456M415Q378J859l436k3733L2513K376j1756j140n099k673P2949
$$ 28284 21791 26247 30662 39040 40899 37463 13730 46243 48619 36863 35723 30624 27951 100900
107A00900p1224j1019J1046J3647l0695m39K2499j0611K0498j3091j6820l960
$$ 100900 29676 18657 29703 43350 12655 12216 34715 24104 44602 31511 14691 10731
95A0731J3889J0518j9842J9178L0756J5061p958m8451k613j320j1504j263J1268
$$ 10731 24620 35138 15296 34474 65230 80291 72333 23882 21269 19949 8445 7182 18450
82A8450n864j326K0269n689M617N310N1491o0905j5974L729K1383k0372O6100
$$ 18450 12586 11260 31529 25840 30457 35767 87258 26353 10379 14108 35491 15119 81219
69H1219k4747l2688r962R14Q040m705n132R985J5607M505k1161R3j2913O269J281
$$ 81219 56472 23784 13822 14736 22776 18071 12939 22924 38531 43036 21875 21968 9055 15324 16605
54A6605N383J3099p640J813M426k145k6565P789P003N977r897m394o305J934K9175
$$ 16605 21988 35087 27447 29260 33686 31541 4976 12765 19768 25745 15848 11454 5149 7083 36258
39C6258J8977l0115m898P336L4575N1521j9900q3987J9266j1679o874J6432q714
$$ 36258 55235 25120 20222 27558 62133 113654 93754 9767 29033 17354 10480 26912 18198
26A8198r284l612P704L7995k7221j7646K5182M3735m9802K0316J7914n1057K984
$$ 18198 8914 5302 13006 51001 23780 6134 31316 75051 25249 45565 63479 12422 15406
13A5406j1861J1300J0733M5338j3884j9343l5191K270J7328J1207j2066j7362
$$ 15406 3545 14845 25578 70916 57032 37689 2498 4768 22096 33303 21237 3875
1C875l187
$$ 3875 688
0F88
##PAGE= F1=2764.132278143
##FIRST=     9431.70368901288, 3501.40056022409, 31901
##DATA TABLE= (F2++(Y..Y)), PROFILE
1023C1901J124k9727J0789J4239k0058j969J8212n52j5960J6165p312L2454k942
$$ 31901 33025 3298 14087 28326 8268 6299 24511 23959 7999 24164 16852 49306 46364
1010D6364j7934M943o258j7675J3467o210r950K357J2200M1409k4006l6439M76
$$ 46364 28430 33373 27115 9440 22907 16697 6747 9104 21304 62713 38707 2268 2744
997B744J8402j7768K1090m925K4945L732l4240J1368o479p072Q230O941j2064
$$ 2744 21146 3378 24468 19543 44488 48220 13980 25348 18869 11797 20027 26968 14904
984A4904k816M472K59J1452M0577m059l2845j1033k673L795j0758R428r079J7345
$$ 14904 12088 16560 16819 28271 68848 64789 31944 20911 18238 22033 11275 20703 11624 28969
970B8969j2707P809K6102l3069J627J9528j440j8779P17J153K0299j0098j7534
$$ 28969 16262 24071 50173 17104 18731 38259 36819 18040 18757 19910 40209 30111 12577
957A2577P045L6189l4160l825l494R628J2534j9114r091J5275j8535L3353o1M0598
$$ 12577 19622 55811 21651 17826 14332 23960 36494 17380 8289 23564 5029 38382 38321 78919
943G8919n1483k0758n16K7720k2923N053L729Q253M220k4259O26J1325j4417m790
$$ 78919 27436 6678 6162 33882 10959 16012 19741 27994 32214 7955 8581 19906 5489 699
929F99K2436P832k6236K677K9565j0495j1453O395J2365Q422K1900n5408J8110
$$ 699 23135 30967 4731 7408 36973 26478 15025 21420 33785 42207 64107 8699 26809
916B6809J1640j6602M1463l3847j4492K1981l2224L1854p607J4165k9029L1502
$$ 26809 38449 21847 63310 29463 14971 36952 4728 36582 28975 43140 14111 45613
904D5613l0276n339l298O84J3925L1114m3837J2519O430O836O500j8215j233j3196
$$ 45613 15337 9998 6700 7384 21309 52423 8586 21105 27535 34371 40871 22656 21423 8227
890H227J0944k451O950p558J3936L8267m8374J84Q165Q739j4979M75p396m815
$$ 8227 19171 16720 23670 16112 30048 68315 19941 20125 28290 37029 22050 22525 15129 10314
876A0314N633N6638k0661o566l3426n775J1049M9395p698k8468R412j7692K3556
$$ 10314 15947 72585 51924 45358 11932 6157 17206 66601 58903 30435 39847 22155 45711
863D5711m016K1049m8537q366J7646m922K2146K7169j600j4447P556n5218J0295
$$ 45711 41695 62744 14207 5841 23487 18565 40711 67880 66280 51833 59389 4171 14466
850A4466m418L3679O537j1906k7750N699J3159k912N1944o2595K034p434k47P451
$$ 14466 10048 43727 50264 38358 10608 16307 29466 26554 78498 15903 17937 10503 10256 17707
836A7707k057j0760M8908M1453m7104l1096R444j3012L0460K3968n4781K4582
$$ 17707 15650 4890 53798 95251 48147 17051 26495 13483 43943 67911 13130 37712
824C7712j6573L4721K248l5496n831L1154q614j3803J94o587l046M6345M034n9580
$$ 37712 21139 55860 58108 22612 16781 47935 39321 25518 25712 19125 16079 62424 66458 6878
810F878J7289q220J6839M7876n0388k5140J7148k022J0318N546j6020J8232k6646
$$ 6878 24167 15947 32786 80662 30274 5134 22282 20260 30578 36124 20104 38336 11690
797A1690K467K7209O280k5255p407n428L9719l567l1225K4564K7150n528m3385
$$ 11690 14157 41366 47646 22391 14984 9556 49275 45708 14483 39047 66197 60669 17284
784A7284j1417P8337M9517R7001L1249M8366l2475n2825j38173Q6406m1764m4991
$$ 17284 5867 84204 133721 230722 261971 310337 277862 225037 86864 173270 131506 86515
772H6515N9284N5767j0631k4870m4129N1930m631m3573p0649M0051j7842P0240
$$ 86515 145799 201566 190935 166065 121936 173866 169235 125662 55013 95064 77222 147462
760A47462q4900n2912Q925J8102l294j6739J0412j0876J0792j8043J562R226n002
$$ 147462 62562 9650 18575 36677 33383 16644 27056 16180 26972 8929 10491 19717 14715
747A4715n723J0309m815m370K204J207o14K3721k3248J0518Q997N5056j6886n3954
$$ 14715 8992 19301 14486 10116 12320 13527 12913 36634 13386 23904 32901 87957 71071 17117
733A7117k181k339K738N746J2071j0018j1605L26J9547j2844q092K2469k0837
$$ 17117 14936 12597 15335 21081 33152 23134 11529 11855 31402 18558 10466 32935 12098
720A2098Q158M740o935r438P266m408J5559j597j731r951q513K1571k3063J3880
$$ 12098 20256 24996 18061 8623 15889 11481 27040 25443 23712 13761 5248 26819 3756 17636
706A7636J7470j3845J3843L695JJ9382m1601J0894j4612L9694K1653m6783j4059
$$ 17636 35106 21261 35104 38799 38800 58182 16581 27475 12863 52557 74210 27427 13368
693A3368p125K708J5712J3231k4119q169O741O196J7044k1744L9887j6911K439
$$ 13368 6243 8951 24663 37894 13775 5606 12347 18543 35587 13843 53730 36819 39258
680C9258J4159J3915m9824J0904P527k5516J0391O808j116R306J8820J0745l2898
$$ 39258 53417 67332 17508 28412 35939 10423 20814 27622 26506 35812 54632 65377 32479
667C2479L6937k7970n213k0388L9956l829l2568L4482l3692j2680J4712M7326
$$ 32479 69416 41446 36233 15845 55801 51972 19404 53886 20194 7514 22226 69552
655F9552k5826p508k0470J4186j2666R200j0654M937j5138J858K8586j2729q655
$$ 69552 43726 36218 15748 29934 17268 26468 15814 20751 5613 7471 36057 23328 14673
642A4673j868K763R099k2003N3465j2558l0623L6515k9790O7047k1774j6619k9982
$$ 14673 12805 15568 24667 2664 56129 43571 12948 49463 19673 86720 64946 48327 18345
629A8345L259K8738j1305j7855J253n708k380j0749n29K9585j2020L8312n0274
$$ 18345 21604 50342 39037 21182 22435 16727 14347 3598 3069 32654 20634 58946 8672
616H672K5888L706M295q234O4612N993q273m6313R967K7448k6566J8174m0451
$$ 8672 34560 38266 42561 34327 98939 104932 96659 50346 60313 87761 61195 79369 38918
603C8918P416M032k6619M939N239K258P9636K21739M65989j39133n8814k46142
$$ 38918 46334 50366 23747 28686 33925 36183 115819 337558 803547 664414 605600 359458
591C59458k21415K04132N9541J34850K00519l9255j2816l42423j58721p3373N8587
$$ 359458 138043 342175 401716 536566 737085 697830 685014 342591 183870 110497 169084
580A69084m0563q389m1613P147k4335l8667K4998k9622O0125M5293l079K5271
$$ 169084 128521 120132 78519 85666 61331 22664 47662 18040 78165 123458 120379 145650
568A45650l1930n0143j5700j6380j8305J8359l14J6891k6965K1519p592K3945
$$ 145650 113720 63577 47877 31497 13192 31551 31237 48128 21163 42682 35090 59035
556E9035R030N798m1452J7255l2563J3065j5060l39K1493k3290q747J2661N348
$$ 59035 68065 73863 32411 49666 17103 30168 15108 14769 36262 12972 4225 16886 22234
543B2234J2312k8621K7336q814K863N723M369K0457l308k5585k2206Q149K3009
$$ 22234 34546 5925 33261 24447 27310 33033 37402 57859 54551 28966 6760 14909 37918
530C7918l662k9718L5117M3014n0191j4424l692L7295k3295j1438R658J1934j7877
$$ 37918 34256 4538 39655 82669 32478 18054 14362 51657 28362 16924 26582 38516 20639
517B0639J0023K975k2124P570k092r294J6270L9291l5481j2164M654K7270k6536
$$ 20639 30662 33637 11513 19083 16991 7697 23967 63258 27777 15613 20267 47537 21001
504B1001j3012O3644m1232p538m71J6328l2641J1670k983n188K2606J5546j2909
$$ 21001 7989 71633 30401 22863 22392 38720 6079 17749 14766 9578 32184 47730 34821
491C4821k4309K4032K4034k1036l3610L518L2752j1985K5805r234j3519O1364
$$ 34821 10512 34544 58578 37542 3932 7450 40202 28217 54022 44788 31269 92633
479I2633o7815o319o753Q422Q968k183L782K94j5581j0414K865J0467j0033J0528
$$ 92633 24818 18499 11746 20168 29136 26953 30735 31029 15448 5034 7899 18366 8333 18861
465A8861J0915k1645N073J8180R790j5068j135j1592L4453j3807K1698l7923n340
$$ 18861 29776 8131 13204 31384 41174 26106 24971 13379 47832 34025 55723 17800 12460
452A2460L1850j0990k7317O945m146L3698j5532o474K7326l6990N369K0263J9413
$$ 12460 44310 33320 6003 12948 8802 42500 26968 20494 47820 10830 16199 36462 55875
439E5875m1873K0847M521P839k9096p19N192o115o964R814N731J3736K969l2706
$$ 55875 14002 34849 39370 47209 18113 17394 22586 16471 9507 19321 25052 38788 41757 9051
425I051Q614P984j3956J4516J0389j4821q90J5021J2635l5116J3204n858L289
$$ 9051 17665 25649 11693 26209 36598 21777 20887 35908 48543 13427 26631 20773 24062
412B4062o400j3593L870J431K8006K8171L055n0445J9724q073Q377k7054P32L557
$$ 24062 17662 4069 7939 9370 37376 65547 68602 18157 37881 29808 38185 11131 11863 15420
398A5420K5002j4797r517J2579j1965N49K9895j6405n245j152N183j8374Q862
$$ 15420 40422 25625 16108 28687 16722 17271 47166 30761 25516 24364 29547 11173 20035
385B0035J360k727Q613j8530N5855k1628N123j1117L7835n1710O2799p4482M8270
$$ 20035 21395 18668 27281 8751 64606 42978 48101 36984 74819 23109 85908 11426 59696
372E9696l6287j4338M2085l2986N826J92j6137J3652J102n610j3506Q280J6318
$$ 59696 23409 9071 51156 18170 23996 24188 8051 21703 22805 17195 3689 11969 28287
359B8287O935r708l860r567M2289L2133m0557k3770j5266J1846Q5443r7519M1790
$$ 28287 35222 25514 21654 12087 54376 86509 45952 22182 6916 18762 104205 6686 48476
346D8476l6244P191p943O818J9063l1055K3305k2278K8567K0708m0927L1395N2012
$$ 48476 12232 19423 11480 18298 37361 6306 29611 7333 35900 56608 15681 47076 99088
333I9088m8070k3888L2716R6j5298k5449j7790K7770q681O9121m7392J6086J28819
$$ 99088 51018 27130 59846 59942 44644 19195 1405 29175 20494 89615 42223 58309 187128
320A87128l3065P315J5082k1557Q6834O6899l9614n6082j2655j62395k2511J9823
$$ 187128 154063 161378 176460 154903 241737 308636 269022 212940 200285 37890 15379 35202
308C5202R8409l9501K2699J0981J29383L27205k42412R2462P4279J8504j07152
$$ 35202 133611 94110 116809 127790 257173 584378 341966 434428 508707 527211 420059
297D20059n3319l2900j43594o0186Q6124J94195N3347n9937K75026L28565K47441
$$ 420059 366740 333840 190246 130060 216184 410379 463726 403789 678815 1007380 1254821
286A254821M52115q97993J2492l19506j56961j64671J24011L73619K56650P3837
$$ 1254821 1706936 808943 821435 501929 344968 180297 304308 677927 934577 1008414
276A008414j38738P58285N57500N10709Q73074K38030j656514J59920K44879J91206
$$ 1008414 869676 1627961 2185461 2696170 3569244 3807274 2150760 2310680 2555559 2746765
266B746765K29887L92200k059022K657403L553234R11213M58198o56066o27181
$$ 2746765 2976652 3368852 1309830 3967233 7520467 8431680 8889878 8233812 7606631
257G606631j297037k413225j976450l33228K26412K36736j46950K50145o1500
$$ 7606631 6309594 3896369 1919919 1586691 1813103 2049839 1902889 2153034 2091534
248B091534m14405k21565m71648m16384m71400J01655r2302l8711J54430j9423
$$ 2091534 1677129 1455564 983916 567532 96132 197787 105485 66774 221204 201781
238B01781P571j16216Q8394P8368n4432Q906l2748N3869m5631n1342M88P8247
$$ 201781 209352 93136 181530 259898 205466 214372 181624 235493 189862 138520 139008 217255
226B17255J50409J42902K15588R3867O5988J12923k5750j99078k95382j22163
$$ 217255 367664 510566 726154 820021 886009 998932 973182 774104 478722 356559
216C56559r029q4953j20601K146260J5437958K4181554K3020092M1149344L1689304
$$ 356559 347530 262577 141976 2288236 17726194 41907748 64927840 106077184 137766488
207A37766488K2548197J2215198l352994l0218564l2084870l0243327m0478600
$$ 137766488 160314685 172529883 169176889 138958325 106873455 76630128 36151528
200C6151528j6311465j0029630q804450q26238J91049Q4001L4443p024j14473
$$ 36151528 19840063 9810433 1005983 179745 370794 454795 489238 482214 367741
191C67741r6741j4342K9559k5349k2882N3932K671L0411r6916p1675p2338K0516
$$ 367741 271000 256658 286217 260868 237986 291918 294589 325000 228084 156409 84071 104587
179A04587K7425L1942p2644J796R001P4912Q0255N547r4419O1916m694j7992m9474
$$ 104587 132012 163954 91310 93106 102107 177019 257274 262821 168402 230318 225624 207632 158158
166A58158l7609q3559R4762o8879j9890M1977l8853P8950k4672l2385m3083N2470
$$ 158158 120549 36990 131752 62873 42983 84960 46107 125057 100385 68000 24917 77387
154G7387j6742J40703q0936j022R274K1002p8496k6121K562j4305p258J209N619
$$ 77387 60645 201348 120412 119390 128664 149666 71170 45049 47611 33306 26048 27257 32876
141C2876L3661l0419O6740o4105K0754K3737l6529j3429j4905L022j6302K2790
$$ 32876 66537 36118 102858 38753 59507 83244 46715 33286 18381 21403 5101 27891
129B7891J2215l9002J3923m505O223J2344j6850J6635r119P699N316O315J81l421
$$ 27891 40106 1104 15027 10522 16745 29089 12239 28874 19755 27454 32770 39085 39266 35845
115C5845k2214L3028l991n906m643j123J464P2357p5091j0101J0824J1777l2534
$$ 35845 13631 46659 42668 36762 32119 30996 32460 104817 29726 19625 30449 42226 9692
102I692J676K4380j1942K0385j2682j5713m659J3983J0629j9994J8849K8251J7543
$$ 9692 11368 35748 23806 44191 31509 15796 11137 25120 35749 15755 34604 62855 80398
89H0398j5436m5128O51p27j4295j180J3587m046k840J9999n200O091L936N0508
$$ 80398 64962 19834 20485 19758 5463 4283 17870 13824 10984 30983 25783 31874 35810 86318
75H6318o1265j4234K730J9629j3493O2203k5884l3403r018J037N768k446l642
$$ 86318 25053 10819 13549 33178 19685 81888 56004 22601 13583 14620 20388 17942 14300
62A4300L517K2307J196k1240K142j4138J0463m93M446J3123r692L780K867p86
$$ 14300 17817 40124 41320 20080 22222 8084 18547 18054 22500 35623 25931 29711 32578 31792
48C1792k5127O463O154N445r158o703k083n5K7544J8071l1737n44J0383L3752
$$ 31792 6665 13128 19282 24727 15569 8866 6783 6728 34272 52343 20606 20062 30445 64197
34F4197N1368j9442q6029K1290j2476q786J8121l123j6200k992P491L8001k9000
$$ 64197 115565 96123 10094 31384 18908 10122 28243 25120 8920 5928 13419 51420 22420
21B2420j7778K6758M6162n2276J8071K1221n1942L775j3208J1776J0722M7856
$$ 22420 4642 31400 77562 25286 43357 64578 12636 16411 3203 14979 25701 73557
9G3557j6283k0410l3740R8J7510J1590j0996j7697l218
$$ 73557 57274 36864 3124 3222 20732 32322 21326 3629 411
0D11
##PAGE= F1=2754.298102021
##FIRST=     9431.70368901288, 3501.40056022409, 31631
##DATA TABLE= (F2++(Y..Y)), PROFILE
1023C1631M23k8805R757J4830j8338l357J8611l175j2992J5306j444K0166N265
$$ 31631 32054 3249 13006 27836 9498 6141 24752 21577 8585 23891 22447 42613 47878
1010D7878j9540O384q842j6862J5213p321r566J446J3076M4593k7731l4773j768
$$ 47878 28338 34722 25880 9018 24231 16910 7344 8790 21866 66459 38728 3955 2187
997B187J7746j1186J7860o310K3938O561l5993R727o088o694P975O896j0671m974
$$ 2187 19933 8747 26607 20297 44235 50796 14803 24530 18442 11748 19723 26619 15948 10974
983A0974M696K008J0014L2275K416k9495j2658o52J737j0474Q864q705J6870j2055
$$ 10974 15670 17678 27692 59967 62383 32888 20230 19578 21315 10841 19705 11000 27870 15815
969A5815Q209K8203l4198J116K0646l425j9813q12L310J8353p016j4603N375L4605
$$ 15815 24024 52227 18029 19145 39791 36366 16553 15741 19051 37404 30388 15785 21160 55765
955E5765l3065o728k130J0422J1294j8698o327J4482j9730L4189j972M8270n8825
$$ 55765 22700 15972 13842 24264 35558 16860 10533 25015 5285 39474 37502 85772 26947
942B6947j9358j073L0576k5281L976N368O834L068k3834K649J1054j6281l394
$$ 26947 7589 6516 37092 11811 15787 21155 27989 31057 7223 9872 20926 4645 1251
929A251K2261P673k6713K519K8372r255j1227J1168J1590K686K4195n6801J7658
$$ 1251 23512 31185 4472 6991 35363 26108 14881 26049 37639 40325 64520 7719 25377
916B5377J1739j4725L8967l2983j5071K1778k9387L0275p017J2650k7637L3076
$$ 25377 37116 22391 61358 28375 13304 35082 5695 35970 28953 41603 13966 47042
904D7042l1812n384m423J302J4339K7760m2549J4920N560P000P029j6053m426
$$ 47042 15230 9846 5423 6725 21064 48824 6275 21195 26755 33755 40784 24731 20305
891B0305j1190J1861l771N389o654J6999L4628m7680n85R673Q376j4398n59n529
$$ 20305 9115 20976 17205 22594 15940 32939 67567 19887 19302 28975 37351 22953 22394 16865
877A6865r342Q305O3689k6154o992l3650n356J1252N0983j4318k5670J2061j8078
$$ 16865 7523 15828 79517 53363 46371 12721 7365 18617 69600 55282 29612 41673 23595
864B3595K1598l119J9427m8908p505J9251l622K5968K8396j3506j5706O927m8706
$$ 23595 45193 42074 61501 12593 5088 24339 20717 46685 75081 61575 45869 52796 4090
851D090R653l902L3817P197j3181k7273N660J4214k771M8654n9182M284j1901
$$ 4090 13743 9841 43658 50855 37674 10401 16061 30275 27504 76158 16976 21260 9359
838I359J631O908o798n730M6372M1238l9904l3743P216j2206K5658K4627n1033
$$ 9359 10990 17898 11100 5370 51742 92980 53076 19333 26549 14343 40001 64628 13595
825A3595K2892j5633L7048J156l5493o266L4339j0317j8272K086o052j305N0038
$$ 13595 36487 20854 57902 59058 23565 17299 51638 41321 23049 25135 19083 17778 67816
812F7816j835n7592J2960n933J7461M4956m7166k6052K1378n499J2475L215j5961
$$ 67816 65981 8389 21349 15416 32877 77833 30667 4615 25993 20494 32969 36184 20223
799B0223J9178k6670q69K9850M933k4577r167n227L8258J810l3396K1832L1302
$$ 20223 39401 12731 11862 41712 46645 22068 12901 7674 45932 47742 14346 36178 67480
786F7480L75m8850j5436P9727M5089J09385M787O4967k3844o2242j38936Q9192
$$ 67480 67855 19005 3569 83296 128385 237770 242557 307524 283680 221438 82502 171694
774A71694l8961n1128N5039N7829q398k4642l8376N2870k0562k9563p1819M0792
$$ 171694 132733 81605 136644 194473 186075 161433 123057 175927 155365 125802 53983 94775
762I4775k2315O2390p4671m9947P581J6251k662j1740Q513j1416R889j8314K081
$$ 94775 72460 134850 60179 10232 17813 34064 31402 19662 28175 16759 26648 8334 10415
749A0415R053m465m424R548o882l488K390J828M576K0946k6709J1822O466N4281
$$ 10415 19468 15003 10579 20127 13245 9757 12147 13975 18551 39497 12788 24610 31076 85357
735H5357j3650n3356m687p86J014N680J4405j0202j2565N13J9133j2969n562J9918
$$ 85357 71707 18351 13664 12878 13892 19572 33977 23775 11210 11723 30856 17887 12325 32243
721C2243k0088P664M923o801r614P326l906J6439n48m202r771r652K2661k2392
$$ 32243 12155 19819 24742 17941 8327 15653 11747 28186 27638 23436 13665 4013 26674 4282
707D282J3987J7862j4021J4049J130K569J8714m2975J1121j2699M6442J9119m9420
$$ 4282 18269 36131 22110 36159 37289 39858 58572 15597 26718 14019 60461 79580 30160
694C0160j5055p933M6J8550J1952k3920q632O579P672J4841k1949M1304j4403
$$ 30160 15105 7172 7218 25768 37720 13800 5168 11747 19419 34260 12311 53615 39212
681C9212N00R617J9375n0895R687N980k4460J1930O262k985J2707K1383Q766k8210
$$ 39212 39712 49329 68704 17809 27496 33476 9016 20946 27208 24223 36930 58313 67079 38869
667C8869K4995k8769J259k0184L2699j319k9773L3325l0854j3877J6455M6010
$$ 38869 63864 35095 36354 16170 48869 47550 17777 51102 20248 6371 22826 68836
655F8836k2125r463k2700J1383p911O589n110J261j5497J816L0439j1655j1824
$$ 68836 46711 37248 14548 25931 18020 24609 19499 20760 5263 7079 37518 25863 14039
642A4039j802L223R517k1238N1322j0058l1687L8446l5246O8830j5823j7099l2729
$$ 14039 12237 15460 24977 3739 55061 45003 13316 51762 16516 85346 69523 52424 19695
629A9695L068L4804j5777k2112L089o070q27j4431K339K7772j3603L4093n0487
$$ 19695 22763 57567 41790 19678 22767 16697 15870 1439 3778 31550 17947 52040 1553
616A553L3339L777L959j1627O6709N282p056m7549J0869K7737k3576J8072m2848
$$ 1553 34892 38669 42628 31001 97710 102992 95936 48387 59256 86993 63417 81489 38641
603C8641R464N238k7973K926O467K353Q8409K46311M94387j46432m7411k61742
$$ 38641 48105 53343 25370 28296 34763 37116 125525 371836 866223 719791 672380 410638
591D10638l29006K29661P5642J80935K35588l5805j2732l84400j74605q1012O2150
$$ 410638 81632 311293 386935 567870 803458 767653 754921 370521 195916 114904 177054
580A77054m3284j7720l9847L983k5580l2589K2752k6388N7441M4928o03K5243
$$ 177054 133770 116050 76203 80186 54606 22017 44769 18381 75822 120750 120147 145390
568A45390l4001m9199j4671j7419j7068K0550k875J2225k1590K0909j0304K4873
$$ 145390 111389 62190 47519 30100 13032 33582 30707 42932 21342 42251 31947 56820
556E6820N179R676m2104J8065l0625J1832j9773M750K2138j9470j2484J3492N411
$$ 56820 61999 71675 29571 47636 17011 28843 9070 13820 35958 16488 4004 17496 22907
543B2907R493l0839L0182o098J944N104N707J6828O257k5153k8682O802K3709
$$ 22907 32400 1561 31743 25645 27589 32693 38400 55228 61485 36332 7650 14452 38161
530C8161m383k9339L6785M9719n4967j8069m072L6874k2101j1723J0125J4951
$$ 38161 33778 4439 41224 90943 35976 17907 13835 50709 28608 16885 27010 41961
518D1961j8941Q454K652k2125O803N78j2339J9549L0353l0300j0631P240K4334
$$ 41961 23020 31474 34126 12001 18804 19382 7043 26592 56945 26645 16014 23254 47588
505D7588k5050j0657O0930m3282p774R22J7744l6324J5616m777m976K2483J9583
$$ 47588 22538 11881 72811 29529 21755 22677 40421 4097 19713 14936 9960 32443 52026
492E2026j7630k4240K6224L0581k7655l5180M146L1627j1051K5861o146j5203
$$ 52026 34396 10156 36380 66961 39306 4126 8272 39899 28848 54709 48563 33360
480C3360N9031o7318o325o672Q920O615k694N471K635j7287j0382K362J0972r652
$$ 33360 92391 25073 18748 12076 20996 27611 24917 30388 33023 15736 5354 7716 18688 9036
466I036J1539J0074k3136P072J6270J0904j3312m307j0716L0963j2714K5413l7645
$$ 9036 20575 30649 7513 14585 30855 41759 28447 24140 13424 44387 31673 57086 19441
453A9441p111L3972j2293k8091O098l438L7042j7071o851K8523l9626O612J9899
$$ 19441 12330 46302 34009 5918 12016 8578 45620 28549 21698 50221 10595 17207 37106
440C7106J9572m3094K0501K372Q393k8964J767P285q390o607R816N736J2050Q678
$$ 37106 56678 13584 34085 36457 44850 15886 17653 24938 16548 9941 19757 25493 37543 46221
426D6221l6668Q044R496j5028J3184J1416j6460k54J5693J1145l3406J0659p83
$$ 46221 9553 17597 27093 12065 25249 36665 20205 19951 35644 46789 13383 24042 23259
413B3259N874r392j4964L654J374K7672L2500M143n6840J8791n214N271k4274
$$ 23259 29133 19741 4777 8431 9805 37477 69977 74120 17280 36071 30857 36128 11854
400A1854J75K872K4506j2984j0537J1783j0929K358K7928j5169o181l82K931j6108
$$ 11854 12029 14901 39407 26423 15886 27669 16740 19098 47026 31857 25676 25294 28225 12117
386A2117P950L886p598J1586j9153N6228k2121O071j3370M1074n4933O6994p7530
$$ 12117 20067 23953 16355 27941 8788 65016 42895 48966 35596 76670 21737 88731 11201
373A1201M8385l6959j3806M0156l0081L127L240j7260J3934j689n152j0153P549
$$ 11201 59586 22627 8821 48977 18896 22023 25263 8003 21937 20248 15096 4943 12492
360A2492J6028J1633j4927l969r719M1940L7887m5423k2299j6534J2180P9619
$$ 12492 28520 40153 25226 21257 11538 53478 91365 45942 23643 7109 19289 98908
348I8908r1486L2302k7869O457p942Q823J6530k9817K3258k2770K9745K1671m1530
$$ 98908 7422 39724 11855 18312 10370 19193 35723 5906 29164 6394 36139 57810 16280
335A6280K9859N5241m3335l2361L2192K504j3727k7817j5301K7389j1646O8696
$$ 16280 46139 101380 58045 25684 57876 60380 46653 18836 3535 30924 19278 87974
323H7974m4280J4088J31303l6106N049J3553k4971Q7489O9762l9719n8126j3330
$$ 87974 43694 57782 189085 152979 158028 171581 146610 234099 303861 264142 206016 192686
311A92686j57990k4974K2115R3292m3452J6611R992J34647L37242k36421Q8981
$$ 192686 34696 9722 31837 125129 81677 98288 108280 242927 580169 343748 432729
300D32729P2715K5295j03258q4122m2095j53465n8079J06771J93427O3982n9739
$$ 432729 505444 530739 427481 343359 301264 147799 89720 196491 389918 453900 394161
289C94161J30437K92760K08100M31881p96917j4616k34835j05158j34287J18685
$$ 394161 524598 817358 1025458 1457339 660422 645806 410971 305813 171526 290211
279B90211L28369K50012N2224j15232O88023N00740N06213Q71634K31871j721752
$$ 290211 618580 868592 920816 805584 1493607 1994347 2500560 3372194 3604065 1882313
269A882313J30366J04332J01885J68816M07253j756433K622824L471335J044504
$$ 1882313 2012679 2117011 2218896 2387712 2794965 1038532 3661356 7132691 8177195
260H177195L61404p65572o87901j277934k284833j808833k53037K61144K69073
$$ 8177195 8538599 7773027 7085126 5807192 3522359 1713526 1460489 1721633 1990706
251A990706j49617K59917p8966m18626k12713m57639m18612m35361J02666p7913
$$ 1990706 1841089 2101006 2022040 1603414 1390701 933062 514450 79089 181755 103842
241A03842l7581J48578j5710m335j11982R4065Q8617n7054J7875l9151N1948m3539
$$ 103842 66261 214839 199129 194794 82812 176877 265494 208440 226315 187164 239112 195573
229A95573m2838J5088R4052J40103J34791J99280R7166N6736J15456j9637j78138
$$ 195573 152735 167823 261875 401978 536769 736049 833215 889951 1005407 985770 807632
$$ [...]
##END NTUPLES=nD NMR SPECTRUM
##END=
